{"text_format":"1","workbook":"xlsx","n_sheets":5,"sheets":["Revision History","DbmAuditEvents","WIFI Audit Trail Data","DbmAuditData List","Audit Update Process"],"not_rendered":{"charts":0,"images":0,"macros":1,"external_links":2,"defined_names":4,"comments":1,"pivot_tables":0},"unopened":[],"bounds":{"document_bytes":16777216,"sheet_cells":100000,"rows_first":2000,"rows_last":500,"rows_between":2000,"halvings":0,"cell_chars":16384,"cell_head_chars":4096},"cells_cut":0,"cells_raw":0,"read":"whole","date_system":"1900"}

{"sheet":"Revision History","index":0,"n_rows":91,"n_cols":3,"rows_kept":91,"cut":false,"hidden":false,"merged":[[0,0,0,2]]}
["Revision History"]
["Date","By","Description"]
["2015-12-02","RRayburn ","Moved audit tabs to here from EngageLock_StateTable_UIMatrix.xlsx, previous named Swordfish_EngineeringRequirements.xlsx"]
["2015-12-11","Tsmall","Add Wi-Fi Download Event 0x0B0D"]
["2016-01-22","Tsmall","RDR_FALSE_DETECT On Sheet DbmAuditEvents - changed data from none to Number of occurrences"]
["2016-03-16","TSmall","Add Dead Bolt, Latch Bolt, IPB audits"]
["2016-04-19","Jeverson","Add Privacy Mode audits"]
["2016-04-22","TAnfield","Add reserved audit block for Alliance Partner usage"]
["2016-05-06","RRayburn ","Added 0x0600::0x0004 New User Limit Reached audit…wording approved by TAnfield via email"]
["2016-05-31","TAnfield","Added 0x0E01 Reset Diagnostics"]
["2016-08-25","DPfunder","Added 0x070C - 0x0710 - Exit Device Dogging Audits.\nAdded Supported Column For VDE in Events Tab\nAdded  0x0711 - DPS_NO_LATCH_EXT  for Marlin Per JEverson Content"]
["2017-01-23","DPfunder","Added Temp Sensor, Light Sensor, and RX to LX Failure Audits for RMRU"]
["2017-01-25","TAnfield","Fix names of MOTOR_TRANSITION_FAILURE and RX_LX_FAILURE\nAdded Parser Ignored Data, Auto Unlock and Holiday Triggered Events, and Audits lost due to overrun Audits"]
["2017-01-27","DPfunder","Removed DOG, DOG_ON_NEXT_EXIT, and UNDOG from Lock/Switch state Audit section and replaced with DOG_ON_NEXT_EXIT and FREEZE_DOG_ON_NEXT_EXIT within Credential block (0x0519, 0x0520).  Audits listed as 0x07C through 0x0711 have been shifted up three spots (These are all Argos Items)."]
["2017-03-01","DPfunder","Added REMOTE_LOCKDOWN and REMOTE_LOCKDOWN_CLEAR server commands to the Credential section.   Indicated Argos support for Passage, secured, freeze_passage, and freeze_secured"]
["2017-04-04","DPfunder","Updated Argos Support Column"]
["2017-04-20","DPfunder","Updated Argos Support Colunn - Removed D01, 401:16-18, Clarification of 900:11.  Added support for 401:15 per ENGAGE standard"]
["2017-05-07","Tsmall","Add REL Switch - Still needs added to List"]
["2017-05-16","JEverson","Added Reader current and Powered output current audits for CTE"]
["2017-06-13","JEverson","Added No Tour reader audits for CTE and Reader Tamper"]
["2017-06-16","JEverson","Added audits for AUX and ALARM relay status and current fault for CTE"]
["2017-07-06","Tsmall","Add REN Switch, LockState Override Aux Relay Enable and LockState Override Aux Relay Diable for CTE"]
["2017-07-12","Jeverson/Dpfunder","FREEZE_DOG_ON_NEXT_EXIT audit changed from 0x0520 to 0x051A"]
["2017-07-14","Everson","New audits for line voltage and power source for CTE"]
["2017-07-26","Everson","Corrected audit numbers due to addition of power audits for CTE"]
["2017-08-18","Evenson","Added not to set Secure (0x503) to Both for RMRU"]
["2017-10-05","Everson","Added new CTE audit state when an RS485 reader is detected but the CTE cannot communicate to it due to it being not being paired or supported"]
["2017-10-10","Evenson","DbmAuditData List: converted all columns except SQL columns to hard coded data rather than links\nDbmAuditData List:  Added SQL headers to columns\nDbmAuditEvents/DbmAuditData List:  Added new POST and IBIT definitions for Argos peripheral devices\nAudit Update Process:  Started new tab to document process and rules.\nDbmAuditEvents: Changed decimal values for POST/IBIT modules to hex values\nWIFI Audit Trail Data: changed values to hex from decimal\nDbmAuditData List: Added Peripheral HW to IBIT/POST\nDbmAuditEvents: Changed Module description for IBIT/POST from Hand Held Device to BLE\nDbmAuditData List: Changed Audit data for IBIT Fail: Wifi Configuration from 060c to 0B0C\nDbmAuditData List:  Added Peripheral HW entries"]
["2017-10-17","Everson","Added clubbing values 0001 and 0002 for device/holiday scheduled events to passage and secure audits (ENGAGE only) - corrected SQL data table for power source audits"]
["2017-11-01","Verde","Added Reader Diagnostic audits (0x0D04-0x0D0C) and Interboard Comm Audit (0x0D01 0002)"]
["2017-11-09","Everson/Ross","Added Ethernet module fw update audit and post and ibit audits for Ethernet comms"]
["2018-01-09","Verde","Added invalid lock configurtation audits for out of range values"]
["2018-02-09","Verde","Added Integrity and Authenticity (HMAC) Audits"]
["2018-03-23","Anirban","Added Audits for SSID Pwd Change feature (VSTS 82446) for ENGAGE 6.1"]
["2018-03-26","Verde","Added Invalid Pin Length for Lock Parameter audit and TLS Certificate Download Success audit"]
["2018-03-27","Nichols","HMAC Audits Updated on Worksheets \"DbmAuditEvents\" and \"DbmAuditData List\""]
["2018-03-27","Anirban","Added invalid Audit for SSID Pwd Change feature"]
["2018-03-27","Nichols","HMAC Audits Corrected on Worksheets \"DbmAuditEvents\""]
["2018-04-19","Anirban","Updated SW Heading for New AP configuration audits"]
["2018-04-19","Evenson","Added macro for auto code generation changing name to .xlsm, and changed label column entries on DbmAuditData List sheet for auto code generation. "]
["2018-04-30","Anirban","Added additional invalid Audit for SSID Pwd Change feature"]
["2018-04-30","Nichols","Added revised HMAC Audits in the  \"DbmAuditEvents\" and  \"DbmAuditData List\" Worksheets per requirement changes"]
["2018-05-29","Verde","Added depracated reader reset audit for NDE/LE only for ENGAGE 6.05 firmware"]
["2018-07-09","Verde","Valid Non CERT tag sent in JSON ignored and will generate 0901000 audit"]
["2018-07-24","Evenson","Updated Label for Reader diagnostics.\nCorrected Audit Event for New AP Cfg Event New AP Cfg Time Invalid"]
["2018-08-20","Verde","Added BLE disconnect audit (0x208) for Invalid JSON data transfer size"]
["2019-04-30","Verde","Added Prevent Construction Mode Audits "]
["2019-05-09","Evenson","Corrected Reader audits 0303 and 0C06 tags inadvertently changed back to original names."]
["2019-05-10","Verde","Corrected Prevented Construction Audits"]
["2019-05-19","Nichols","Added IPB_STUCK Audit/Alert for NDE 2.0/LE 2.0"]
["2019-06-05","Nichols","Corrected IPB_STUCK Audit/Alert for NDE 2.0/LE 2.0"]
["2019-06-27","MacCrindle","Added Audits for Reader-Controllers"]
["2019-09-13","Verde","Added Incremental Database User Update Count Audit  - 0x0608"]
["2019-10-09","MacCrindle","Reader-Controller Updates & Corrections"]
["2019-12-04","Evenson","Added 1fx2(0x552) and Ethernet (0x12xx) audits"]
["2019-12-18","Ross","Added Firmware OTA Compatibility audit and Security audit at POST/IBIT"]
["2020-01-31","Pellegrin","Update SQLData formulas in DbmAuditData Lis"]
["2020-03-18","Evenson","Added Keypad Lockout to DbmAuditEvents, DbmAuditData List ad Audit_Definitions tabs."]
["2020-04-03","Gilchrist","Updated One_Factor_Two_User\nRemoved \"Rejected - Process Error\" audits for \"Two_Factor\" and \"Two_Factor_Two_User\"\nUpdated \"Invalid Lock Function\" audit to \"not supported\" for RC-05\nAdded audit for \"Door Open\" and \"Door Closed\""]
["2020-07-08","Fieldhouse","Deleted \"Owner\" Column\nAdded a \"Supported\" Column for each device to clarify which devices support each audit\nCommonized fonts, reformatted for readability, and maintainability on DbmAuditEvents\nRemoved hyperlinks from DbmAuditEvents"]
["2020-07-30","Thaker","Add Double Tap Feature Audits for Passage (0x051B) and Secured (0x051C)"]
["2020-08-19","Gilchrist","Updated to reflect existing audits that are supported by the Reader-Controller\nAdded a new JSON Parse Error audit for the Reader-Controller.\nRemoved Audit Definitions tab"]
["2020-10-28","Fieldhouse","Add audits for \"Credential Not in Database\". \nUpdated support columns for Double tap Audits\nUpdated IPB audit to recognize it is both audit and alert"]
["2020-11-03","Herbert","Fixed AUDIT_BUFFEROVERUN 0x06050001 to indicate support on GWE properly for SC, SCB, and RMRU (audit is generated regardless of whether device supports it internally)"]
["2021-01-18","Thaker","Add new audits for new clear Lockstate override command,  partial database action reporting and more details around Holiday and Auto Start and End Events for RC05"]
["2021-03-22","Soundarya","Updated support columns on CTRL and CTRLB for (0901 0000) ,(0900 0001) and (0605 0000),with note stating audit implementation will be available on Engage 8.0"]
["2021-09-21","Verde","Updated columns for CTRL and CTRLB for 0x0F000000, 0x0F010000, and 0x0F050000 as they are not supported for these devices"]
["2021-09-22","Thaker","Add new audits for CTRLB to report failures in communiation with 66302/03(0x0D020D06) or SAM AV2/AV3 (0x0D020D05) chips during POST"]
["2021-11-08","Pradyuman","Updated Audit list for XE360"]
["2022-01-19","Pradyuman","Add new audits for CTRLBM to report clock failures in communiation with Ext RTC chip during POST\nAdded new audits for XE360 to report IPC failure as part of system diagnostic. "]
["2022-05-05","Pradyuman","Corrected audit codes for lock state override and others."]
["2022-07-19","Pradyuman","Update internal name to XE360 and audit correction for XE360"]
["2022-08-11","Dinoso","Updated RC column for Auto Relock Event First Person In - Secure."]
["2022-08-23","Sanjay H","Added new audit for XE360 to capure motor operation retries (Event 0x0D13). Also updated data values for Motor transition failure audit (Event 0x070C) "]
["2022-08-29","Kearns","Updated DbmAuditEvents line 441 (HMAC_VALIDATION_PASSED) to correct a typo in the \"Data\" column and updated the \"Data Description\" column accordingly."]
["2022-09-08","Dinoso","Added new audits for RC: (1401 0001), (1401 0002), (1401 0003), (1401 0004), (1401 0005), (1402 0000), (0900 001B)"]
["2022-09-20","Dinoso","Added missing rows in DbmAuditData List tab for audits: (1400 0000), (1400 0001), (1401 0000), (1401 0001), (1401 0002), (1401 0003), (1401 0004), (1401 0005), (1402 0000), (0900 001B)"]
["2023-05-18","Pradyuman","Added new audit for XE360: 0x0723 for mechanical override "]
["2023-12-12","Pradyuman","Added new audit for XE360: 0x0545 & 0x0546 for mechanical override "]
["2024-05-13","Himanshu","Added new audit in DbmAuditEvents for NDEB-LEB: 0900 001C - Data Parse Error - Partial/Invalid Credential Schedule."]
["2025-02-19","Dinoso","Added new audits for RC: (1500 0000), (1501 0000), (1502 0000), (1503 0000), (1504 0000), (1505 0000), (1506 0000), (1507 0000),(150A 0000),  "]
["2025-03-19","Ankita ","For 0900 000B(Data Error Lock Configuration) and 0900 0003 (JSON Data Error) audits for CTRL,CTRLB, CTRLBM locks changed from Y  to N(Not Supported in current firmware)."]
["2025-04-20","Rahul","Updated the 'DbmAuditEvents' tab with the audit code for detecting duplicate user records. (0600 0005 - DBM_ATD_USR_REC_OPS_DUPLICATE_USER_RECORD_FOUND)"]
["2025-05-30","Verde","Updated the data description for audit 0x0900 0001"]
["2025-06-30","Himanshu","Updated \"DbmAuditData List\" sheet SW Text Column for Audit code 0x0B050035 from \"Incorrect SSID or Password\" to \"Incorrect Password\""]
["2025-07-21","Rahul T T","Updated the 'DbmAuditEvents' sheet to include audit support for 'Data Parse Error - Partial/Invalid Credential Schedule (0900001C)' for the LE1.0 Lock."]
["2025-10-28","Dinoso","Added the following: audit for CA cert authentication failure due to invalid RTC time(0x1206) and audit for any RTC time change exceeding 65535 seconds to give us more data bytes for the time difference (0x0A03)."]
["2025-11-19","Chandu K","Added the following: audits for download firmware image failure to identify the failure causes. (1203 0002, 1203 0003, 1203 0004, 1203 0005, 1203 0006)"]
["2025-11-24","Ram Perumanam","Updated the Secured Audit(0x0503) support columns for CTRL, CTRLB, CTRLBM to N "]
["2026-01-06","Vimal Jain","Added new data(0x0058) value for DBM_ATM_AUDIT_EVENT_WIFI_DLD_FAIL event for high http response."]
["2026-01-27","Rahul T T","Added new audit value 0x0003 for Interboard Communications IB_COMM (0x0D01)"]

{"sheet":"DbmAuditEvents","index":1,"n_rows":505,"n_cols":22,"rows_kept":505,"cut":false,"hidden":false,"merged":[[0,7,1,20],[0,0,0,6],[1,0,1,6]]}
["These are defined & provided in DbmAuditTrailManager_API.h",null,null,null,null,null,null,"Support Matrix\nY = Supported in latest firmware.\nN = Not Supported in latest firmware\nC = Custom support, expand comment for details"]
["1) Place a date in the 'Date Changed' column when adding or modifying any audits. This enables audit change history for each audit and assists PLE/PACS support. (No deletions, see step 2)\n2) Once Used A Value CAN NEVER Be Reused or Caption Change to a New meaning. If deleted that Audit should be Strikethrough and the number never reused, with date of strikethrough placed in 'Date Changed' column.\n3) Audit data is divided into Audit event, Data value.  The first two bytes are Audit event and the last two bytes are reserved for user data. Ex. Lock configuration audit, invalid relock delay = 0x0400 0x0001."]
["Audit Category (base value)","Caption","Description","Audit / Alert","Event","Data","Data Description","LE","LEB","NDE","NDEB","CTE","MTB","MT20W","CTRL","CTRLB","CTRLBM","RMRU","RC","XE360","GWE","Date Changed"]
["User IDs","USER_ID","Audits with values less than 0x0010 0000 are reserved for User IDs",null,"0x000X","0xXXXX","XXXXX = 20 bit hex number of the userID ref","Y","Y","Y","Y","Y","N","N","Y","Y","Y","Y","N","Y","N"]
["Power Audits (0x0100)","LOW_BATT","Low Battery (mV)     ","Both","0x0100","0xXXXX","XXXX = Battery Voltage in millivolt","Y","Y","Y","Y","Y","N","N","Y","Y","Y","Y","N","Y","N"]
["Power Audits (0x0100)","CRIT_BATT                      ","Critical Battery (mV) ","Both","0x0101","0xXXXX","XXXX = Battery Voltage in millivolt","Y","Y","Y","Y","Y","N","N","Y","Y","Y","Y","N","Y","N"]
["Power Audits (0x0100)","LVL_BATT                      ","Battery Level (mV) ","Audit","0x0102","0xXXXX","XXXX = Battery Voltage in millivolt","Y","Y","Y","Y","Y","N","N","Y","Y","Y","Y","N","Y","N"]
["Power Audits (0x0100)","POWER_SOURCE ","Input Power Source","Audit","0x0180","0x0000","Input Voltage Source Not Detected","Y","Y","Y","Y","Y","N","N","N","N","N","N","N","N","N"]
["Power Audits (0x0100)","POWER_SOURCE ","Input Power Source","Audit","0x0180","0x0001","Line Power","Y","Y","Y","Y","Y","N","N","N","N","N","N","Y","N","N"]
["Power Audits (0x0100)","POWER_SOURCE ","Input Power Source","Audit","0x0180","0x0002","POE","Y","Y","Y","Y","Y","N","N","N","N","N","N","Y","N","N"]
["Power Audits (0x0100)","POWER_SOURCE ","Input Power Source","Audit","0x0180","0x0003","POE+","Y","Y","Y","Y","Y","N","N","N","N","N","N","N","N","N"]
["Power Audits (0x0100)","POWER_SOURCE ","Input Power Source","Audit","0x0180","0x0004","Battery","Y","Y","Y","Y","Y","N","N","N","N","N","N","N","N","N"]
["Power Audits (0x0100)","POWER_VOLTAGE","Line Voltage (mV)","Audit","0x0181","0xXXXX","XXXX = Line voltage in millivolt","Y","Y","Y","Y","Y","N","N","N","N","N","N","Y","N","N"]
["Bluetooth Low Energy Audits (0x0200)","BLE_MAPP_CONNECTED_DUID0","Connected to App ","Audit","0x0200","0x0000","None - no data (defaulted to 0x0000)","Y","Y","Y","Y","Y","N","N","Y","Y","Y","Y","Y","Y","N"]
["Bluetooth Low Energy Audits (0x0200)","BLE_MAPP_CONNECTED_DUID1","Allocated for Future Use","Audit","0x0201","0x0000","None - no data (defaulted to 0x0000)","N","N","N","N","N","N","N","N","N","N","N","N","N","N"]
["Bluetooth Low Energy Audits (0x0200)","BLE_MAPP_CONNECTED_DUID2","Allocated for Future Use","Audit","0x0202","0x0000","None - no data (defaulted to 0x0000)","N","N","N","N","N","N","N","N","N","N","N","N","N","N"]
["Bluetooth Low Energy Audits (0x0200)","BLE_MAPP_CONNECTED_DUID3","Allocated for Future Use","Audit","0x0203","0x0000","None - no data (defaulted to 0x0000)","N","N","N","N","N","N","N","N","N","N","N","N","N","N"]
["Bluetooth Low Energy Audits (0x0200)","BLE_MAPP_CONNECTED_DUID4","Allocated for Future Use","Audit","0x0204","0x0000","None - no data (defaulted to 0x0000)","N","N","N","N","N","N","N","N","N","N","N","N","N","N"]
["Bluetooth Low Energy Audits (0x0200)","BLE_MAPP_CONNECTED_DUID5","Allocated for Future Use","Audit","0x0205","0x0000","None - no data (defaulted to 0x0000)","N","N","N","N","N","N","N","N","N","N","N","N","N","N"]
["Bluetooth Low Energy Audits (0x0200)","BLE_MAPP_CONNECTED_DUID6","Allocated for Future Use","Audit","0x0206","0x0000","None - no data (defaulted to 0x0000)","N","N","N","N","N","N","N","N","N","N","N","N","N","N"]
["Bluetooth Low Energy Audits (0x0200)","BLE_MAPP_CONNECTED_DUID7","Allocated for Future Use","Audit","0x0207","0x0000","None - no data (defaulted to 0x0000)","N","N","N","N","N","N","N","N","N","N","N","N","N","N"]
["Bluetooth Low Energy Audits (0x0200)","BLE_MAPP_DISCONNECT","Invalid JSON data transfer size","Audit","0x0208","0x0000","None - no data (defaulted to 0x0000)","Y","Y","Y","Y","Y","N","N","N","N","N","N","N","N","N"]
["Reader Audits (0x0300)","INVALID_READER_CONFIG_IGNORED ","Invalid Reader Configuration","Audit","0x0300","0x0000","None - no data (defaulted to 0x0000)","Y","Y","Y","Y","Y","N","N","N","N","N","N","Y","Y","N"]
["Reader Audits (0x0300)","NO_TOUR_NOT_SUPPORTED","No Tour not supported by reader","Audit","0x0301","0x0000","None - no data (defaulted to 0x0000)","Y","Y","Y","Y","Y","N","N","N","N","N","N","N","N","N"]
["Reader Audits (0x0300)","READER_CONFIGURED_NO_TOUR","Reader Configured for No Tour","Audit","0x0302","0x0000","None - no data (defaulted to 0x0000)","Y","Y","Y","Y","Y","N","N","N","N","N","N","N","N","N"]
["Reader Audits (0x0300)","UNPAIRED_READER_DETECTED","Unpaired or unsupported reader detected","Audit","0x0303","0x0000","None - no data (defaulted to 0x0000)","Y","Y","Y","Y","Y","N","N","N","N","N","N","Y","N","N"]
["Lock Configuration Audits (0x0400)","CONFIG_UPDATE  ","Configurations Updated ","Audit","0x0400","0x0000","None - no data (defaulted to 0x0000)","Y","Y","Y","Y","Y","N","N","Y","Y","Y","Y","Y","Y","N"]
["Lock Configuration Audits (0x0400)","INVALID_LOCK_PARAMETER_REC  ","Configuration Error ","Audit","0x0401","0x0001","Invalid Relock Delay","Y","Y","Y","Y","Y","N","N","Y","Y","Y","N","Y","Y","N"]
["Lock Configuration Audits (0x0400)","INVALID_LOCK_PARAMETER_REC  ","Configuration Error ","Audit","0x0401","0x0002","Invalid Door Prop Detect Delay","Y","Y","Y","Y","Y","N","N","N","N","N","Y","Y","Y","N"]
["Lock Configuration Audits (0x0400)","INVALID_LOCK_PARAMETER_REC  ","Configuration Error ","Audit","0x0401","0x0003","Invalid ADA Relock Delay","Y","Y","Y","Y","Y","N","N","N","N","N","N","Y","Y","N"]
["Lock Configuration Audits (0x0400)","INVALID_LOCK_PARAMETER_REC  ","Configuration Error ","Audit","0x0401","0x0004","Invalid Lock Function","Y","Y","Y","Y","Y","N","N","N","N","N","Y","N","Y","N"]
["Lock Configuration Audits (0x0400)","INVALID_LOCK_PARAMETER_REC  ","Configuration Error ","Audit","0x0401","0x0005","Invalid Battery Failure Mode","Y","Y","Y","Y","Y","N","N","N","N","N","N","N","Y","N"]
["Lock Configuration Audits (0x0400)","INVALID_LOCK_PARAMETER_REC  ","Configuration Error ","Audit","0x0401","0x0006","Invalid Comm. Loss Fail Mode","C","C","C","C","C","N","N","N","N","N","C","Y","N","N"]
["Lock Configuration Audits (0x0400)","INVALID_LOCK_PARAMETER_REC  ","Configuration Error ","Audit","0x0401","0x0007","Invalid Days to Auto Purge","C","C","C","C","C","N","N","C","C","C","N","N","N","N"]
["Lock Configuration Audits (0x0400)","INVALID_LOCK_PARAMETER_REC  ","Configuration Error ","Audit","0x0401","0x0008","Invalid Change Bits to Cache","C","C","C","C","C","N","N","C","C","C","N","N","N","N"]
["Lock Configuration Audits (0x0400)","INVALID_LOCK_PARAMETER_REC  ","Configuration Error ","Audit","0x0401","0x0009","Invalid Cache Bits to Store","C","C","C","C","C","N","N","C","C","C","N","N","N","N"]
["Lock Configuration Audits (0x0400)","INVALID_LOCK_PARAMETER_REC  ","Configuration Error ","Audit","0x0401","0x000A","Invalid Lock Mode","C","C","C","C","C","N","N","C","C","C","C","Y","Y","N"]
["Lock Configuration Audits (0x0400)","INVALID_LOCK_PARAMETER_REC  ","Configuration Error ","Audit","0x0401","0x000B","Invalid Lock Name","C","C","C","C","C","N","N","C","C","C","C","Y","Y","N"]
["Lock Configuration Audits (0x0400)","INVALID_LOCK_PARAMETER_REC  ","Configuration Error ","Audit","0x0401","0x000C","Invalid Sector - No Tour","C","C","C","C","C","N","N","Y","Y","Y","N","N","Y","N"]
["Lock Configuration Audits (0x0400)","INVALID_LOCK_PARAMETER_REC  ","Configuration Error ","Audit","0x0401","0x000D","Invalid Credential Sector","N","N","N","N","C","N","N","Y","Y","Y","N","N","N","N"]
["Lock Configuration Audits (0x0400)","INVALID_LOCK_PARAMETER_REC  ","Configuration Error ","Audit","0x0401","0x000E","Invalid Decision Mode","N","N","N","N","C","N","N","C","C","C","N","N","N","N"]
["Lock Configuration Audits (0x0400)","INVALID_LOCK_PARAMETER_REC  ","Configuration Error ","Audit","0x0401","0x000F","Invalid Heartbeat Time","C","C","C","C","C","N","N","C","C","C","C","N","N","N"]
["Lock Configuration Audits (0x0400)","INVALID_LOCK_PARAMETER_REC  ","Configuration Error ","Audit","0x0401","0x0010","Invalid Number of Retries","C","C","C","C","C","N","N","C","C","C","N","N","N","N"]
["Lock Configuration Audits (0x0400)","INVALID_LOCK_PARAMETER_REC  ","Configuration Error ","Audit","0x0401","0x0011","Invalid Sequence Delay","Y","Y","Y","Y","Y","N","N","C","C","C","N","N","N","N"]
["Lock Configuration Audits (0x0400)","INVALID_LOCK_PARAMETER_REC  ","Configuration Error ","Audit","0x0401","0x0012","Invalid First Delay","Y","Y","Y","Y","Y","N","N","C","C","C","N","N","N","N"]
["Lock Configuration Audits (0x0400)","INVALID_LOCK_PARAMETER_REC  ","Configuration Error ","Audit","0x0401","0x0013","Invalid Tamper Open Action","N","N","N","N","Y","N","N","N","N","N","Y","Y","N","N"]
["Lock Configuration Audits (0x0400)","INVALID_LOCK_PARAMETER_REC  ","Configuration Error ","Audit","0x0401","0x0014","Invalid Wi-Fi DB Download Retry Time","Y","Y","Y","Y","Y","N","N","N","N","N","Y","N","N","N"]
["Lock Configuration Audits (0x0400)","INVALID_LOCK_PARAMETER_REC  ","Configuration Error ","Audit","0x0401","0x0015","Invalid Wi-Fi DB Download Retry Count","Y","Y","Y","Y","Y","N","N","N","N","N","Y","N","N","N"]
["Lock Configuration Audits (0x0400)","INVALID_LOCK_PARAMETER_REC  ","Configuration Error ","Audit","0x0401","0x0016","Invalid IPB Long Press","Y","Y","Y","Y","Y","N","N","N","N","N","N","N","N","N"]
["Lock Configuration Audits (0x0400)","INVALID_LOCK_PARAMETER_REC  ","Configuration Error ","Audit","0x0401","0x0017","Invalid Lock ID","Y","Y","Y","Y","Y","N","N","N","N","N","N","N","Y","N"]
["Lock Configuration Audits (0x0400)","INVALID_LOCK_PARAMETER_REC  ","Configuration Error ","Audit","0x0401","0x0018","Invalid Group ID","Y","Y","Y","Y","Y","N","N","N","N","N","N","N","Y","N"]
["Lock Configuration Audits (0x0400)","INVALID_LOCK_PARAMETER_REC  ","Configuration Error ","Audit","0x0401","0x0019","Invalid Group Elements in Array","Y","Y","Y","Y","Y","N","N","N","N","N","N","N","Y","N"]
["Lock Configuration Audits (0x0400)","INVALID_LOCK_PARAMETER_REC  ","Configuration Error ","Audit","0x0401","0x001A","Invalid Pin Length","N","N","N","N","Y","N","N","N","N","N","N","Y","N","N"]
["Lock Configuration Audits (0x0400)","PREVENT_CONSTRUCTION_MODE","Prevent Construction Mode Feature ","Audit","0x0402","0x0000","Disabled","N","Y","N","Y","N","N","N","N","N","N","N","Y","Y","N"]
["Lock Configuration Audits (0x0400)","PREVENT_CONSTRUCTION_MODE","Prevent Construction Mode Feature ","Audit","0x0402","0x0001","Enabled","N","Y","N","Y","N","N","N","N","N","N","N","N","Y","N"]
["Lock Configuration Audits (0x0400)","ASM_KEY_UPDATED","ASM Key Updated","Audit","0x0403","0x0000","None - no data (defaulted to 0x0000)","N","N","N","N","N","N","N","N","N","N","N","Y","N","N"]
["Credential Audits (0x0500)","LOCKDOWN  ","Lockdown  ","Audit","0x0500","0x0000","None - no data (defaulted to 0x0000)","Y","Y","Y","Y","Y","N","N","Y","Y","Y","N","Y","Y","N"]
["Credential Audits (0x0500)","LOCKDOWN_CANCELED  ","Lockdown Canceled  ","Audit","0x0501","0x0000","None - no data (defaulted to 0x0000)","Y","Y","Y","Y","Y","N","N","Y","Y","Y","N","Y","Y","N"]
["Credential Audits (0x0500)","PASSAGE  ","Passage  ","Audit","0x0502","0x0000","None - no data (defaulted to 0x0000)","Y","Y","Y","Y","Y","N","N","Y","Y","Y","Y","Y","Y","N"]
["Credential Audits (0x0500)","SECURED  ","Secured  ","Audit","0x0503","0x0000","None - no data (defaulted to 0x0000)","Y","Y","Y","Y","Y","N","N","N","N","N","C","Y","Y","N","2025-11-24"]
["Credential Audits (0x0500)","TOGGLE_UNSEC  ","Toggle Passage  ","Audit","0x0504","0x0000","None - no data (defaulted to 0x0000)","Y","Y","Y","Y","Y","N","N","Y","Y","Y","N","Y","Y","N"]
["Credential Audits (0x0500)","TOGGLE_SEC  ","Toggle Secured","Audit","0x0505","0x0000","None - no data (defaulted to 0x0000)","Y","Y","Y","Y","Y","N","N","N","N","N","N","Y","Y","N"]
["Credential Audits (0x0500)","DEL_USR_REC_W_AUDIT  ","Delete With Alarm  ","Audit","0x0506","0x0000","None - no data (defaulted to 0x0000)","Y","Y","Y","Y","Y","N","N","N","N","N","N","Y","Y","N"]
["Credential Audits (0x0500)","PASS_THROUGH","Pass Through","Audit","0x0507","0x0000","None - no data (defaulted to 0x0000)","Y","Y","Y","Y","Y","N","N","Y","Y","Y","N","Y","Y","N"]
["Credential Audits (0x0500)","ACCESS_OUTSIDE_TIMEZONE","Access Denied - Not Within Schedule","Audit","0x0508","0x0000","None - no data (defaulted to 0x0000)","Y","Y","Y","Y","Y","N","N","Y","Y","Y","N","Y","Y","N"]
["Credential Audits (0x0500)","ACCESS_OUTSIDE_ACTIVATION_DATE","Access Denied - Before Activaion Date","Audit","0x0509","0x0000","None - no data (defaulted to 0x0000)","Y","Y","Y","Y","Y","N","N","Y","Y","Y","N","Y","Y","N"]
["Credential Audits (0x0500)","ACCESS_OUTSIDE_EXPIRATION_DATE","Access Denied - Credential Expired ","Audit","0x050A","0x0000","None - no data (defaulted to 0x0000)","Y","Y","Y","Y","Y","N","N","Y","Y","Y","N","Y","Y","N"]
["Credential Audits (0x0500)","ACCESS_CARD_TYPE_UNKNOWN","Unknown Credential Presented","Audit","0x050B","0x0000","None - no data (defaulted to 0x0000)","Y","Y","Y","Y","Y","N","N","Y","Y","Y","N","Y","Y","N"]
["Credential Audits (0x0500)","ACCESS_WHILE_IN_REST_SECURE","Access attempt while in Restricted Secured","Audit","0x050C","0x0000","None - no data (defaulted to 0x0000)","Y","Y","Y","Y","Y","N","N","N","N","N","N","Y","Y","N"]
["Credential Audits (0x0500)","ACCESS_WHILE_IN_LOCKOUT","Access attempt while in Lockout","Audit","0x050D","0x0000","None - no data (defaulted to 0x0000)","Y","Y","Y","Y","Y","N","N","N","N","N","N","Y","Y","N"]
["Credential Audits (0x0500)","ACCESS_BY_ONETIME_USER","One-Time-Use Credential Presented","Audit","0x050E","0x0000","None - no data (defaulted to 0x0000)","Y","Y","Y","Y","Y","N","N","N","N","N","N","Y","Y","N"]
["Credential Audits (0x0500)","STATE_CHG_REST_SEC","Secured - From Restricted Secured","Audit","0x050F","0x0000","None - no data (defaulted to 0x0000)","Y","Y","Y","Y","Y","N","N","N","N","N","N","Y","Y","N"]
["Credential Audits (0x0500)","STATE_CHG_REST_PASSAGE","Passage - From Restricted Secured","Audit","0x0510","0x0000","None - no data (defaulted to 0x0000)","Y","Y","Y","Y","Y","N","N","N","N","N","N","Y","Y","N"]
["Credential Audits (0x0500)","STATE_CHG_SEC_REST","Restricted Secured -  from Secured","Audit","0x0511","0x0000","None - no data (defaulted to 0x0000)","Y","Y","Y","Y","Y","N","N","N","N","N","N","Y","Y","N"]
["Credential Audits (0x0500)","STATE_CHG_PASS_REST","Restricted Secured -  from Passage","Audit","0x0512","0x0000","None - no data (defaulted to 0x0000)","Y","Y","Y","Y","Y","N","N","N","N","N","N","Y","Y","N"]
["Credential Audits (0x0500)","FREEZE_PASSAGE","Freeze Passage","Audit","0x0513","0x0000","None - no data (defaulted to 0x0000)","Y","Y","Y","Y","Y","N","N","N","N","N","Y","Y","Y","N"]
["Credential Audits (0x0500)","FREEZE_SECURED","Freeze Secured","Audit","0x0514","0x0000","None - no data (defaulted to 0x0000)","Y","Y","Y","Y","Y","N","N","N","N","N","Y","Y","Y","N"]
["Credential Audits (0x0500)","PRIVACY_SECURE_ON","Privacy On","Audit","0x0515","0x0000","None - no data (defaulted to 0x0000)","Y","Y","Y","Y","Y","N","N","N","N","N","N","N","Y","N"]
["Credential Audits (0x0500)","PRIVACY_SECURE_OFF","Privacy Off","Audit","0x0516","0x0000","None - no data (defaulted to 0x0000)","Y","Y","Y","Y","Y","N","N","N","N","N","N","N","Y","N"]
["Credential Audits (0x0500)","AUTOUNLOCK_EVENT_OCCURRED","Auto Unlock Event Occurred","Audit","0x0517","0x0000","None - no data (defaulted to 0x0000)","Y","Y","Y","Y","Y","N","N","N","N","N","Y","Y","Y","N"]
["Credential Audits (0x0500)","AUTOUNLOCK_EVENT_OCCURRED","Auto Unlock Event Occurred","Audit","0x0517","0x0001","Auto Unlock Event - Passage","N","N","N","N","N","N","N","N","N","N","N","Y","N","N","2021-01-18"]
["Credential Audits (0x0500)","AUTOUNLOCK_EVENT_OCCURRED","Auto Relock Event Occurred","Audit","0x0517","0x0002","Auto Relock Event - Secure","N","N","N","N","N","N","N","N","N","N","N","Y","N","N","2021-01-18"]
["Credential Audits (0x0500)","AUTOUNLOCK_EVENT_OCCURRED","Auto Unlock Event Occurred","Audit","0x0517","0x0011","Auto Unlock Event First Person In - Passage","N","N","N","N","N","N","N","N","N","N","N","Y","N","N","2021-01-18"]
["Credential Audits (0x0500)","AUTOUNLOCK_EVENT_OCCURRED","Auto Relock Event Occurred","Audit","0x0517","0x0012","Auto Relock Event First Person In - Secure","N","N","N","N","N","N","N","N","N","N","N","N","N","N","2022-08-11"]
["Credential Audits (0x0500)","HOLIDAY_EVENT_OCCURRED","Holiday Schedule Event Occurred","Audit","0x0518","0x0000","None - no data (defaulted to 0x0000)","Y","Y","Y","Y","Y","N","N","N","N","N","Y","Y","Y","N"]
["Credential Audits (0x0500)","HOLIDAY_EVENT_OCCURRED","Holiday Schedule Event Occurred","Audit","0x0518","0x0001","Holiday Passage Event Start","N","N","N","N","N","N","N","N","N","N","N","Y","N","N","2021-01-18"]
["Credential Audits (0x0500)","HOLIDAY_EVENT_OCCURRED","Holiday Schedule Event Occurred","Audit","0x0518","0x0002","Holiday Passage Event End","N","N","N","N","N","N","N","N","N","N","N","Y","N","N","2021-01-18"]
["Credential Audits (0x0500)","HOLIDAY_EVENT_OCCURRED","Holiday Schedule Event Occurred","Audit","0x0518","0x0011","Holiday Secure Event Start","N","N","N","N","N","N","N","N","N","N","N","Y","N","N","2021-01-18"]
["Credential Audits (0x0500)","HOLIDAY_EVENT_OCCURRED","Holiday Schedule Event Occurred","Audit","0x0518","0x0012","Holiday Secure Event End","N","N","N","N","N","N","N","N","N","N","N","Y","N","N","2021-01-18"]
["Credential Audits (0x0500)","HOLIDAY_EVENT_OCCURRED","Holiday Schedule Event Occurred","Audit","0x0518","0x0021","Holiday Restricted Secure Event Start","N","N","N","N","N","N","N","N","N","N","N","Y","N","N","2021-01-18"]
["Credential Audits (0x0500)","HOLIDAY_EVENT_OCCURRED","Holiday Schedule Event Occurred","Audit","0x0518","0x0022","Holiday Restricted Secure Event End","N","N","N","N","N","N","N","N","N","N","N","Y","N","N","2021-01-18"]
["Credential Audits (0x0500)","DOG_ON_NEXT_EXIT","Dog On Next Exit","Audit","0x0519","0x0000","None - no data (defaulted to 0x0000)","Y","Y","Y","Y","Y","N","N","N","N","N","Y","N","N","N"]
["Credential Audits (0x0500)","FREEZE_DOG_ON_NEXT_EXIT","Freeze Dog On Next Exit","Audit","0x051A","0x0000","None - no data (defaulted to 0x0000)","Y","Y","Y","Y","Y","N","N","N","N","N","Y","N","N","N"]
["Credential Audits (0x0500)","DOUBLE_TAP_PASSAGE","Double Tap -  Passage","Audit","0x051B","0x0000","None - no data (defaulted to 0x0000)","N","N","N","N","N","N","N","N","N","N","N","N","N","N","2020-10-28"]
["Credential Audits (0x0500)","DOUBLE_TAP_SECURED","Double Tap -  Secured","Audit","0x051C","0x0000","None - no data (defaulted to 0x0000)","N","N","N","N","N","N","N","N","N","N","N","N","N","N","2020-10-28"]
["Credential Audits (0x0500)","ACCESS_DENIED","Access Denied","Audit","0x0540","0x0000","None - no data (defaulted to 0x0000)","Y","Y","Y","Y","Y","N","N","Y","Y","Y","N","Y","Y","N"]
["Credential Audits (0x0500)","ACCESS_BLOCKED","Access Blocked","Audit","0x0541","0x0000","None - no data (defaulted to 0x0000)","Y","Y","Y","Y","Y","N","N","Y","Y","Y","N","N","Y","N"]
["Credential Audits (0x0500)","REMOTE_AUTHORIZATION","Remote Authorization","Audit","0x0542","0x0000","None - no data (defaulted to 0x0000)","Y","Y","Y","Y","Y","N","N","Y","Y","Y","N","N","Y","N"]
["Credential Audits (0x0500)","REMOTE_LOCKDOWN","Remote Lockdown","Audit","0x0543","0x0000","None - no data (defaulted to 0x0000)","Y","Y","Y","Y","Y","N","N","N","N","N","Y","N","N","N"]
["Credential Audits (0x0500)","REMOTE_LOCKDOWN_CLEAR","Remote Lockdown Clear","Audit","0x0544","0x0000","None - no data (defaulted to 0x0000)","Y","Y","Y","Y","Y","N","N","N","N","N","Y","N","N","N"]
["Credential Audits (0x0500)","CREDENTIAL_ACCESS_DISABLED","Credential Access Temporarily disabled","Audit","0x0545","0x0000","None - no data (defaulted to 0x0000)","N","N","N","N","N","N","N","N","N","N","N","N","Y","N","2023-12-12"]
["Credential Audits (0x0500)","CREDENTIAL_ACCESS_ENABLED","Credential Access enabled","Audit","0x0546","0x0000","None - no data (defaulted to 0x0000)","N","N","N","N","N","N","N","N","N","N","N","N","Y","N","2023-12-12"]
["Credential Audits (0x0500)","TWO_FACTOR","Two-Factor","Audit","0x0550","0x0000","Success","N","N","N","N","N","N","N","N","N","N","N","Y","N","N"]
["Credential Audits (0x0500)","TWO_FACTOR","Two-Factor","Audit","0x0550","0x0001","Rejected - Timeout","N","N","N","N","N","N","N","N","N","N","N","Y","N","N"]
["Credential Audits (0x0500)","TWO_FACTOR","Two-Factor","Audit","0x0550","0x0002","Rejected - Bad Second Credential","N","N","N","N","N","N","N","N","N","N","N","Y","N","N"]
["Credential Audits (0x0500)","TWO_FACTOR_TWO_USER","Two-Factor Two-User","Audit","0x0551","0x0000","User 1 Success","N","N","N","N","N","N","N","N","N","N","N","Y","N","N"]
["Credential Audits (0x0500)","TWO_FACTOR_TWO_USER","Two-Factor Two-User","Audit","0x0551","0x0001","User 1 Rejected - Timeout","N","N","N","N","N","N","N","N","N","N","N","Y","N","N"]
["Credential Audits (0x0500)","TWO_FACTOR_TWO_USER","Two-Factor Two-User","Audit","0x0551","0x0002","User 1 Rejected - Bad Second Credential","N","N","N","N","N","N","N","N","N","N","N","Y","N","N"]
["Credential Audits (0x0500)","TWO_FACTOR_TWO_USER","Two-Factor Two-User","Audit","0x0551","0x0004","User 2 Success","N","N","N","N","N","N","N","N","N","N","N","Y","N","N"]
["Credential Audits (0x0500)","TWO_FACTOR_TWO_USER","Two-Factor Two-User","Audit","0x0551","0x0005","User 2 Rejected - Access Denied","N","N","N","N","N","N","N","N","N","N","N","Y","N","N"]
["Credential Audits (0x0500)","TWO_FACTOR_TWO_USER","Two-Factor Two-User","Audit","0x0551","0x0006","User 2 Rejected - Timeout","N","N","N","N","N","N","N","N","N","N","N","Y","N","N"]
["Credential Audits (0x0500)","TWO_FACTOR_TWO_USER","Two-Factor Two-User","Audit","0x0551","0x0007","User 2 Rejected - Bad Second Credential","N","N","N","N","N","N","N","N","N","N","N","Y","N","N"]
["Credential Audits (0x0500)","ONE_FACTOR_TWO_USER","One-Factor Two-User","Audit","0x0552","0x0000","User 1 Success","N","N","N","N","N","N","N","N","N","N","N","Y","N","N"]
["Credential Audits (0x0500)","ONE_FACTOR_TWO_USER","One-Factor Two-User","Audit","0x0552","0x0004","User 2 Success","N","N","N","N","N","N","N","N","N","N","N","Y","N","N"]
["Credential Audits (0x0500)","ONE_FACTOR_TWO_USER","One-Factor Two-User","Audit","0x0552","0x0005","User 2 Rejected - Access Denied","N","N","N","N","N","N","N","N","N","N","N","Y","N","N"]
["Credential Audits (0x0500)","ONE_FACTOR_TWO_USER","One-Factor Two-User","Audit","0x0552","0x0006","User 2 Rejected - Timeout","N","N","N","N","N","N","N","N","N","N","N","Y","N","N"]
["Database Audits (0x0600)","USR_REC_OPS","Database Error ","Audit","0x0600","0x0001","Add User Failed","Y","Y","Y","Y","Y","N","N","N","N","N","N","Y","Y","N"]
["Database Audits (0x0600)","USR_REC_OPS","Database Error ","Audit","0x0600","0x0002","Update User Failed","Y","Y","Y","Y","Y","N","N","Y","Y","Y","N","Y","Y","N"]
["Database Audits (0x0600)","USR_REC_OPS","Database Error ","Audit","0x0600","0x0003","Delete User Failed","Y","Y","Y","Y","Y","N","N","N","N","N","N","Y","Y","N"]
["Database Audits (0x0600)","USR_REC_OPS","Database Error ","Audit","0x0600","0x0004","User Limit Reached","Y","Y","Y","Y","Y","N","N","Y","Y","Y","N","Y","Y","N"]
["Database Audits (0x0600)","USR_REC_OPS","Database Error ","Audit","0x0600","0x0005","Duplicate user record detected","Y","Y","N","Y","Y","N","N","N","N","N","N","N","N","N","2025-04-20"]
["Database Audits (0x0600)","USER_DB_UPDATE_COMPLETE","Doorfile Update Successful","Audit","0x0601","0x0000","None - no data (defaulted to 0x0000)","Y","Y","Y","Y","Y","N","N","Y","Y","Y","Y","Y","Y","N"]
["Database Audits (0x0600)","AUDIT_UPLOAD_TRIG","Audit Upload Triggered  ","Audit","0x0602","0x0000","None - no data (defaulted to 0x0000)","Y","Y","Y","Y","Y","N","N","N","N","N","N","Y","N","N"]
["Database Audits (0x0600)","USER_DB_PRESORT_RESULT ","User Database Sorting Status ","Audit","0x0603","0x0000","Database Presorted","Y","Y","Y","Y","Y","N","N","N","N","N","N","Y","Y","N"]
["Database Audits (0x0600)","USER_DB_PRESORT_RESULT ","User Database Sorting Status ","Audit","0x0603","0x0001","Database Not Presorted","Y","Y","Y","Y","Y","N","N","N","N","N","N","Y","Y","N"]
["Database Audits (0x0600)","USER_DB_PRESORT_RESULT ","User Database Sorting Status ","Audit","0x0603","0x00FF","Database Presorting Unknown","Y","Y","Y","Y","Y","N","N","N","N","N","N","Y","Y","N"]
["Database Audits (0x0600)","USER_DB_CORRUPT","User Database Corrupt","Both","0x0604","0x0000","None - no data (defaulted to 0x0000)","Y","Y","Y","Y","Y","N","N","Y","Y","Y","N","Y","Y","N"]
["Database Audits (0x0600)","AUDIT_BUFFEROVERUN","Audits Lost Before Read","Audit","0x0605","0x0000","Device not serviced before losing audits","Y","Y","Y","Y","Y","N","N","Y","Y","Y","Y","Y","Y","N","2021-03-22"]
["Database Audits (0x0600)","AUDIT_BUFFEROVERUN","Audits Lost Before Read","Audit","0x0605","0x0001","Gateway not serviced before losing edge device audits","Y","Y","Y","Y","Y","N","N","Y","Y","Y","Y","N","N","N","2020-11-03"]
["Database Audits (0x0600)","USER_DB_PARTIAL_DOWNLOAD","Doorfile Partial Database Download","Audit","0x0606","0x00XX","XX = packet number","Y","Y","Y","Y","Y","N","N","N","N","N","N","Y","N","N"]
["Database Audits (0x0600)","USER_DB_PARTIAL_DOWNLOAD_FAULT","Doorfile Partial Database Download Fault","Audit","0x0607","0x0000","Out of Order","Y","Y","Y","Y","Y","N","N","N","N","N","N","Y","N","N"]
["Database Audits (0x0600)","USER_DB_PARTIAL_DOWNLOAD_FAULT","Doorfile Partial Database Download Fault","Audit","0x0607","0x0001","Timeout","Y","Y","Y","Y","Y","N","N","N","N","N","N","Y","N","N"]
["Database Audits (0x0600)","USER_DB_PARTIAL_UPDATE_COUNT","Incremental Database User Update Count","Audit","0x0608","0xXXXX","XXXX = Number of updates","Y","Y","Y","Y","Y","N","N","N","N","N","N","Y","Y","N"]
["Database Audits (0x0600)","USER_DB_PARTIAL_UPDATE_STATUS","Partial Database Action","Audit","0x0609","0x0001","User(s) Added","N","N","N","N","N","N","N","N","N","N","N","N","N","N","2021-01-18"]
["Database Audits (0x0600)","USER_DB_PARTIAL_UPDATE_STATUS","Partial Database Action ","Audit","0x0609","0x0002","User(s) Updated","N","N","N","N","N","N","N","N","N","N","N","Y","N","N","2021-01-18"]
["Database Audits (0x0600)","USER_DB_PARTIAL_UPDATE_STATUS","Partial Database Action","Audit","0x0609","0x0003","User(s) Deleted","N","N","N","N","N","N","N","N","N","N","N","Y","N","N","2021-01-18"]
["Door Action / Switch Audits (0x0700)","FORCED_DOOR                   ","Forced Door Alert  ","Both","0x0700","0x0000","None - no data (defaulted to 0x0000)","Y","Y","Y","Y","Y","N","N","N","N","N","Y","Y","Y","N"]
["Door Action / Switch Audits (0x0700)","PROPPED_DOOR                  ","Propped Door Event                  ","Audit","0x0701","0x0000","None - no data (defaulted to 0x0000)","Y","Y","Y","Y","Y","N","N","N","N","N","C","Y","Y","N"]
["Door Action / Switch Audits (0x0700)","TAMPER  ","Tamper Alert  ","Both","0x0702","0x0000","None - no data (defaulted to 0x0000)","Y","Y","Y","Y","Y","N","N","N","N","N","Y","Y","Y","N"]
["Door Action / Switch Audits (0x0700)","DPS_TAMPER                    ","Magnetic Tamper Alert                   ","Both","0x0703","0x0000","None - no data (defaulted to 0x0000)","Y","Y","Y","Y","C","N","N","N","N","N","Y","N","N","N"]
["Door Action / Switch Audits (0x0700)","REX  ","Request to Exit Triggered  ","Audit","0x0704","0x0000","None - no data (defaulted to 0x0000)","Y","Y","Y","Y","Y","N","N","N","N","N","Y","Y","Y","N"]
["Door Action / Switch Audits (0x0700)","DPS_COMM_FAILURE,","DPS Communication Failure","Audit","0x0705","0x0000","None - no data (defaulted to 0x0000)","Y","Y","Y","Y","N","N","N","N","N","N","Y","N","N","N"]
["Door Action / Switch Audits (0x0700)","STUCK_TAMPER","Stuck Tamper Switch","Audit","0x0706","0x0000","None - no data (defaulted to 0x0000)","Y","Y","Y","Y","Y","N","N","N","N","N","Y","N","N","N"]
["Door Action / Switch Audits (0x0700)","DB_EXTENDED","Dead Bolt Extended","Audit","0x0707","0x0000","None - no data (defaulted to 0x0000)","Y","Y","Y","Y","N","N","N","Y","Y","Y","N","N","Y","N"]
["Door Action / Switch Audits (0x0700)","DB_RETRACTED","Dead Bolt Retracted","Audit","0x0708","0x0000","None - no data (defaulted to 0x0000)","Y","Y","Y","Y","N","N","N","Y","Y","Y","N","N","Y","N"]
["Door Action / Switch Audits (0x0700)","LBM_EXTENDED","Latch Bolt Extended","Audit","0x0709","0x0000","None - no data (defaulted to 0x0000)","Y","Y","Y","Y","N","N","N","N","N","N","Y","N","N","N"]
["Door Action / Switch Audits (0x0700)","LBM_RETRACTED","Latch Bolt Retracted","Audit","0x070A","0x0000","None - no data (defaulted to 0x0000)","Y","Y","Y","Y","N","N","N","N","N","N","Y","N","N","N"]
["Door Action / Switch Audits (0x0700)","IPB","Interior Push Button Activated","Both","0x070B","0x0000","None - no data (defaulted to 0x0000)","Y","Y","N","Y","N","N","N","N","N","N","N","N","Y","N","2020-10-28"]
["Door Action / Switch Audits (0x0700)","MOTOR_TRANSITION_FAILURE","Motor Current Seen, Failed to Enter New State","Audit","0x070C","0x0000","None - no data (defaulted to 0x0000)","Y","Y","Y","Y","N","N","N","N","N","N","Y","N","N","N"]
["Door Action / Switch Audits (0x0700)","MOTOR_TRANSITION_FAILURE","Motor transition failure, State mismatch found during unlock operation","Audit","0x070C","0x0001","State mismatch during Unlock","N","N","N","N","N","N","N","N","N","N","N","N","Y","N","2022-07-22"]
["Door Action / Switch Audits (0x0700)","MOTOR_TRANSITION_FAILURE","Motor transition failure, State mismatch found during relock operation","Audit","0x070C","0x0002","State mismatch during Relock","N","N","N","N","N","N","N","N","N","N","N","N","Y","N","2022-07-22"]
["Door Action / Switch Audits (0x0700)","DOG_ON_NEXT_EXIT_FAILURE","Failure of Dogging Latch Hook And Trigger","Audit","0x070D","0x0000","None - no data (defaulted to 0x0000)","Y","Y","Y","Y","N","N","N","N","N","N","Y","N","N","N"]
["Door Action / Switch Audits (0x0700)","DPS_NO_LATCH_EXT","Door Closed, Latch Not Extended","Audit","0x070E","0x0000","None - no data (defaulted to 0x0000)","Y","Y","Y","Y","N","N","N","N","N","N","C","N","N","N"]
["Door Action / Switch Audits (0x0700)","TEMP","Temp Sensor Raw Value","Audit","0x070F","0xXXXX","XXXX = ADC Counts","Y","Y","Y","Y","N","N","N","N","N","N","Y","N","N","N"]
["Door Action / Switch Audits (0x0700)","LIGHT","Light Sensor Raw Value","Audit","0x0710","0xXXXX","XXXX = ADC Counts","Y","Y","Y","Y","N","N","N","N","N","N","Y","N","N","N"]
["Door Action / Switch Audits (0x0700)","RX_LX_FAILURE","LX Not Seen During RX Event","Audit","0x0711","0x0000","None - no data (defaulted to 0x0000)","Y","Y","Y","Y","N","N","N","N","N","N","Y","N","N","N"]
["Door Action / Switch Audits (0x0700)","REL_SWITCH","Remote Release Triggered","Audit","0x0712","0x0000","None - no data (defaulted to 0x0000)","Y","Y","Y","Y","Y","N","N","N","N","N","N","N","N","N"]
["Door Action / Switch Audits (0x0700)","READER_TAMPER","Reader Tamper Alert","Both","0x0713","0x0000","None - no data (defaulted to 0x0000)","Y","Y","Y","Y","Y","N","N","N","N","N","N","N","N","N"]
["Door Action / Switch Audits (0x0700)","AUX_ENABLED","Auxiliary Enabled","Audit","0x0714","0x0000","None - no data (defaulted to 0x0000)","Y","Y","Y","Y","Y","N","N","N","N","N","N","N","N","N"]
["Door Action / Switch Audits (0x0700)","AUX_DISABLED","Auxiliary Disabled","Audit","0x0715","0x0000","None - no data (defaulted to 0x0000)","Y","Y","Y","Y","Y","N","N","N","N","N","N","N","N","N"]
["Door Action / Switch Audits (0x0700)","ALARM_ENABLED","Alarm Enabled","Audit","0x0716","0x0000","None - no data (defaulted to 0x0000)","Y","Y","Y","Y","Y","N","N","N","N","N","N","Y","N","N"]
["Door Action / Switch Audits (0x0700)","ALARM_DISABLED","Alarm Disabled","Audit","0x0717","0x0000","None - no data (defaulted to 0x0000)","Y","Y","Y","Y","Y","N","N","N","N","N","N","Y","N","N"]
["Door Action / Switch Audits (0x0700)","REN_SWITCH","Request to Enter","Audit","0x0718","0x0000","None - no data (defaulted to 0x0000)","Y","Y","Y","Y","Y","N","N","N","N","N","N","N","N","N"]
["Door Action / Switch Audits (0x0700)","IPB_STUCK","Interior Push Button Stuck","Both","0x0719","0x0000","IPB Stuck Condition Clear","N","N","N","N","N","N","N","N","N","N","N","N","N","N"]
["Door Action / Switch Audits (0x0700)","IPB_STUCK","Interior Push Button Stuck","Both","0x0719","0x0001","IPB Stuck Condition Set","N","N","N","N","N","N","N","N","N","N","N","N","N","N"]
["Door Action / Switch Audits (0x0700)","AUX_IN","Aux Input Triggered","Audit","0x071A","0x0000","None - no data (defaulted to 0x0000)","Y","Y","Y","Y","N","N","N","N","N","N","N","Y","N","N"]
["Door Action / Switch Audits (0x0700)","TAMPER_CLEARED","Tamper Condition Cleared","Audit","0x071B","0x0000","None - no data (defaulted to 0x0000)","Y","Y","Y","Y","N","N","N","N","N","N","N","Y","N","N"]
["Door Action / Switch Audits (0x0700)","TTL1_ACTIVE","TTL1 Active","Audit","0x071C","0x0000","None - no data (defaulted to 0x0000)","Y","Y","Y","Y","N","N","N","N","N","N","N","Y","N","N"]
["Door Action / Switch Audits (0x0700)","TTL1_INACTIVE","TTL1 Inactive","Audit","0x071D","0x0000","None - no data (defaulted to 0x0000)","Y","Y","Y","Y","N","N","N","N","N","N","N","Y","N","N"]
["Door Action / Switch Audits (0x0700)","TTL2_ACTIVE","TTL2 Active","Audit","0x071E","0x0000","None - no data (defaulted to 0x0000)","Y","Y","Y","Y","N","N","N","N","N","N","N","Y","N","N"]
["Door Action / Switch Audits (0x0700)","TTL2_INACTIVE","TTL2 Inactive","Audit","0x071F","0x0000","None - no data (defaulted to 0x0000)","Y","Y","Y","Y","N","N","N","N","N","N","N","Y","N","N"]
["Door Action / Switch Audits (0x0700)","KEYPAD_LOCKOUT","Keypad entries have been locked out for too many failed attempts","Audit","0x0720","0x0000","None - no data (defaulted to 0x0000)","Y","Y","Y","Y","N","N","N","N","N","N","N","Y","N","N"]
["Door Action / Switch Audits (0x0700)","DOOR_OPEN","Door Open","Audit","0x0721","0x0000","None - no data (defaulted to 0x0000)","N","N","N","N","N","N","N","N","N","N","N","Y","N","N"]
["Door Action / Switch Audits (0x0700)","DOOR_CLOSED","Door Closed","Audit","0x0722","0x0000","None - no data (defaulted to 0x0000)","N","N","N","N","N","N","N","N","N","N","N","Y","N","N"]
["Door Action / Switch Audits (0x0700)","MECHANICAL_OVERRIDE","Mechanical Override ","Audit","0x0723","0x0001","Unlock","N","N","N","N","N","N","N","N","N","N","N","N","Y","N","2023-05-18"]
["Door Action / Switch Audits (0x0700)","MECHANICAL_OVERRIDE","Mechanical Override ","Audit","0x0723","0x0002","Lock","N","N","N","N","N","N","N","N","N","N","N","N","Y","N","2023-05-18"]
["Firmware Update Audits (0x0800)","LOCK_PROGRAMMED  ","Lock Programmed  ","Audit","0x0800","0x0100","Main Application Success","Y","Y","Y","Y","Y","N","N","Y","Y","Y","Y","Y","Y","N"]
["Firmware Update Audits (0x0800)","LOCK_PROGRAMMED  ","Lock Programmed  ","Audit","0x0800","0x01FF","Main Application Fail","Y","Y","Y","Y","Y","N","N","Y","Y","Y","Y","Y","Y","N"]
["Firmware Update Audits (0x0800)","LOCK_PROGRAMMED  ","Lock Programmed  ","Audit","0x0800","0x0200","Bluetooth Module Success","Y","Y","Y","Y","Y","N","N","Y","Y","Y","Y","Y","Y","N"]
["Firmware Update Audits (0x0800)","LOCK_PROGRAMMED  ","Lock Programmed  ","Audit","0x0800","0x02FF","Bluetooth Module Fail","Y","Y","Y","Y","Y","N","N","Y","Y","Y","Y","Y","Y","N"]
["Firmware Update Audits (0x0800)","LOCK_PROGRAMMED  ","Lock Programmed  ","Audit","0x0800","0x0300","WIFI Module Success","Y","Y","Y","Y","Y","N","N","N","N","N","Y","N","N","N"]
["Firmware Update Audits (0x0800)","LOCK_PROGRAMMED  ","Lock Programmed  ","Audit","0x0800","0x03FF","WIFI Module Fail","Y","Y","Y","Y","Y","N","N","N","N","N","Y","N","N","N"]
["Firmware Update Audits (0x0800)","LOCK_PROGRAMMED  ","Lock Programmed  ","Audit","0x0800","0x0400","Reader Module Success","Y","Y","Y","Y","Y","N","N","N","N","N","N","Y","Y","N"]
["Firmware Update Audits (0x0800)","LOCK_PROGRAMMED  ","Lock Programmed  ","Audit","0x0800","0x04FF","Reader Module Fail","Y","Y","Y","Y","Y","N","N","N","N","N","N","Y","Y","N"]
["Firmware Update Audits (0x0800)","LOCK_PROGRAMMED  ","Lock Programmed  ","Audit","0x0800","0x0500","Ethernet Module Success","Y","Y","Y","Y","Y","N","N","N","N","N","N","Y","N","N"]
["Firmware Update Audits (0x0800)","LOCK_PROGRAMMED  ","Lock Programmed  ","Audit","0x0800","0x05FF","Ethernet Module Fail","Y","Y","Y","Y","Y","N","N","N","N","N","N","Y","N","N"]
["Firmware Update Audits (0x0800)","LOCK_PROGRAMMED  ","Lock Programmed  ","Audit","0x0800","0x0600","Reader Main Module Success","Y","Y","Y","Y","Y","N","N","N","N","N","N","Y","N","N"]
["Firmware Update Audits (0x0800)","LOCK_PROGRAMMED  ","Lock Programmed  ","Audit","0x0800","0x06FF","Reader Main Module Fail","Y","Y","Y","Y","Y","N","N","N","N","N","N","Y","N","N"]
["Firmware Update Audits (0x0800)","LOCK_FFR","Firmware Reset to Factory Version","Audit","0x0801","0x0000","None - no data (defaulted to 0x0000)","Y","Y","Y","Y","Y","N","N","N","N","N","Y","N","N","N"]
["Firmware Update Audits (0x0800)","LOCK_UPDATE","Firmware Updated","Audit","0x0802","0x0000","None - no data (defaulted to 0x0000)","Y","Y","Y","Y","Y","N","N","N","N","N","Y","Y","Y","N"]
["Firmware Update Audits (0x0800)","LOCK_IMAGE_INVALID","Firmware Image Invalid","Audit","0x0803","0x0000","None - no data (defaulted to 0x0000)","Y","Y","Y","Y","Y","N","N","Y","Y","Y","Y","Y","Y","N"]
["Firmware Update Audits (0x0800)","LOCK_IMAGE_INCOMPATIBLE","Firmware Image Incompatible","Audit","0x0804","0x0000","None - no data (defaulted to 0x0000)","Y","Y","Y","Y","Y","N","N","N","Y","Y","Y","Y","Y","N"]
["JSON Audits (0x0900)","PARSE_ERROR                   ","Data Parse Event ","Audit","0x0900","0x0000","Data Framing Error","Y","Y","Y","Y","Y","N","N","Y","Y","Y","Y","Y","Y","N"]
["JSON Audits (0x0900)","PARSE_ERROR                   ","Data Parse Event ","Audit","0x0900","0x0001","Invalid JSON tag","Y","Y","Y","Y","Y","N","N","Y","Y","Y","Y","Y","Y","N","2021-03-22"]
["JSON Audits (0x0900)","PARSE_ERROR                   ","Data Parse Event ","Audit","0x0900","0x0002","JSON Framing Error","Y","Y","Y","Y","Y","N","N","Y","Y","Y","Y","Y","Y","N"]
["JSON Audits (0x0900)","PARSE_ERROR                   ","Data Parse Event ","Audit","0x0900","0x0003","JSON Data Error","Y","Y","Y","Y","Y","N","N","N","N","N","Y","Y","Y","N","2025-03-19"]
["JSON Audits (0x0900)","PARSE_ERROR                   ","Data Parse Event ","Audit","0x0900","0x0004","JSON Token Buffer Error","Y","Y","Y","Y","Y","N","N","Y","Y","Y","Y","Y","Y","N"]
["JSON Audits (0x0900)","PARSE_ERROR                   ","Data Parse Event ","Audit","0x0900","0x0005","Partial Data Packet Error","Y","Y","Y","Y","Y","N","N","N","N","N","Y","Y","Y","N"]
["JSON Audits (0x0900)","PARSE_ERROR                   ","Data Parse Event ","Audit","0x0900","0x0006","Data Error - User Record","Y","Y","Y","Y","Y","N","N","Y","Y","Y","Y","Y","Y","N"]
["JSON Audits (0x0900)","PARSE_ERROR                   ","Data Parse Event ","Audit","0x0900","0x0007","Data Error - Delete User Record","Y","Y","Y","Y","Y","N","N","Y","Y","Y","Y","Y","Y","N"]
["JSON Audits (0x0900)","PARSE_ERROR                   ","Data Parse Event ","Audit","0x0900","0x0008","Data Error - Credential Schedule","Y","Y","Y","Y","Y","N","N","Y","Y","Y","Y","Y","Y","N"]
["JSON Audits (0x0900)","PARSE_ERROR                   ","Data Parse Event ","Audit","0x0900","0x0009","Data Error - Holiday Schedule","Y","Y","Y","Y","Y","N","N","N","N","N","Y","Y","Y","N"]
["JSON Audits (0x0900)","PARSE_ERROR                   ","Data Parse Event ","Audit","0x0900","0x000A","Data Error - Auto Unlock","Y","Y","Y","Y","Y","N","N","N","N","N","Y","Y","Y","N"]
["JSON Audits (0x0900)","PARSE_ERROR                   ","Data Parse Event ","Audit","0x0900","0x000B","Data Error - Lock Configuration","Y","Y","Y","Y","Y","N","N","N","N","N","Y","Y","Y","N","2025-03-19"]
["JSON Audits (0x0900)","PARSE_ERROR                   ","Data Parse Event ","Audit","0x0900","0x000C","Data Error - Wi-Fi Configuration","Y","Y","Y","Y","Y","N","N","N","N","N","Y","N","N","N"]
["JSON Audits (0x0900)","PARSE_ERROR                   ","Data Parse Event ","Audit","0x0900","0x000D","Data Error - NVM Write","Y","Y","Y","Y","Y","N","N","Y","Y","Y","Y","Y","Y","N"]
["JSON Audits (0x0900)","PARSE_ERROR                   ","Data Parse Event ","Audit","0x0900","0x000E","Invalid User Record Sequence Error","Y","Y","Y","Y","Y","N","N","Y","Y","Y","Y","Y","Y","N"]
["JSON Audits (0x0900)","PARSE_ERROR                   ","Data Parse Event ","Audit","0x0900","0x000F","Data Error - Received Block is Too Large","Y","Y","Y","Y","Y","N","N","Y","Y","Y","Y","Y","Y","N"]
["JSON Audits (0x0900)","PARSE_ERROR                   ","Data Parse Event ","Audit","0x0900","0x0010","Null Buffer Received Error","Y","Y","Y","Y","Y","N","N","Y","Y","Y","Y","Y","Y","N"]
["JSON Audits (0x0900)","PARSE_ERROR                   ","Data Parse Event ","Audit","0x0900","0x0011","Parse Successful","Y","Y","Y","Y","Y","N","N","Y","Y","Y","Y","Y","Y","N"]
["JSON Audits (0x0900)","PARSE_ERROR                   ","Data Parse Event ","Audit","0x0900","0x001A","Parse Multistep Sequence Error - Error detection in sequencing during a multipart database transfer.","N","N","N","N","N","N","N","N","N","N","N","Y","N","N","2020-08-19"]
["JSON Audits (0x0900)","PARSE_ERROR","Data Parse Event","Audit","0x0900","0x001B","Data Error - Extended Credential Schedule","N","N","N","N","N","N","N","N","N","N","N","Y","N","N","2022-09-08"]
["JSON Audits (0x0900)","PARSE_ERROR","Data Parse Event","Audit","0x0900","0x001C","Data Parse Error - Partial/Invalid Credential Schedule.","Y","Y","N","Y","Y","N","N","Y","Y","Y","N","N","N","N","2025-07-21"]
["JSON Audits (0x0900)","PARSE_IGNORED_DATA","Data Parser Ignored Data","Audit","0x0901","0x0000","Ignored one or more JSON tags, including valid Non CERT tags (valid form but not supported)","Y","Y","Y","Y","Y","N","N","Y","Y","Y","Y","Y","Y","N","2021-03-22"]
["RTCC Audits (0x0A00)","DST_CHANGED_TIME  ","Daylight Saving Time Event ","Audit","0x0A00","0x0001","Change Backward","Y","Y","Y","Y","Y","N","N","Y","Y","Y","Y","Y","Y","N"]
["RTCC Audits (0x0A00)","DST_CHANGED_TIME  ","Daylight Saving Time Event ","Audit","0x0A00","0x0002","Change Forward","Y","Y","Y","Y","Y","N","N","Y","Y","Y","Y","Y","Y","N"]
["RTCC Audits (0x0A00)","RTCC_ERROR ","Real Time Clock ","Audit","0x0A01","0x0001","Invalid Time Error","Y","Y","Y","Y","Y","N","N","Y","Y","Y","Y","Y","Y","N"]
["RTCC Audits (0x0A00)","RTCC_ERROR ","Real Time Clock ","Audit","0x0A01","0x0002","Increment Error","Y","Y","Y","Y","Y","N","N","Y","Y","Y","Y","Y","Y","N"]
["RTCC Audits (0x0A00)","RTCC_ERROR ","Real Time Clock","Audit","0x0A01","0x0003","External RTCC/Clock Error","N","N","N","N","N","N","N","N","N","Y","N","N","Y","N","2022-01-19"]
["RTCC Audits (0x0A00)","TIME_CHANGE","Real Time Clock Value Changed","Audit","0x0A02","0xXXXX","Data representes the timedifference LSB in seconds (defaulted to 0x0000, when no data or not applicable)","Y","Y","Y","Y","Y","N","N","Y","Y","Y","Y","Y","Y","N"]
["RTCC Audits (0x0A00)","TIME_CHANGE","Real Time Clock Value Changed (MSB)","Audit","0x0A03","0xXXXX","Data representes the timedifference MSB in seconds only when presents","N","N","N","N","N","N","N","N","N","N","N","Y","N","N","2025-10-27"]
["WIFI Audits (0x0B00)","WIFI_ON_OFF                   ","Wi-Fi Power Status ","Audit","0x0B00","0x0000","Off","Y","Y","Y","Y","Y","N","N","N","N","N","Y","N","N","N"]
["WIFI Audits (0x0B00)","WIFI_ON_OFF                   ","Wi-Fi Power Status ","Audit","0x0B00","0x0001","On","Y","Y","Y","Y","Y","N","N","N","N","N","Y","N","N","N"]
["WIFI Audits (0x0B00)","WIFI_AP_ASSOC_DISASSOC        ","Wi-Fi Association Status ","Audit","0x0B01","0x0000","Disassociated","Y","Y","Y","Y","Y","N","N","N","N","N","Y","N","N","N"]
["WIFI Audits (0x0B00)","WIFI_AP_ASSOC_DISASSOC        ","Wi-Fi Association Status ","Audit","0x0B01","0x0001","Associated","Y","Y","Y","Y","Y","N","N","N","N","N","Y","N","N","N"]
["WIFI Audits (0x0B00)","WIFI_AP_ASSOC_FAIL            ","Wi-Fi Event ","Audit","0x0B02","0x0000","WIFI_CMD_ACK_SUCCESS ","Y","Y","Y","Y","Y","N","N","N","N","N","Y","N","N","N"]
["WIFI Audits (0x0B00)","WIFI_AP_ASSOC_FAIL            ","Wi-Fi Event ","Audit","0x0B02","0x0001","WIFI_CMD_ACK_NOT_INITIALIZED ","Y","Y","Y","Y","Y","N","N","N","N","N","Y","N","N","N"]
["WIFI Audits (0x0B00)","WIFI_AP_ASSOC_FAIL            ","Wi-Fi Event ","Audit","0x0B02","0x0006","WIFI_CMD_ACK_AP_CONFIG_FAILURE ","Y","Y","Y","Y","Y","N","N","N","N","N","Y","N","N","N"]
["WIFI Audits (0x0B00)","WIFI_AP_ASSOC_FAIL            ","Wi-Fi Event ","Audit","0x0B02","0x0007"," WIFI_CMD_ACK_AP_ASSOCIATE_FAILURE  ","Y","Y","Y","Y","Y","N","N","N","N","N","Y","N","N","N"]
["WIFI Audits (0x0B00)","WIFI_AP_ASSOC_FAIL            ","Wi-Fi Event ","Audit","0x0B02","0x0045"," WIFI_CMD_ACK_CONFIG_CLIENT_MODE_FAILED ","Y","Y","Y","Y","Y","N","N","N","N","N","Y","N","N","N"]
["WIFI Audits (0x0B00)","WIFI_AP_ASSOC_FAIL            ","Wi-Fi Event ","Audit","0x0B02","0x0053","WIFI_CMD_ACK_AP_AUTH_ERROR","Y","Y","Y","Y","Y","N","N","N","N","N","Y","N","N","N"]
["WIFI Audits (0x0B00)","WIFI_AP_ASSOC_FAIL            ","Wi-Fi Event ","Audit","0x0B02","0x0054","WIFI_CMD_ACK_AP_ROUTER_NOT_FOUND","Y","Y","Y","Y","Y","N","N","N","N","N","Y","N","N","N"]
["WIFI Audits (0x0B00)","WIFI_AP_ASSOC_FAIL            ","Wi-Fi Event ","Audit","0x0B02","0x0055","WIFI_CMD_ACK_AP_EAP_FAILED","Y","Y","Y","Y","Y","N","N","N","N","N","Y","N","N","N"]
["WIFI Audits (0x0B00)","WIFI_AP_ASSOC_FAIL            ","Wi-Fi Event ","Audit","0x0B02","0xXXXX","Additional posibilities (See Wifi Sheet for Full List )","Y","Y","Y","Y","Y","N","N","N","N","N","Y","N","N","N"]
["WIFI Audits (0x0B00)","WIFI_RSSI                     ","Wi-Fi RSSI Value (in -dBm) ","Audit","0x0B03","0xXXXX","RSSI DB Value (Received Signal Strength Indicator)","Y","Y","Y","Y","Y","N","N","N","N","N","Y","N","N","N"]
["WIFI Audits (0x0B00)","WIFI_HOST_CONNECT_DISCONNECT  ","Wi-Fi Host Connection  ","Audit","0x0B04","0x0000","Disconnected","Y","Y","Y","Y","Y","N","N","N","N","N","Y","N","N","N"]
["WIFI Audits (0x0B00)","WIFI_HOST_CONNECT_DISCONNECT  ","Wi-Fi Host Connection  ","Audit","0x0B04","0x0001","Connected","Y","Y","Y","Y","Y","N","N","N","N","N","Y","N","N","N"]
["WIFI Audits (0x0B00)","WIFI_HOST_CONN_FAIL           ","Wi-Fi Host Connection Event ","Audit","0x0B05","0x0000","WIFI_CMD_ACK_SUCCESS","Y","Y","Y","Y","Y","N","N","N","N","N","Y","N","N","N"]
["WIFI Audits (0x0B00)","WIFI_HOST_CONN_FAIL           ","Wi-Fi Host Connection Event ","Audit","0x0B05","0x0001","WIFI_CMD_ACK_NOT_INITIALIZED","Y","Y","Y","Y","Y","N","N","N","N","N","Y","N","N","N"]
["WIFI Audits (0x0B00)","WIFI_HOST_CONN_FAIL           ","Wi-Fi Host Connection Event ","Audit","0x0B05","0x0010","WIFI_CMD_ACK_HOST_CONNECT_FAILURE","Y","Y","Y","Y","Y","N","N","N","N","N","Y","N","N","N"]
["WIFI Audits (0x0B00)","WIFI_HOST_CONN_FAIL           ","Wi-Fi Host Connection Event ","Audit","0x0B05","0x0011","WIFI_CMD_ACK_HOST_DISCOVERY_FAILURE","Y","Y","Y","Y","Y","N","N","N","N","N","Y","N","N","N"]
["WIFI Audits (0x0B00)","WIFI_HOST_CONN_FAIL           ","Wi-Fi Host Connection Event ","Audit","0x0B05","0xXXXX","Additional posibilities (See Wifi Sheet for Full List )","Y","Y","Y","Y","Y","N","N","N","N","N","Y","N","N","N"]
["WIFI Audits (0x0B00)","WIFI_GOT_VALID_HTTP_HEAD   ","Valid HTTP Header Received via Wi-Fi","Audit","0x0B06","0x0000","None - no data (defaulted to 0x0000)","Y","Y","Y","Y","Y","N","N","N","N","N","Y","N","N","N"]
["WIFI Audits (0x0B00)","WIFI_DLD_SUCCESS  ","Download via Wi-Fi Successful","Audit","0x0B07","0x0000","WIFI_OLD_SUCCESS","Y","Y","Y","Y","Y","N","N","N","N","N","Y","N","N","N"]
["WIFI Audits (0x0B00)","WIFI_DLD_SUCCESS  ","Download via Wi-Fi Successful","Audit","0x0B07","0x0057","WIFI_CMD_ACK_HOST_TLS_CERT_OLD_SUCCESS","Y","Y","Y","Y","Y","N","N","N","N","N","Y","N","N","N"]
["WIFI Audits (0x0B00)","WIFI_DLD_SUCCESS  ","Download via Wi-Fi Successful","Audit","0x0B07","0xXXXX","Additional posibilities (See Wifi Sheet for Full List )","Y","Y","Y","Y","Y","N","N","N","N","N","Y","N","N","N"]
["WIFI Audits (0x0B00)","WIFI_DLD_FAIL                 ","Wi-Fi Download Event ","Audit","0x0B08","0x0000","WIFI_CMD_ACK_SUCCESS","Y","Y","Y","Y","Y","N","N","N","N","N","Y","N","N","N"]
["WIFI Audits (0x0B00)","WIFI_DLD_FAIL                 ","Wi-Fi Download Event ","Audit","0x0B08","0x0001","WIFI_CMD_ACK_NOT_INITIALIZED","Y","Y","Y","Y","Y","N","N","N","N","N","Y","N","N","N"]
["WIFI Audits (0x0B00)","WIFI_DLD_FAIL                 ","Wi-Fi Download Event ","Audit","0x0B08","0x0026","WIFI_CMD_ACK_FLASH_WRITE_FAILED","Y","Y","Y","Y","Y","N","N","N","N","N","Y","N","N","N"]
["WIFI Audits (0x0B00)","WIFI_DLD_FAIL                 ","Wi-Fi Download Event ","Audit","0x0B08","0x0033","WIFI_CMD_ACK_OLD_INTERRUPT_FDR","Y","Y","Y","Y","Y","N","N","N","N","N","Y","N","N","N"]
["WIFI Audits (0x0B00)","WIFI_DLD_FAIL                 ","Wi-Fi Download Event ","Audit","0x0B08","0x0034","WIFI_CMD_ACK_OLD_INTERRUPT_PM","Y","Y","Y","Y","Y","N","N","N","N","N","Y","N","N","N"]
["WIFI Audits (0x0B00)","WIFI_DLD_FAIL                 ","Wi-Fi Download Event ","Audit","0x0B08","0x0036","WIFI_CMD_OLD_AP_DISCONNECT","Y","Y","Y","Y","Y","N","N","N","N","N","Y","N","N","N"]
["WIFI Audits (0x0B00)","WIFI_DLD_FAIL                 ","Wi-Fi Download Event ","Audit","0x0B08","0x0041","WIFI_CMD_ACK_OLD_INTERRUPT_ALLERT","Y","Y","Y","Y","Y","N","N","N","N","N","Y","N","N","N"]
["WIFI Audits (0x0B00)","WIFI_DLD_FAIL                 ","Wi-Fi Download Event ","Audit","0x0B08","0x0058","WIFI_CMD_ACK_HTTP_RESPONSE_EXCEEDS_MAX_LEN","Y","Y","Y","Y","Y","N","N","N","N","N","N","N","N","N"]
["WIFI Audits (0x0B00)","WIFI_DLD_FAIL                 ","Wi-Fi Download Event ","Audit","0x0B08","0xXXXX","Additional posibilities (See Wifi Sheet for Full List )","Y","Y","Y","Y","Y","N","N","N","N","N","Y","N","N","N"]
["WIFI Audits (0x0B00)","WIFI_CONFIG_UPDATE  ","Wi-Fi Configuration Updated  ","Audit","0x0B09","0x0000","None - no data (defaulted to 0x0000)","Y","Y","Y","Y","Y","N","N","N","N","N","Y","N","N","N"]
["WIFI Audits (0x0B00)","WIFI_EVENT_TRIG               ","Wi-Fi Event Triggered               ","Audit","0x0B0A","0x0000","None - no data (defaulted to 0x0000)","N","N","N","N","N","N","N","N","N","N","N","N","N","N"]
["WIFI Audits (0x0B00)","WIFI_ON_FAIL                  ","Wi-Fi Module Power-On Failed                  ","Audit","0x0B0B","0x0000","None - no data (defaulted to 0x0000)","N","N","N","N","N","N","N","N","N","N","N","N","N","N"]
["WIFI Audits (0x0B00)","WIFI_HTTP_ERROR","WIFI HTTP Error","Audit","0x0B0C","0xXXXX","WiFi HTTP Error (XXXX = hex value of standard HTTP error)","Y","Y","Y","Y","Y","N","N","N","N","N","Y","N","N","N"]
["WIFI Audits (0x0B00)","WIFI_UPDATE_CONFIG_FAIL","WIFI Configuration Unable to Upload","Audit","0x0B0D","0x0000","None - no data (defaulted to 0x0000)","Y","Y","Y","Y","Y","N","N","N","N","N","Y","N","N","N"]
["WIFI Audits (0x0B00)","WIFI_NEW_AP_UPDATE","New Access Point Configuration Change","Audit","0x0B0E","0x0000","New Access Point Config is successfully accepted","Y","Y","Y","Y","Y","N","N","N","N","N","Y","N","N","N"]
["WIFI Audits (0x0B00)","WIFI_NEW_AP_UPDATE","New Access Point Configuration Change","Audit","0x0B0E","0x0001","New Access Point Config is successfully deleted","Y","Y","Y","Y","Y","N","N","N","N","N","Y","N","N","N"]
["WIFI Audits (0x0B00)","WIFI_NEW_AP_UPDATE","New Access Point Configuration Change","Audit","0x0B0E","0x0002","Devices successfully switched over from current access point to new Access Point","Y","Y","Y","Y","Y","N","N","N","N","N","Y","N","N","N"]
["WIFI Audits (0x0B00)","WIFI_NEW_AP_UPDATE","New Access Point Configuration Change","Audit","0x0B0E","0x0003","New Access Point Config is invalid","Y","Y","Y","Y","Y","N","N","N","N","N","Y","N","N","N"]
["WIFI Audits (0x0B00)","WIFI_NEW_AP_UPDATE","New Access Point Configuration Change","Audit","0x0B0E","0x0004","New Access Point Config switch time is invalid","Y","Y","Y","Y","Y","N","N","N","N","N","Y","N","N","N"]
["System Current Audits (0x0C00)","SLEEP_CURRENT  ","Sleep Current (in uA) ","Audit","0x0C00","0xXXXX","Sleep Current in uA","Y","Y","Y","Y","Y","N","N","N","N","N","Y","N","Y","N"]
["System Current Audits (0x0C00)","SLEEP_CURRENT_WITH_BLE        ","Sleep Current With BLE (in uA)","Audit","0x0C01","0xXXXX","Sleep Current in uA","Y","Y","Y","Y","Y","N","N","N","N","N","Y","N","N","N"]
["System Current Audits (0x0C00)","MOTOR_CURRENT","Motor Status","Audit","0x0C02","0x0001","Failed to Turn On","Y","Y","Y","Y","Y","N","N","N","N","N","Y","N","Y","N"]
["System Current Audits (0x0C00)","MOTOR_CURRENT","Motor Status","Audit","0x0C02","0x0002","Failed to Turn Off","Y","Y","Y","Y","Y","N","N","N","N","N","Y","N","Y","N"]
["System Current Audits (0x0C00)","READER_CURRENT","Reader Current (in mA)","Audit","0x0C04","0xXXXX","Daily Max Current in mA","Y","Y","Y","Y","Y","N","N","N","N","N","N","N","N","N"]
["System Current Audits (0x0C00)","POWERED_OUTPUT_CURRENT","Powered Output Current (in mA) ","Audit","0x0C05","0xXXXX","Daily Max Current in mA","Y","Y","Y","Y","Y","N","N","N","N","N","N","N","N","N"]
["System Current Audits (0x0C00)","READER_CURRENT_FAULT","Reader Power Fault Detected","Audit","0x0C06","0x0000","None - no data (defaulted to 0x0000)","Y","Y","Y","Y","Y","N","N","N","N","N","N","N","N","N"]
["System Current Audits (0x0C00)","POWERED_OUTPUT_FAULT","Powered Output Fault Detected","Audit","0x0C07","0x0000","None - no data (defaulted to 0x0000)","Y","Y","Y","Y","Y","N","N","N","N","N","N","Y","N","N"]
["System Diagnostic Audits (0x0D00)","IBIT_RESULT   ","Initiated Built-In-Test ","Audit","0x0D00","0x0000","BLE Module (0x00), Pass (0x00)","Y","Y","Y","Y","Y","N","N","N","N","N","Y","N","Y","N"]
["System Diagnostic Audits (0x0D00)","IBIT_RESULT   ","Initiated Built-In-Test ","Audit","0x0D00","0x00FF","BLE Module (0x00), Fail (0xFF)","Y","Y","Y","Y","Y","N","N","N","N","N","Y","N","Y","N"]
["System Diagnostic Audits (0x0D00)","IBIT_RESULT   ","Initiated Built-In-Test ","Audit","0x0D00","0x00FF","BLE Module (0x00), Fail (0xFF)","Y","Y","Y","Y","Y","N","N","N","N","N","Y","N","Y","N"]
["System Diagnostic Audits (0x0D00)","IBIT_RESULT   ","Initiated Built-In-Test ","Audit","0x0D00","0x0100","Reader Comm (0x01), Pass (0x00)","Y","Y","Y","Y","Y","N","N","N","N","N","Y","Y","Y","N"]
["System Diagnostic Audits (0x0D00)","IBIT_RESULT   ","Initiated Built-In-Test ","Audit","0x0D00","0x01FE","Reader Comm  (0x01), Timeout (0xFE)","Y","Y","Y","Y","Y","N","N","N","N","N","Y","Y","Y","N"]
["System Diagnostic Audits (0x0D00)","IBIT_RESULT   ","Initiated Built-In-Test ","Audit","0x0D00","0x01FF","Reader Comm  (0x01), Fail (0xFF)","Y","Y","Y","Y","Y","N","N","N","N","N","Y","Y","Y","N"]
["System Diagnostic Audits (0x0D00)","IBIT_RESULT   ","Initiated Built-In-Test ","Audit","0x0D00","0x0200","UI Alert (0x02), Pass (0x00)","N","N","N","N","N","N","N","N","N","N","N","Y","N","N"]
["System Diagnostic Audits (0x0D00)","IBIT_RESULT   ","Initiated Built-In-Test ","Audit","0x0D00","0x02FE","UI Alert  (0x02), Timeout (0xFE)","N","N","N","N","N","N","N","N","N","N","N","Y","N","N"]
["System Diagnostic Audits (0x0D00)","IBIT_RESULT   ","Initiated Built-In-Test ","Audit","0x0D00","0x02FF","UI Alert  (0x02), Fail (0xFF)","N","N","N","N","N","N","N","N","N","N","N","Y","N","N"]
["System Diagnostic Audits (0x0D00)","IBIT_RESULT   ","Initiated Built-In-Test ","Audit","0x0D00","0x0300","Input Detect (0x03), Pass (0x00)","Y","Y","Y","Y","Y","N","N","N","N","N","Y","Y","N","N"]
["System Diagnostic Audits (0x0D00)","IBIT_RESULT   ","Initiated Built-In-Test ","Audit","0x0D00","0x03FE","Input Detect  (0x03), Timeout (0xFE)","Y","Y","Y","Y","Y","N","N","N","N","N","Y","Y","N","N"]
["System Diagnostic Audits (0x0D00)","IBIT_RESULT   ","Initiated Built-In-Test ","Audit","0x0D00","0x03FF","Input Detect  (0x03), Fail (0xFF)","Y","Y","Y","Y","Y","N","N","N","N","N","Y","Y","N","N"]
["System Diagnostic Audits (0x0D00)","IBIT_RESULT   ","Initiated Built-In-Test ","Audit","0x0D00","0x0400","External Flash (0x04), Pass (0x00)","Y","Y","Y","Y","Y","N","N","N","N","N","Y","Y","Y","N"]
["System Diagnostic Audits (0x0D00)","IBIT_RESULT   ","Initiated Built-In-Test ","Audit","0x0D00","0x04FE","External Flash (0x04), Timeout (0xFE)","Y","Y","Y","Y","Y","N","N","N","N","N","Y","Y","Y","N"]
["System Diagnostic Audits (0x0D00)","IBIT_RESULT   ","Initiated Built-In-Test ","Audit","0x0D00","0x04FF","External Flash (0x04), Fail (0xFF)","Y","Y","Y","Y","Y","N","N","N","N","N","Y","Y","Y","N"]
["System Diagnostic Audits (0x0D00)","IBIT_RESULT   ","Initiated Built-In-Test ","Audit","0x0D00","0x0500","RTCC (0x05), Pass (0x00)","Y","Y","Y","Y","Y","N","N","N","N","N","Y","Y","Y","N"]
["System Diagnostic Audits (0x0D00)","IBIT_RESULT   ","Initiated Built-In-Test ","Audit","0x0D00","0x0501","RTCC (0x05), Self Test Invalid Time (0x01)","Y","Y","Y","Y","Y","N","N","N","N","N","Y","Y","Y","N"]
["System Diagnostic Audits (0x0D00)","IBIT_RESULT   ","Initiated Built-In-Test ","Audit","0x0D00","0x0502","RTCC (0x05), Self Test Increment Error (0x02)","Y","Y","Y","Y","Y","N","N","N","N","N","Y","Y","Y","N"]
["System Diagnostic Audits (0x0D00)","IBIT_RESULT   ","Initiated Built-In-Test ","Audit","0x0D00","0x05FE","RTCC (0x05), Timeout (0xFE)","Y","Y","Y","Y","Y","N","N","N","N","N","Y","Y","Y","N"]
["System Diagnostic Audits (0x0D00)","IBIT_RESULT   ","Initiated Built-In-Test ","Audit","0x0D00","0x05FF","RTCC (0x05), Fail (0xFF)","Y","Y","Y","Y","Y","N","N","N","N","N","Y","Y","Y","N"]
["System Diagnostic Audits (0x0D00)","IBIT_RESULT   ","Initiated Built-In-Test ","Audit","0x0D00","0x0600","Battery (0x06), Pass (0x00)","Y","Y","Y","Y","Y","N","N","N","N","N","Y","N","Y","N"]
["System Diagnostic Audits (0x0D00)","IBIT_RESULT   ","Initiated Built-In-Test ","Audit","0x0D00","0x06FE","Battery (0x06), Timeout (0xFE)","Y","Y","Y","Y","Y","N","N","N","N","N","Y","N","Y","N"]
["System Diagnostic Audits (0x0D00)","IBIT_RESULT   ","Initiated Built-In-Test ","Audit","0x0D00","0x06FF","Battery (0x06), Fail (0xFF)","Y","Y","Y","Y","Y","N","N","N","N","N","Y","N","Y","N"]
["System Diagnostic Audits (0x0D00)","IBIT_RESULT   ","Initiated Built-In-Test ","Audit","0x0D00","0x0700","Sleep Current (0x07), Pass (0x00)","Y","Y","Y","Y","Y","N","N","N","N","N","Y","N","Y","N"]
["System Diagnostic Audits (0x0D00)","IBIT_RESULT   ","Initiated Built-In-Test ","Audit","0x0D00","0x0701","Sleep Current (0x07), To High (0x01)","Y","Y","Y","Y","Y","N","N","N","N","N","Y","N","Y","N"]
["System Diagnostic Audits (0x0D00)","IBIT_RESULT   ","Initiated Built-In-Test ","Audit","0x0D00","0x0702","Sleep Current (0x07), To Low - Invalid measure (0x02)","Y","Y","Y","Y","Y","N","N","N","N","N","Y","N","Y","N"]
["System Diagnostic Audits (0x0D00)","IBIT_RESULT   ","Initiated Built-In-Test ","Audit","0x0D00","0x07FE","Sleep Current (0x07), Timeout (0xFE)","Y","Y","Y","Y","Y","N","N","N","N","N","Y","N","Y","N"]
["System Diagnostic Audits (0x0D00)","IBIT_RESULT   ","Initiated Built-In-Test ","Audit","0x0D00","0x07FF","Sleep Current (0x07), Unknown (0xFF)","Y","Y","Y","Y","Y","N","N","N","N","N","Y","N","Y","N"]
["System Diagnostic Audits (0x0D00)","IBIT_RESULT   ","Initiated Built-In-Test ","Audit","0x0D00","0x0800","Lock Configuration (0x08), Pass (0x00)","N","N","N","N","N","N","N","N","N","N","N","Y","Y","N"]
["System Diagnostic Audits (0x0D00)","IBIT_RESULT   ","Initiated Built-In-Test ","Audit","0x0D00","0x08FE","Lock Configuration (0x08), Timeout","N","N","N","N","N","N","N","N","N","N","N","Y","N","N"]
["System Diagnostic Audits (0x0D00)","IBIT_RESULT   ","Initiated Built-In-Test ","Audit","0x0D00","0x08FF","Lock Configuration (0x08), Fail (0xFF)","N","N","N","N","N","N","N","N","N","N","N","Y","N","N"]
["System Diagnostic Audits (0x0D00)","IBIT_RESULT   ","Initiated Built-In-Test ","Audit","0x0D00","0x0900","Lock State Machine (0x09), Pass (0x00)","N","N","N","N","N","N","N","N","N","N","N","Y","Y","N"]
["System Diagnostic Audits (0x0D00)","IBIT_RESULT   ","Initiated Built-In-Test ","Audit","0x0D00","0x09FE","Lock State Machine (0x09), Timeout (0xFE)","N","N","N","N","N","N","N","N","N","N","N","Y","Y","N"]
["System Diagnostic Audits (0x0D00)","IBIT_RESULT   ","Initiated Built-In-Test ","Audit","0x0D00","0x09FF","Lock State Machine (0x09), Fail (0xFF)","N","N","N","N","N","N","N","N","N","N","N","Y","Y","N"]
["System Diagnostic Audits (0x0D00)","IBIT_RESULT   ","Initiated Built-In-Test ","Audit","0x0D00","0x0A00","Database (0x0A), Pass (0x00)","Y","Y","Y","Y","Y","N","N","N","N","N","Y","Y","Y","N"]
["System Diagnostic Audits (0x0D00)","IBIT_RESULT   ","Initiated Built-In-Test ","Audit","0x0D00","0x0AFE","Database (0x0A), Timeout (0xFE)","Y","Y","Y","Y","Y","N","N","N","N","N","Y","Y","Y","N"]
["System Diagnostic Audits (0x0D00)","IBIT_RESULT   ","Initiated Built-In-Test ","Audit","0x0D00","0x0AFF","Database (0x0A), Fail (0xFF)","Y","Y","Y","Y","Y","N","N","N","N","N","Y","Y","Y","N"]
["System Diagnostic Audits (0x0D00)","IBIT_RESULT   ","Initiated Built-In-Test ","Audit","0x0D00","0x0B00","WiFi (0x0B), Pass (0x00)","Y","Y","Y","Y","Y","N","N","N","N","N","Y","N","N","N"]
["System Diagnostic Audits (0x0D00)","IBIT_RESULT   ","Initiated Built-In-Test ","Audit","0x0D00","0x0B04","WiFi (0x0B), Power-On Failed (0x04)","Y","Y","Y","Y","Y","N","N","N","N","N","Y","N","N","N"]
["System Diagnostic Audits (0x0D00)","IBIT_RESULT   ","Initiated Built-In-Test ","Audit","0x0D00","0x0B06","WiFi (0x0B), Configuration Failed (0x06)","Y","Y","Y","Y","Y","N","N","N","N","N","Y","N","N","N"]
["System Diagnostic Audits (0x0D00)","IBIT_RESULT   ","Initiated Built-In-Test ","Audit","0x0D00","0x0B07","WiFi (0x0B), Association Failed (0x07)","Y","Y","Y","Y","Y","N","N","N","N","N","Y","N","N","N"]
["System Diagnostic Audits (0x0D00)","IBIT_RESULT   ","Initiated Built-In-Test ","Audit","0x0D00","0x0B0A","WiFi (0x0B), Host Connect Attempt Failed (0x0A)","Y","Y","Y","Y","Y","N","N","N","N","N","Y","N","N","N"]
["System Diagnostic Audits (0x0D00)","IBIT_RESULT   ","Initiated Built-In-Test ","Audit","0x0D00","0x0B0C","WiFi (0x0B), WiFi Configurations Not Set (0x0C)","Y","Y","Y","Y","Y","N","N","N","N","N","Y","N","N","N"]
["System Diagnostic Audits (0x0D00)","IBIT_RESULT   ","Initiated Built-In-Test ","Audit","0x0D00","0x0B0D","WiFi (0x0B), Configuration Client Mode Failed (0x0D)","Y","Y","Y","Y","Y","N","N","N","N","N","Y","N","N","N"]
["System Diagnostic Audits (0x0D00)","IBIT_RESULT   ","Initiated Built-In-Test ","Audit","0x0D00","0x0BFE","WiFi (0x0B), Timeout (0xFE)","Y","Y","Y","Y","Y","N","N","N","N","N","Y","N","N","N"]
["System Diagnostic Audits (0x0D00)","IBIT_RESULT   ","Initiated Built-In-Test ","Audit","0x0D00","0x0BFF","WiFi (0x0B), Fail (0xFF)","Y","Y","Y","Y","Y","N","N","N","N","N","Y","N","N","N"]
["System Diagnostic Audits (0x0D00)","IBIT_RESULT   ","Initiated Built-In-Test ","Audit","0x0D00","0x0C00","Overall POST (0x0C), Pass (0x00)","Y","Y","Y","Y","Y","N","N","N","N","N","Y","Y","Y","N"]
["System Diagnostic Audits (0x0D00)","IBIT_RESULT   ","Initiated Built-In-Test ","Audit","0x0D00","0x0CFE","Overal Post (0x0C), Timeout (0xFE)","Y","Y","Y","Y","Y","N","N","N","N","N","Y","Y","Y","N"]
["System Diagnostic Audits (0x0D00)","IBIT_RESULT   ","Initiated Built-In-Test ","Audit","0x0D00","0x0CFF","Overal Post (0x0C), Fail (0xFF)","Y","Y","Y","Y","Y","N","N","N","N","N","Y","Y","Y","N"]
["System Diagnostic Audits (0x0D00)","IBIT_RESULT   ","Initiated Built-In-Test ","Audit","0x0D00","0x0D00","Peripheral HW (0x0D), Pass (0x00)","Y","Y","Y","Y","Y","N","N","N","N","N","Y","Y","Y","N"]
["System Diagnostic Audits (0x0D00)","IBIT_RESULT   ","Initiated Built-In-Test ","Audit","0x0D00","0x0D01","Peripheral HW (0x0D), Gyrometer Sensor Failure (0x01)","Y","Y","Y","Y","Y","N","N","N","N","N","Y","Y","N","N"]
["System Diagnostic Audits (0x0D00)","IBIT_RESULT   ","Initiated Built-In-Test ","Audit","0x0D00","0x0D02","Peripheral HW (0x0D), Security Chip Failure (0x02)","Y","Y","Y","Y","Y","N","N","N","N","N","Y","Y","Y","N"]
["System Diagnostic Audits (0x0D00)","IBIT_RESULT   ","Initiated Built-In-Test ","Audit","0x0D00","0x0D03","Peripheralo HW (0x0D), Accelerometer Sensor Fialure (0x03)","Y","Y","Y","Y","Y","N","N","N","N","N","Y","Y","N","N"]
["System Diagnostic Audits (0x0D00)","IBIT_RESULT   ","Initiated Built-In-Test ","Audit","0x0D00","0x0D04","Peripheral HW (0x0D), BLE Credential Failure (0x04)","Y","Y","Y","Y","Y","N","N","N","N","N","Y","Y","Y","N"]
["System Diagnostic Audits (0x0D00)","IBIT_RESULT   ","Initiated Built-In-Test ","Audit","0x0D00","0x0DFE","Peripheral HW (0x0D), Timeout (0xFE)","Y","Y","Y","Y","Y","N","N","N","N","N","Y","Y","Y","N"]
["System Diagnostic Audits (0x0D00)","IBIT_RESULT   ","Initiated Built-In-Test ","Audit","0x0D00","0x0DFF","Peripheral HW (0x0D), Fail (0xFF)","Y","Y","Y","Y","Y","N","N","N","N","N","Y","Y","Y","N"]
["System Diagnostic Audits (0x0D00)","IBIT_RESULT   ","Initiated Built-In-Test ","Audit","0x0D00","0x0E00","Ethernet (0x0E), Pass (0x00)","N","N","N","N","Y","N","N","N","N","N","N","Y","N","N"]
["System Diagnostic Audits (0x0D00)","IBIT_RESULT   ","Initiated Built-In-Test ","Audit","0x0D00","0x0EFE","Ethernet (0x0E), Timeout (0xFE)","N","N","N","N","Y","N","N","N","N","N","N","Y","N","N"]
["System Diagnostic Audits (0x0D00)","IBIT_RESULT   ","Initiated Built-In-Test ","Audit","0x0D00","0x0EFF","Ethernet (0x0E), Fail (0xFF)","N","N","N","N","Y","N","N","N","N","N","N","Y","N","N"]
["System Diagnostic Audits (0x0D00)","IB_COMM      ","Interboard Communications ","Audit","0x0D01","0x0000","Passed ","Y","Y","Y","Y","Y","N","N","N","N","N","N","N","N","N"]
["System Diagnostic Audits (0x0D00)","IB_COMM      ","Interboard Communications ","Audit","0x0D01","0x0001","Failed ","Y","Y","Y","Y","Y","N","N","N","N","N","N","N","N","N"]
["System Diagnostic Audits (0x0D00)","IB_COMM      ","Interboard Communications ","Audit","0x0D01","0x0002","Reader Reset","Y","Y","Y","Y","Y","N","N","N","N","N","N","N","N","N"]
["System Diagnostic Audits (0x0D00)","IB_COMM      ","Interboard Communications ","Audit","0x0D01","0x0003","New SCBK key generated","N","N","N","N","Y","N","N","N","N","N","N","N","N","N"]
["System Diagnostic Audits (0x0D00)","POST_RESULT  ","POST Test Results  ","Audit","0x0D02","0x0000","BLE Module (0x00), Pass (0x00)","Y","Y","Y","Y","Y","N","N","N","N","N","Y","N","Y","N"]
["System Diagnostic Audits (0x0D00)","POST_RESULT  ","POST Test Results  ","Audit","0x0D02","0x00FF","BLE Module (0x00), Fail (0xFF)","Y","Y","Y","Y","Y","N","N","N","N","N","Y","N","Y","N"]
["System Diagnostic Audits (0x0D00)","POST_RESULT  ","POST Test Results  ","Audit","0x0D02","0x00FF","BLE Module (0x00), Fail (0xFF)","Y","Y","Y","Y","Y","N","N","N","N","N","Y","N","Y","N"]
["System Diagnostic Audits (0x0D00)","POST_RESULT  ","POST Test Results  ","Audit","0x0D02","0x0100","Reader Comm (0x01), Pass (0x00)","Y","Y","Y","Y","Y","N","N","N","N","N","Y","Y","Y","N"]
["System Diagnostic Audits (0x0D00)","POST_RESULT  ","POST Test Results  ","Audit","0x0D02","0x01FE","Reader Comm  (0x01), Timeout (0xFE)","Y","Y","Y","Y","Y","N","N","N","N","N","Y","Y","Y","N"]
["System Diagnostic Audits (0x0D00)","POST_RESULT  ","POST Test Results  ","Audit","0x0D02","0x01FF","Reader Comm  (0x01), Fail (0xFF)","Y","Y","Y","Y","Y","N","N","N","N","N","Y","Y","Y","N"]
["System Diagnostic Audits (0x0D00)","POST_RESULT  ","POST Test Results  ","Audit","0x0D02","0x0200","UI Alert (0x02), Pass (0x00)","N","N","N","N","N","N","N","N","N","N","N","Y","N","N"]
["System Diagnostic Audits (0x0D00)","POST_RESULT  ","POST Test Results  ","Audit","0x0D02","0x02FE","UI Alert  (0x02), Timeout (0xFE)","Y","Y","Y","Y","Y","N","N","N","N","N","Y","Y","N","N"]
["System Diagnostic Audits (0x0D00)","POST_RESULT  ","POST Test Results  ","Audit","0x0D02","0x02FF","UI Alert  (0x02), Fail (0xFF)","Y","Y","Y","Y","Y","N","N","N","N","N","Y","Y","N","N"]
["System Diagnostic Audits (0x0D00)","POST_RESULT  ","POST Test Results  ","Audit","0x0D02","0x0300","Input Detect (0x03), Pass (0x00)","Y","Y","Y","Y","Y","N","N","N","N","N","Y","Y","N","N"]
["System Diagnostic Audits (0x0D00)","POST_RESULT  ","POST Test Results  ","Audit","0x0D02","0x03FE","Input Detect  (0x03), Timeout (0xFE)","Y","Y","Y","Y","Y","N","N","N","N","N","Y","Y","N","N"]
["System Diagnostic Audits (0x0D00)","POST_RESULT  ","POST Test Results  ","Audit","0x0D02","0x03FF","Input Detect  (0x03), Fail (0xFF)","Y","Y","Y","Y","Y","N","N","N","N","N","Y","Y","N","N"]
["System Diagnostic Audits (0x0D00)","POST_RESULT  ","POST Test Results  ","Audit","0x0D02","0x0400","External Flash (0x04), Pass (0x00)","Y","Y","Y","Y","Y","N","N","N","N","N","Y","Y","Y","N"]
["System Diagnostic Audits (0x0D00)","POST_RESULT  ","POST Test Results  ","Audit","0x0D02","0x04FE","External Flash (0x04), Timeout (0xFE)","Y","Y","Y","Y","Y","N","N","N","N","N","Y","Y","Y","N"]
["System Diagnostic Audits (0x0D00)","POST_RESULT  ","POST Test Results  ","Audit","0x0D02","0x04FF","External Flash (0x04), Fail (0xFF)","Y","Y","Y","Y","Y","N","N","N","N","N","Y","Y","Y","N"]
["System Diagnostic Audits (0x0D00)","POST_RESULT  ","POST Test Results  ","Audit","0x0D02","0x0500","RTCC (0x05), Pass (0x00)","Y","Y","Y","Y","Y","N","N","N","N","N","Y","Y","Y","N"]
["System Diagnostic Audits (0x0D00)","POST_RESULT  ","POST Test Results  ","Audit","0x0D02","0x0501","RTCC (0x05), Self Test Invalid Time (0x01)","Y","Y","Y","Y","Y","N","N","N","N","N","Y","Y","Y","N"]
["System Diagnostic Audits (0x0D00)","POST_RESULT  ","POST Test Results  ","Audit","0x0D02","0x0502","RTCC (0x05), Self Test Increment Error (0x02)","Y","Y","Y","Y","Y","N","N","N","N","N","Y","Y","Y","N"]
["System Diagnostic Audits (0x0D00)","POST_RESULT  ","POST Test Results  ","Audit","0x0D02","0x05FE","RTCC (0x05), Timeout (0xFE)","Y","Y","Y","Y","Y","N","N","N","N","N","Y","Y","Y","N"]
["System Diagnostic Audits (0x0D00)","POST_RESULT  ","POST Test Results  ","Audit","0x0D02","0x05FF","RTCC (0x05), Fail (0xFF)","Y","Y","Y","Y","Y","N","N","N","N","N","Y","Y","Y","N"]
["System Diagnostic Audits (0x0D00)","POST_RESULT  ","POST Test Results  ","Audit","0x0D02","0x0600","Battery (0x06), Pass (0x00)","Y","Y","Y","Y","Y","N","N","N","N","N","Y","N","Y","N"]
["System Diagnostic Audits (0x0D00)","POST_RESULT  ","POST Test Results  ","Audit","0x0D02","0x06FE","Battery (0x06), Timeout (0xFE)","Y","Y","Y","Y","Y","N","N","N","N","N","Y","N","Y","N"]
["System Diagnostic Audits (0x0D00)","POST_RESULT  ","POST Test Results  ","Audit","0x0D02","0x06FF","Battery (0x06), Fail (0xFF)","Y","Y","Y","Y","Y","N","N","N","N","N","Y","N","Y","N"]
["System Diagnostic Audits (0x0D00)","POST_RESULT  ","POST Test Results  ","Audit","0x0D02","0x0700","Sleep Current (0x07), Pass (0x00)","Y","Y","Y","Y","Y","N","N","N","N","N","Y","N","Y","N"]
["System Diagnostic Audits (0x0D00)","POST_RESULT  ","POST Test Results  ","Audit","0x0D02","0x0701","Sleep Current (0x07), To High (0x01)","Y","Y","Y","Y","Y","N","N","N","N","N","Y","N","Y","N"]
["System Diagnostic Audits (0x0D00)","POST_RESULT  ","POST Test Results  ","Audit","0x0D02","0x0702","Sleep Current (0x07), To Low - Invalid measure (0x02)","Y","Y","Y","Y","Y","N","N","N","N","N","Y","N","Y","N"]
["System Diagnostic Audits (0x0D00)","POST_RESULT  ","POST Test Results  ","Audit","0x0D02","0x07FE","Sleep Current (0x07), Timeout (0xFE)","Y","Y","Y","Y","Y","N","N","N","N","N","Y","N","Y","N"]
["System Diagnostic Audits (0x0D00)","POST_RESULT  ","POST Test Results  ","Audit","0x0D02","0x07FF","Sleep Current (0x07), Unknown (0xFF)","Y","Y","Y","Y","Y","N","N","N","N","N","Y","N","Y","N"]
["System Diagnostic Audits (0x0D00)","POST_RESULT  ","POST Test Results  ","Audit","0x0D02","0x0800","Lock Configuration (0x08), Pass (0x00)","N","N","N","N","N","N","N","N","N","N","N","Y","N","N"]
["System Diagnostic Audits (0x0D00)","POST_RESULT  ","POST Test Results  ","Audit","0x0D02","0x08FE","Lock Configuration (0x08), Timeout","N","N","N","N","N","N","N","N","N","N","N","Y","N","N"]
["System Diagnostic Audits (0x0D00)","POST_RESULT  ","POST Test Results  ","Audit","0x0D02","0x08FF","Lock Configuration (0x08), Fail (0xFF)","N","N","N","N","N","N","N","N","N","N","N","Y","N","N"]
["System Diagnostic Audits (0x0D00)","POST_RESULT  ","POST Test Results  ","Audit","0x0D02","0x0900","Lock State Machine (0x09), Pass (0x00)","N","N","N","N","N","N","N","N","N","N","N","Y","Y","N"]
["System Diagnostic Audits (0x0D00)","POST_RESULT  ","POST Test Results  ","Audit","0x0D02","0x09FE","Lock State Machine (0x09), Timeout (0xFE)","N","N","N","N","N","N","N","N","N","N","N","Y","Y","N"]
["System Diagnostic Audits (0x0D00)","POST_RESULT  ","POST Test Results  ","Audit","0x0D02","0x09FF","Lock State Machine (0x09), Fail (0xFF)","N","N","N","N","N","N","N","N","N","N","N","Y","Y","N"]
["System Diagnostic Audits (0x0D00)","POST_RESULT  ","POST Test Results  ","Audit","0x0D02","0x0A00","Database (0x0A), Pass (0x00)","N","N","N","N","N","N","N","N","N","N","N","Y","Y","N"]
["System Diagnostic Audits (0x0D00)","POST_RESULT  ","POST Test Results  ","Audit","0x0D02","0x0AFE","Database (0x0A), Timeout (0xFE)","Y","Y","Y","Y","Y","N","N","N","N","N","Y","Y","Y","N"]
["System Diagnostic Audits (0x0D00)","POST_RESULT  ","POST Test Results  ","Audit","0x0D02","0x0AFF","Database (0x0A), Fail (0xFF)","Y","Y","Y","Y","Y","N","N","N","N","N","Y","Y","Y","N"]
["System Diagnostic Audits (0x0D00)","POST_RESULT  ","POST Test Results  ","Audit","0x0D02","0x0B00","WiFi (0x0B), Pass (0x00)","Y","Y","Y","Y","Y","N","N","N","N","N","Y","N","N","N"]
["System Diagnostic Audits (0x0D00)","POST_RESULT  ","POST Test Results  ","Audit","0x0D02","0x0B01","WiFi (0x0B), Not Initialized (0x01)","Y","Y","Y","Y","Y","N","N","N","N","N","Y","N","N","N"]
["System Diagnostic Audits (0x0D00)","POST_RESULT  ","POST Test Results  ","Audit","0x0D02","0x0BFE","WiFi (0x0B), Timeout (0xFE)","Y","Y","Y","Y","Y","N","N","N","N","N","Y","N","N","N"]
["System Diagnostic Audits (0x0D00)","POST_RESULT  ","POST Test Results  ","Audit","0x0D02","0x0C00","Overall POST (0x0C), Pass (0x00)","Y","Y","Y","Y","Y","N","N","N","N","N","Y","Y","Y","N"]
["System Diagnostic Audits (0x0D00)","POST_RESULT  ","POST Test Results  ","Audit","0x0D02","0x0CFE","Overal Post (0x0C), Timeout (0xFE)","Y","Y","Y","Y","Y","N","N","N","N","N","Y","Y","Y","N"]
["System Diagnostic Audits (0x0D00)","POST_RESULT  ","POST Test Results  ","Audit","0x0D02","0x0CFF","Overal Post (0x0C), Fail (0xFF)","Y","Y","Y","Y","Y","N","N","N","N","N","Y","Y","Y","N"]
["System Diagnostic Audits (0x0D00)","POST_RESULT  ","POST Test Results  ","Audit","0x0D02","0x0D00","Peripheral HW (0x0D), Pass (0x00)","Y","Y","Y","Y","Y","N","N","N","N","N","Y","Y","Y","N"]
["System Diagnostic Audits (0x0D00)","POST_RESULT  ","POST Test Results  ","Audit","0x0D02","0x0D01","Peripheral HW (0x0D), Gyrometer Sensor Failure (0x01)","Y","Y","Y","Y","Y","N","N","N","N","N","Y","Y","N","N"]
["System Diagnostic Audits (0x0D00)","POST_RESULT  ","POST Test Results  ","Audit","0x0D02","0x0D02","Peripheral HW (0x0D), Security Chip Failure (0x02)","Y","Y","Y","Y","Y","N","N","N","N","N","Y","Y","Y","N"]
["System Diagnostic Audits (0x0D00)","POST_RESULT  ","POST Test Results  ","Audit","0x0D02","0x0D03","Peripheralo HW (0x0D), Accelerometer Sensor Fialure (0x03)","Y","Y","Y","Y","Y","N","N","N","N","N","Y","Y","N","N"]
["System Diagnostic Audits (0x0D00)","POST_RESULT  ","POST Test Results  ","Audit","0x0D02","0x0D04","Peripheral HW (0x0D), BLE Credential Failure (0x04)","Y","Y","Y","Y","Y","N","N","N","N","N","Y","Y","N","N"]
["System Diagnostic Audits (0x0D00)","POST_RESULT  ","POST Test Results  ","Audit","0x0D02","0x0D05","Peripheral HW (0x0D), SAM Chip Failure (0x05)","N","N","N","N","N","N","N","N","Y","Y","N","N","N","N","2021-09-22"]
["System Diagnostic Audits (0x0D00)","POST_RESULT  ","POST Test Results  ","Audit","0x0D02","0x0D06","Peripheral HW (0x0D), 663 Chip Failure (0x06)","N","N","N","N","N","N","N","N","Y","Y","N","N","N","N","2021-09-22"]
["System Diagnostic Audits (0x0D00)","POST_RESULT  ","POST Test Results  ","Audit","0x0D02","0x0DFE","Peripheral HW (0x0D), Timeout (0xFE)","Y","Y","Y","Y","Y","N","N","N","N","N","Y","Y","Y","N"]
["System Diagnostic Audits (0x0D00)","POST_RESULT  ","POST Test Results  ","Audit","0x0D02","0x0DFF","Peripheral HW (0x0D), Fail (0xFF)","Y","Y","Y","Y","Y","N","N","N","N","N","Y","Y","Y","N"]
["System Diagnostic Audits (0x0D00)","POST_RESULT  ","POST Test Results  ","Audit","0x0D02","0x0E00","Ethernet (0x0E), Pass (0x00)","N","N","N","N","Y","N","N","N","N","N","N","Y","N","N"]
["System Diagnostic Audits (0x0D00)","POST_RESULT  ","POST Test Results  ","Audit","0x0D02","0x0EFE","Ethernet (0x0E), Timeout (0xFE)","N","N","N","N","Y","N","N","N","N","N","N","Y","N","N"]
["System Diagnostic Audits (0x0D00)","POST_RESULT  ","POST Test Results  ","Audit","0x0D02","0x0EFF","Ethernet (0x0E), Fail (0xFF)","N","N","N","N","Y","N","N","N","N","N","N","Y","N","N"]
["System Diagnostic Audits (0x0D00)","RDR_FALSE_DETECT","Reader False Detect","Audit","0x0D03","0xXXXX","Number of occurrences","Y","Y","Y","Y","N","N","N","Y","Y","Y","Y","N","N","N"]
["System Diagnostic Audits (0x0D00)","RDR_PWR_MODE","Reader Power Mode","Audit","0x0D04","0x0000","Normal - all reader technologies enabled\nASK, FSK - low frequency \nHF - High Frequency\nTSI - Touch Sense Input (cap sense)","Y","Y","Y","Y","Y","N","N","N","N","N","N","Y","N","N"]
["System Diagnostic Audits (0x0D00)","RDR_PWR_MODE","Reader Power Mode","Audit","0x0D04","0x0001","TSI disabled","Y","Y","Y","Y","Y","N","N","N","N","N","N","Y","N","N"]
["System Diagnostic Audits (0x0D00)","RDR_PWR_MODE","Reader Power Mode","Audit","0x0D04","0x0002","HF disabled","Y","Y","Y","Y","Y","N","N","N","N","N","N","Y","Y","N"]
["System Diagnostic Audits (0x0D00)","RDR_PWR_MODE","Reader Power Mode","Audit","0x0D04","0x0003","TSI, HF disabled","Y","Y","Y","Y","Y","N","N","N","N","N","N","Y","N","N"]
["System Diagnostic Audits (0x0D00)","RDR_PWR_MODE","Reader Power Mode","Audit","0x0D04","0x0004","FSK disabled","Y","Y","Y","Y","Y","N","N","N","N","N","N","Y","N","N"]
["System Diagnostic Audits (0x0D00)","RDR_PWR_MODE","Reader Power Mode","Audit","0x0D04","0x0005","FSK, TSI disabled","Y","Y","Y","Y","Y","N","N","N","N","N","N","Y","N","N"]
["System Diagnostic Audits (0x0D00)","RDR_PWR_MODE","Reader Power Mode","Audit","0x0D04","0x0006","FSK, HF disabled","Y","Y","Y","Y","Y","N","N","N","N","N","N","Y","N","N"]
["System Diagnostic Audits (0x0D00)","RDR_PWR_MODE","Reader Power Mode","Audit","0x0D04","0x0007","FSK, HF, TSI disabled","Y","Y","Y","Y","Y","N","N","N","N","N","N","Y","N","N"]
["System Diagnostic Audits (0x0D00)","RDR_PWR_MODE","Reader Power Mode","Audit","0x0D04","0x0008","ASK disabled","Y","Y","Y","Y","Y","N","N","N","N","N","N","Y","N","N"]
["System Diagnostic Audits (0x0D00)","RDR_PWR_MODE","Reader Power Mode","Audit","0x0D04","0x0009","ASK, TSI disabled","Y","Y","Y","Y","Y","N","N","N","N","N","N","Y","N","N"]
["System Diagnostic Audits (0x0D00)","RDR_PWR_MODE","Reader Power Mode","Audit","0x0D04","0x000A","ASK, HF disabled","Y","Y","Y","Y","Y","N","N","N","N","N","N","Y","N","N"]
["System Diagnostic Audits (0x0D00)","RDR_PWR_MODE","Reader Power Mode","Audit","0x0D04","0x000B","ASK, HF, TSI disabled","Y","Y","Y","Y","Y","N","N","N","N","N","N","Y","N","N"]
["System Diagnostic Audits (0x0D00)","RDR_PWR_MODE","Reader Power Mode","Audit","0x0D04","0x000C","ASK, FSK disabled","Y","Y","Y","Y","Y","N","N","N","N","N","N","Y","N","N"]
["System Diagnostic Audits (0x0D00)","RDR_PWR_MODE","Reader Power Mode","Audit","0x0D04","0x000D","ASK, FSK TSI disabled","Y","Y","Y","Y","Y","N","N","N","N","N","N","Y","N","N"]
["System Diagnostic Audits (0x0D00)","RDR_PWR_MODE","Reader Power Mode","Audit","0x0D04","0x000E","ASK, FSK, HF disabled","Y","Y","Y","Y","Y","N","N","N","N","N","N","Y","N","N"]
["System Diagnostic Audits (0x0D00)","RDR_PWR_MODE","Reader Power Mode","Audit","0x0D04","0x000F","Standby - reader technologies disabled","Y","Y","Y","Y","Y","N","N","N","N","N","N","Y","N","N"]
["System Diagnostic Audits (0x0D00)","RDR_STATE","Reader State","Audit","0x0D05","0x0000","Reader state during card read Idle","Y","Y","Y","Y","Y","N","N","N","N","N","N","N","N","N"]
["System Diagnostic Audits (0x0D00)","RDR_STATE","Reader State","Audit","0x0D05","0x0001","Trying to Read","Y","Y","Y","Y","Y","N","N","N","N","N","N","N","N","N"]
["System Diagnostic Audits (0x0D00)","RDR_STATE","Reader State","Audit","0x0D05","0x0002","Waiting for Withdrawal","Y","Y","Y","Y","Y","N","N","N","N","N","N","N","N","N"]
["System Diagnostic Audits (0x0D00)","RDR_STATE","Reader State","Audit","0x0D05","0x0003","Waiting for Stable Baseline","Y","Y","Y","Y","Y","N","N","N","N","N","N","N","N","N"]
["System Diagnostic Audits (0x0D00)","N_SAMPLES","N- Samples","Audit","0x0D06","0xXXXX","Number of Cap Sense Circuit Scans","Y","Y","Y","Y","Y","N","N","N","N","N","N","Y","N","N"]
["System Diagnostic Audits (0x0D00)","DELTA","Delta","Audit","0x0D07","0xXXXX","Value of  cap sense reader sensitivity","Y","Y","Y","Y","Y","N","N","N","N","N","N","Y","N","N"]
["System Diagnostic Audits (0x0D00)","OLD_FALSE_DETECT","Old False Detect Value","Audit","0x0D08","0xXXXX","Number of occurrences that hardware scan (cap sense circuit) detects above upper threshold setting","Y","Y","Y","Y","Y","N","N","N","N","N","N","Y","N","N"]
["System Diagnostic Audits (0x0D00)","NEW_FALSE_DETECT","New False Detect Value","Audit","0x0D09","0xXXXX","Number of occurrences hardware scan (cap sense circuit) and 2 software scans detects above upper threshold setting","Y","Y","Y","Y","Y","N","N","N","N","N","N","Y","N","N"]
["System Diagnostic Audits (0x0D00)","BASELINE_UPPER","Baseline - Upper 2 bytes","Audit","0x0D0A","0xXXXX","Upper 2 bytes of proximity detect baseline value","Y","Y","Y","Y","Y","N","N","N","N","N","N","Y","N","N"]
["System Diagnostic Audits (0x0D00)","BASELINE_LOWER","Baseline - Lower 2 bytes","Audit","0x0D0B","0xXXXX","Lower 2 bytes of proximity detect baseline value","Y","Y","Y","Y","Y","N","N","N","N","N","N","Y","N","N"]
["System Diagnostic Audits (0x0D00)","IB_ERROR","Inter Board Error","Audit","0x0D0C","0x0001","nWake assert error - Monitoring the GPIO line in between reader and main board","Y","Y","Y","Y","Y","N","N","N","N","N","N","N","N","N"]
["System Diagnostic Audits (0x0D00)","IB_ERROR","Inter Board Error","Audit","0x0D0C","0x0002","nWake deassert error - Monitoring the GPIO line in between reader and main board","Y","Y","Y","Y","Y","N","N","N","N","N","N","N","N","N"]
["System Diagnostic Audits (0x0D00)","IB_ERROR","Inter Board Error","Audit","0x0D0C","0x0003","I2C write aborted - monitoring I2C communication","Y","Y","Y","Y","Y","N","N","N","N","N","N","N","N","N"]
["System Diagnostic Audits (0x0D00)","IB_ERROR","Inter Board Error","Audit","0x0D0C","0x0004","I2C read aborted - monitoring I2C communication","Y","Y","Y","Y","Y","N","N","N","N","N","N","N","N","N"]
["System Diagnostic Audits (0x0D00)","READER_RESET","Reader Reset","Audit","0x0D0D","0x0000","None - no data (defaulted to 0x0000)","Y","Y","Y","Y","Y","N","N","N","N","N","N","Y","Y","N"]
["System Diagnostic Audits (0x0D00)","IPC_AUTH_LOCKOUT","Device Lockout","Audit","0x0D0E","0x0000","None - no data (defaulted to 0x0000)","N","N","N","N","N","N","N","N","N","N","N","N","Y","N","2022-01-18"]
["System Diagnostic Audits (0x0D00)","IPC_AUTH_ATTEMPTS_DC","Main Auth Attempts","Audit","0x0D0F","0xXXXX","XXXX = number of attempts (0-4000)","N","N","N","N","N","N","N","N","N","N","N","N","Y","N","2022-01-18"]
["System Diagnostic Audits (0x0D00)","IPC_AUTH_ATTEMPTS_AC","Reader Auth Attempts","Audit","0x0D10","0xXXXX","XXXX = number of attempts (0-4000)","N","N","N","N","N","N","N","N","N","N","N","N","Y","N","2022-01-18"]
["System Diagnostic Audits (0x0D00)","IPC_SEC_REV_FAILURE","Incompatible Reader","Audit","0x0D11","0x0000","None - no data (defaulted to 0x0000)","N","N","N","N","N","N","N","N","N","N","N","N","Y","N","2022-01-18"]
["System Diagnostic Audits (0x0D00)","IPC_FAILED_AUTH","Reader Comm Failure","Audit","0x0D12","0x0000","None - no data (defaulted to 0x0000)","N","N","N","N","N","N","N","N","N","N","N","N","Y","N","2022-01-18"]
["System Diagnostic Audits (0x0D00)","MOTOR_RUN_RETRY_COUNT","Motor Run Retry Count","Audit","0x0D13","0xXXXX","XXXX = number of retry attempts (1-255)","N","N","N","N","N","N","N","N","N","N","N","N","Y","N","2022-07-22"]
["System Power Up Audits (0x0E00)","RESET_DIAGNOSTICS","Reset Diagnostics","Audit","0x0E01","0xXXXX","Reset Reason Diagnostics Data","Y","Y","Y","Y","Y","N","N","Y","Y","Y","Y","Y","Y","N"]
["System Power Up Audits (0x0E00)","JUMP_START_DETECTED","Jump Start Detected","Audit","0x0E04","0x0000","None - no data (defaulted to 0x0000)","Y","Y","Y","Y","Y","N","N","Y","Y","Y","N","N","N","N"]
["Lock State Override (0x0F00)","LOCKSTATE_OVERRIDE_PASSAGE","LockState Override Passage","Audit","0x0F00","0x0000","None - no data (defaulted to 0x0000)","Y","Y","Y","Y","Y","N","N","N","N","N","Y","Y","N","N","2021-09-21"]
["Lock State Override (0x0F00)","LOCKSTATE_OVERRIDE_SECURED","LockState Override Secured","Audit","0x0F01","0x0000","None - no data (defaulted to 0x0000)","Y","Y","Y","Y","Y","N","N","N","N","N","Y","Y","N","N","2021-09-21"]
["Lock State Override (0x0F00)","LOCKSTATE_OVERRIDE_MOMENTARY UNLOCK","LockState Override Momentary Unlock","Audit","0x0F02","0x0000","None - no data (defaulted to 0x0000)","Y","Y","Y","Y","Y","N","N","Y","Y","Y","N","Y","N","N"]
["Lock State Override (0x0F00)","LOCKSTATE_OVERRIDE_HOLIDAY RESTRICTED","LockState Override Holiday Restricted","Audit","0x0F03","0x0000","None - no data (defaulted to 0x0000)","Y","Y","Y","Y","Y","N","N","Y","Y","Y","N","Y","N","N"]
["Lock State Override (0x0F00)","LOCKSTATE_OVERRIDE_FREEZE SECURE","LockState Override Freeze Secure","Audit","0x0F04","0x0000","None - no data (defaulted to 0x0000)","Y","Y","Y","Y","Y","N","N","Y","Y","Y","Y","Y","N","N"]
["Lock State Override (0x0F00)","LOCKSTATE_OVERRIDE_FREEZE PASSAGE","LockState Override Freeze Passage","Audit","0x0F05","0x0000","None - no data (defaulted to 0x0000)","Y","Y","Y","Y","Y","N","N","N","N","N","Y","Y","N","N","2021-09-21"]
["Lock State Override (0x0F00)","LOCKSTATE_OVERRIDE_TIMED UNLOCK","LockState Override Timed Unlock","Audit","0x0F06","0x0000","None - no data (defaulted to 0x0000)","Y","Y","Y","Y","Y","N","N","Y","Y","Y","N","Y","N","N"]
["Lock State Override (0x0F00)","LOCKSTATE_OVERRIDE_AUX_ENABLED","LockState Override Aux Relay Enable","Audit","0x0F07","0x0000","None - no data (defaulted to 0x0000)","Y","Y","Y","Y","Y","N","N","N","N","N","N","N","N","N"]
["Lock State Override (0x0F00)","LOCKSTATE_OVERRIDE_AUX_DISABLED","LockState Override Aux Relay Disabled","Audit","0x0F08","0x0000","None - no data (defaulted to 0x0000)","Y","Y","Y","Y","Y","N","N","N","N","N","N","N","N","N"]
["Lock State Override (0x0F00)","LOCKSTATE_OVERRIDE_TTL1_ACTIVE","LockState Override TTL1 Active","Audit","0x0F09","0x0000","None - no data (defaulted to 0x0000)","Y","Y","Y","Y","Y","N","N","N","N","N","N","Y","N","N"]
["Lock State Override (0x0F00)","LOCKSTATE_OVERRIDE_TTL1_INACTIVE","LockState Override TTL1 Inactive","Audit","0x0F0A","0x0000","None - no data (defaulted to 0x0000)","Y","Y","Y","Y","Y","N","N","N","N","N","N","Y","N","N"]
["Lock State Override (0x0F00)","LOCKSTATE_OVERRIDE_TTL2_ACTIVE","LockState Override TTL2 Active","Audit","0x0F0B","0x0000","None - no data (defaulted to 0x0000)","Y","Y","Y","Y","Y","N","N","N","N","N","N","Y","N","N"]
["Lock State Override (0x0F00)","LOCKSTATE_OVERRIDE_TTL2_INACTIVE","LockState Override TTL2 Inactive","Audit","0x0F0C","0x0000","None - no data (defaulted to 0x0000)","Y","Y","Y","Y","Y","N","N","N","N","N","N","Y","N","N"]
["Lock State Override (0x0F00)","LOCKSTATE_OVERRIDE_CLEAR","LockState Clear Override","Audit","0x0F0D","0x0000","None - no data (defaulted to 0x0000)","N","N","N","N","N","N","N","N","N","N","N","Y","N","N","2021-01-18"]
["Gateway Audits (0x1000)","GATEWAY_LINKED","Gateway Linked","Audit","0x1000","0x0000","None - no data (defaulted to 0x0000)","Y","Y","Y","Y","Y","N","N","Y","Y","Y","Y","N","N","N"]
["Gateway Audits (0x1000)","GATEWAY_LINKED_FAILED","Gateway Link Failed","Audit","0x1001","0x0001","COMMISSION ERROR","Y","Y","Y","Y","Y","N","N","Y","Y","Y","Y","N","N","N"]
["Gateway Audits (0x1000)","GATEWAY_LINKED_FAILED","Gateway Link Failed","Audit","0x1001","0x0002","COMMUNICATION ERROR","Y","Y","Y","Y","Y","N","N","Y","Y","Y","Y","N","N","N"]
["Gateway Audits (0x1000)","GATEWAY_COMM_ESTIBLISHED","Gateway Comm Established","Audit","0x1002","0x0000","None - no data (defaulted to 0x0000)","Y","Y","Y","Y","Y","N","N","Y","Y","Y","Y","N","N","N"]
["Gateway Audits (0x1000)","GATEWAY_COMM_ERROR","Gateway Comm Error","Audit","0x1003","0x0000","None - no data (defaulted to 0x0000)","Y","Y","Y","Y","Y","N","N","Y","Y","Y","Y","N","N","N"]
["Integrity and Authenticity Audits (0x1100)","HMAC_VALIDATION_PASSED","HMAC Validation Passed","Audit","0x1100","0x0100","Type: SHA1 (0x01), Code: Successful validation, no data (0x00)","Y","Y","Y","Y","Y","N","N","Y","Y","Y","Y","Y","Y","N"]
["Integrity and Authenticity Audits (0x1100)","HMAC_VALIDATION_FAILED","HMAC Validation Failed","Audit","0x1101","0x0101","Type: SHA1 (0x01), Code: Digest or Timestamp Failure (0x01)","Y","Y","Y","Y","Y","N","N","Y","Y","Y","Y","Y","Y","N"]
["Integrity and Authenticity Audits (0x1100)","HMAC_VALIDATION_FAILED","HMAC Validation Failed","Audit","0x1101","0x0102","Type: SHA1 (0x01), Code: Serial Number Failure (0x02)","Y","Y","Y","Y","Y","N","N","Y","Y","Y","Y","Y","Y","N"]
["Integrity and Authenticity Audits (0x1100)","HMAC_VALIDATION_FAILED","HMAC Validation Failed","Audit","0x1101","0x0104","Type: SHA1 (0x01), Code: HMAC Tag Invalid (0x04)","Y","Y","Y","Y","Y","N","N","Y","Y","Y","Y","Y","Y","N"]
["Integrity and Authenticity Audits (0x1100)","HMAC_VALIDATION_FAILED","HMAC Validation Failed","Audit","0x1101","0x0108","Type: SHA1 (0x01), Code: Type Failure (0x08)","Y","Y","Y","Y","Y","N","N","Y","Y","Y","Y","Y","Y","N"]
["Integrity and Authenticity Audits (0x1100)","HMAC_VALIDATION_FAILED","HMAC Validation Failed","Audit","0x1101","0x0116","Type: SHA1 (0x01), Code: hmacData Object Content Fault (0x16)","Y","Y","Y","Y","Y","N","N","Y","Y","Y","Y","Y","Y","N"]
["Integrity and Authenticity Audits (0x1100)","HMAC_VALIDATION_FAILED","HMAC Validation Failed","Audit","0x1101","0x0132","Type: SHA1 (0x01), Code: genPrmtrs Object Content Fault (0x32)","Y","Y","Y","Y","Y","N","N","Y","Y","Y","Y","Y","Y","N"]
["Integrity and Authenticity Audits (0x1100)","HMAC_VALIDATION_ON","HMAC Validation On","Audit","0x1102","0x0000","None - no data (defaulted to 0x0000)","Y","Y","Y","Y","Y","N","N","Y","Y","Y","Y","Y","Y","N"]
["Integrity and Authenticity Audits (0x1100)","HMAC_VALIDATION_OFF","HMAC Validation Off","Audit","0x1103","0x0000","None - no data (defaulted to 0x0000)","Y","Y","Y","Y","Y","N","N","Y","Y","Y","Y","Y","Y","N"]
["Ethernet Audits (0x1200)","ETHERNET_CABLE_CONNECT_DISCONNECT  ","Ethernet Cable Status","Audit","0x1200","0x0000","Disconnected","N","N","N","N","Y","N","N","N","N","N","N","Y","N","N"]
["Ethernet Audits (0x1200)","ETHERNET_CABLE_CONNECT_DISCONNECT  ","Ethernet Cable Status","Audit","0x1200","0x0001","Connected","N","N","N","N","Y","N","N","N","N","N","N","Y","N","N"]
["Ethernet Audits (0x1200)","ETHERNET_CONFIG_UPDATE  ","Ethernet Config Updated  ","Audit","0x1201","0x0000","None - no data (defaulted to 0x0000)","N","N","N","N","Y","N","N","N","N","N","N","Y","N","N"]
["Ethernet Audits (0x1200)","ETHERNET_DLD_SUCCESS  ","Ethernet Download Success","Audit","0x1202","0x0000","CERT Download Success ","N","N","N","N","Y","N","N","N","N","N","N","Y","N","N"]
["Ethernet Audits (0x1200)","ETHERNET_DLD_SUCCESS  ","Ethernet Download Success","Audit","0x1202","0x0001","FW Downlad Success","N","N","N","N","Y","N","N","N","N","N","N","Y","N","N"]
["Ethernet Audits (0x1200)","ETHERNET_DLD_FAIL                 ","Ethernet Download Fail","Audit","0x1203","0x0000","CERT Download Success ","N","N","N","N","Y","N","N","N","N","N","N","Y","N","N"]
["Ethernet Audits (0x1200)","ETHERNET_DLD_FAIL                 ","Ethernet Download Fail","Audit","0x1203","0x0001","FW Download Failed","N","N","N","N","Y","N","N","N","N","N","N","Y","N","N"]
["Ethernet Audits (0x1200)","ETHERNET_DLD_FAIL                 ","Ethernet Download Fail","Audit","0x1203","0x0002","Device lost IP or doesn't have","N","N","N","N","N","N","N","N","N","N","N","Y","N","N"]
["Ethernet Audits (0x1200)","ETHERNET_DLD_FAIL                 ","Ethernet Download Fail","Audit","0x1203","0x0003","Dwnld Url parsing got failed","N","N","N","N","N","N","N","N","N","N","N","Y","N","N"]
["Ethernet Audits (0x1200)","ETHERNET_DLD_FAIL                 ","Ethernet Download Fail","Audit","0x1203","0x0004","Invalid Header or package","N","N","N","N","N","N","N","N","N","N","N","Y","N","N"]
["Ethernet Audits (0x1200)","ETHERNET_DLD_FAIL                 ","Ethernet Download Fail","Audit","0x1203","0x0005","Memory writing failure","N","N","N","N","N","N","N","N","N","N","N","Y","N","N"]
["Ethernet Audits (0x1200)","ETHERNET_DLD_FAIL                 ","Ethernet Download Fail","Audit","0x1203","0x0006","Connection terminated or lost while downloading","N","N","N","N","N","N","N","N","N","N","N","Y","N","N"]
["Ethernet Audits (0x1200)","ETHERNET_WS_STATUS_EVENT","Ethernet WS Update Event","Audit","0x1204","0x0000","WS Host Disconnected","N","N","N","N","Y","N","N","N","N","N","N","Y","N","N"]
["Ethernet Audits (0x1200)","ETHERNET_WS_STATUS_EVENT","Ethernet WS Update Event","Audit","0x1204","0x0001","WS Host Connected","N","N","N","N","Y","N","N","N","N","N","N","Y","N","N"]
["Ethernet Audits (0x1200)","ETHERNET_WS_STATUS_EVENT","Ethernet WS Update Event","Audit","0x1204","0x0002","WS Basic Auth Credential Request Failed","N","N","N","N","Y","N","N","N","N","N","N","Y","N","N"]
["Ethernet Audits (0x1200)","ETHERNET_WS_STATUS_EVENT","Ethernet WS Update Event","Audit","0x1204","0x0003","WS ProtocolUpgrade Request Failed","N","N","N","N","Y","N","N","N","N","N","N","Y","N","N"]
["Ethernet Audits (0x1200)","ETHERNET_WS_CLOSE_EVENT","Ethernet WS Close","Audit","0x1205","0x0000","WS Connection Close - Protocol Error Detected","N","N","N","N","Y","N","N","N","N","N","N","Y","N","N"]
["Ethernet Audits (0x1200)","ETHERNET_WS_CLOSE_EVENT","Ethernet WS Close","Audit","0x1205","0x0002","WS Connectio nClose - Remote Host Unresponsive","N","N","N","N","Y","N","N","N","N","N","N","Y","N","N"]
["Ethernet Audits (0x1200)","ETHERNET_WS_CLOSE_EVENT","Ethernet WS Close","Audit","0x1205","0x0003","WS Connection Close - Requested by Remote Host","N","N","N","N","Y","N","N","N","N","N","N","Y","N","N"]
["Ethernet Audits (0x1200)","ETHERNET_WS_CA_AUTH_FAILURE_RTC_EVENT","Ethernet WS ca Authentication Failure","Audit","0x1206","0x0000 to  0x0004","0x0000 - CA_CERT_AUTH_RTC_VALID_ERROR 0x0001 - RTC_NTP_ATTEMPT_FAIL  0x0002 - RTC_BACKUP_NTP_ATTEMPT_FAIL  0x0003 - RTC_AUDIT_TIME_ATTEMPT_FAIL  0x0004 - RTC_CA_CERT_TIME_ATTEMPT_FAIL","N","N","N","N","N","N","N","N","N","N","N","Y","N","N","2025-10-27"]
["Credential Not In DB Audits (0x1300)","CRED_NOT_IN_DB_BIT_LENGTH","Credential not in DB. Bit length of credential.\nAudit disabled in default config.","Audit","0x1300","0xXXXX","XXXX = bit length of presented credential that is not in database. Credential data in following audits. Current max length support is 64 bits.","Y","Y","Y","Y","Y","N","N","Y","Y","Y","N","N","Y","N","2020-10-28"]
["Credential Not In DB Audits (0x1300)","CRED_NOT_IN_DB_BITS_15_TO_0","Credential not in DB. Bits 15 to 0 of credential.\nAudit disabled in default config.","Audit","0x1301","0xXXXX","XXXX = Bits 15 to 0 of credential. Padded with 0's if credential doesn't fill all bits in audit.","Y","Y","Y","Y","Y","N","N","Y","Y","Y","N","N","Y","N","2020-10-28"]
["Credential Not In DB Audits (0x1300)","CRED_NOT_IN_DB_BITS_31_TO_16","Credential not in DB. Bits 31 to 16 of credential. (Optional, only generated if CRED_NOT_IN_DB_BIT_LENGTH is greater tha 16 bits)\nAudit disabled in default config.","Audit","0x1302","0xXXXX","XXXX = Bits 31 to 16 of credential. Padded with 0's if credential doesn't fill all bits in audit.","Y","Y","Y","Y","Y","N","N","Y","Y","Y","N","N","Y","N","2020-10-28"]
["Credential Not In DB Audits (0x1300)","CRED_NOT_IN_DB_BITS_47_TO_32","Credential not in DB. Bits 47 to 32 of credential. (Optional, only generated if CRED_NOT_IN_DB_BIT_LENGTH is greater tha 32 bits)\nAudit disabled in default config.","Audit","0x1303","0xXXXX","XXXX = Bits 47 to 32 of credential. Padded with 0's if credential doesn't fill all bits in audit.","Y","Y","Y","Y","Y","N","N","Y","Y","Y","N","N","Y","N","2020-10-28"]
["Credential Not In DB Audits (0x1300)","CRED_NOT_IN_DB_BITS_63_TO_48","Credential not in DB. Bits 63 to 48 of credential. (Optional, only generated if CRED_NOT_IN_DB_BIT_LENGTH is greater tha 48 bits)\nAudit disabled in default config.","Audit","0x1304","0xXXXX","XXXX = Bits 63 to 48 of credential. Padded with 0's if credential doesn't fill all bits in audit.","Y","Y","Y","Y","Y","N","N","Y","Y","Y","N","N","Y","N","2020-10-28"]
["No Tour Enrollment Audits (0x1400)","NO_TOUR_WRITE_SUCCESS","No Tour Enrollment Success","Audit","0x1400","0x0000","Success - No Tour Data Write","N","N","N","N","N","N","N","N","N","N","N","Y","N","N","2022-08-24"]
["No Tour Enrollment Audits (0x1400)","NO_TOUR_WRITE_SUCCESS","No Tour Enrollment Success","Audit","0x1400","0x0001","Success - No Tour Data Changes Not Needed","N","N","N","N","N","N","N","N","N","N","N","Y","N","N","2022-08-24"]
["No Tour Enrollment Audits (0x1400)","NO_TOUR_WRITE_FAILURE","No Tour Enrollment Fail","Audit","0x1401","0x0000","Authentication Error (wrong credential key)","N","N","N","N","N","N","N","N","N","N","N","Y","N","N","2022-08-24"]
["No Tour Enrollment Audits (0x1400)","NO_TOUR_WRITE_FAILURE","No Tour Enrollment Fail","Audit","0x1401","0x0001","Card Format Not Supported (Prox)","N","N","N","N","N","N","N","N","N","N","N","Y","N","N","2022-08-24"]
["No Tour Enrollment Audits (0x1400)","NO_TOUR_WRITE_FAILURE","No Tour Enrollment Fail","Audit","0x1401","0x0002","Write Error (corrupted sectors)","N","N","N","N","N","N","N","N","N","N","N","Y","N","N","2022-08-24"]
["No Tour Enrollment Audits (0x1400)","NO_TOUR_WRITE_FAILURE","No Tour Enrollment Fail","Audit","0x1401","0x0003","Card Removed Error","N","N","N","N","N","N","N","N","N","N","N","Y","N","N","2022-08-24"]
["No Tour Enrollment Audits (0x1400)","NO_TOUR_WRITE_FAILURE","No Tour Enrollment Fail","Audit","0x1401","0x0004","Unhandled Error","N","N","N","N","N","N","N","N","N","N","N","Y","N","N","2022-08-24"]
["No Tour Enrollment Audits (0x1400)","NO_TOUR_WRITE_FAILURE","No Tour Enrollment Fail","Audit","0x1401","0x0005","Wrong Card Presented","N","N","N","N","N","N","N","N","N","N","N","Y","N","N","2022-08-24"]
["No Tour Enrollment Audits (0x1400)","NO_TOUR_NOT_PRESENTED_TIMEOUT","No Tour Timeout","Audit","0x1402","0x0000","Card not presented in time. ","N","N","N","N","N","N","N","N","N","N","N","Y","N","N","2022-08-24"]
["System Monitoring Health Audits (0x1500)","SYSHMON_DHCP_SHORT_LEASE_TIME","Capture of short DHCP lease time (in seconds) assigned to device, value refreshed upon value change when lease time < Y minutes.  Value set to 0 when device configured for static IP.  Value Reset upon server host re-connect.","Audit","0x1500","0x0000","minimum lease time (minutes)","N","N","N","N","N","N","N","N","N","N","N","Y","N","N","2025-02-19"]
["System Monitoring Health Audits (0x1500)","SYSHMON_DHCP_NETWORK_CHANGED","Capture of DHCP network change events since  host server connection established.  Value refreshed upon event capture. (compiled code won't lead to function handling network changed).  Value Reset upon server host re-connect.","Audit","0x1501","0x0000","count of DHCP network change events","N","N","N","N","N","N","N","N","N","N","N","Y","N","N","2025-02-19"]
["System Monitoring Health Audits (0x1500)","SYSHMON_DHCP_CLIENT_RECV_NAK","Capture of counts DHCP client received NAK response since  host server connection established.  Value refreshed upon event capture.  Value Reset upon server host re-connect.","Audit","0x1502","0x0000","count of DHCP client NAK events","N","N","N","N","N","N","N","N","N","N","N","Y","N","N","2025-02-19"]
["System Monitoring Health Audits (0x1500)","SYSHMON_DHCP_CLIENT_DECLINE","Capture of counts DHCP client declines offered IP address (i.e. address already in use by another host as determined through ARP) since  host server connection established.  Value refreshed upon event capture.  Value Reset upon server host re-connect.","Audit","0x1503","0x0000","count of DHCP client decline events","N","N","N","N","N","N","N","N","N","N","N","Y","N","N","2025-02-19"]
["System Monitoring Health Audits (0x1500)","SYSHMON_NETWORK_RX_TIMEOUTS","Capture of network receive timeout events since  host server connection established.  Value refreshed upon event capture.  Value Reset upon server host re-connect.","Audit","0x1504","0x0000","count of network receive timeout events","N","N","N","N","N","N","N","N","N","N","N","Y","N","N","2025-02-19"]
["System Monitoring Health Audits (0x1500)","SYSHMON_NETWORK_RX_ERRORS","Capture of network receive error events since host server connection established.  Value refreshed upon event capture.  Value Reset upon server host re-connect.","Audit","0x1505","0x0000","count of network receive errors","N","N","N","N","N","N","N","N","N","N","N","Y","N","N","2025-02-19"]
["System Monitoring Health Audits (0x1500)","SYSHMON_NETWORK_TX_TIMEOUTS","Capture of network transmit timeout events since  host server connection established.  Value refreshed upon event capture.  Value Reset upon server host re-connect.","Audit","0x1506","0x0000","count of network transmit timeout events","N","N","N","N","N","N","N","N","N","N","N","Y","N","N","2025-02-19"]
["System Monitoring Health Audits (0x1500)","SYSHMON_NETWORK_TX_ERRORS","Capture of network transmit error events since  host server connection established.  Value refreshed upon event capture.  Value Reset upon server host re-connect.","Audit","0x1507","0x0000","count of network transmit timeout events","N","N","N","N","N","N","N","N","N","N","N","Y","N","N","2025-02-19"]
["System Monitoring Health Audits (0x1500)","SYSHMON_TCPIP_HEAP_MEM_MARK","Hi capture of TCPIP heap memory usage at/above 70% of allocated space since  host server connection established.  Value refreshed upon value change, polled every 1 second.  Value Reset upon server host re-connect.","Audit","0x150A","0x0000","Memory mark uaage of TCPIP heap","N","N","N","N","N","N","N","N","N","N","N","Y","N","N","2025-02-19"]
["Reserved Block (0xE000)","Reserved for External Use",null,"NA","0xE000","0xXXXX","Reserved for External Use"]
["Reserved Block (0xE000)","(entire block held for customer use, \nAllegion shall not use)",null,"NA","0xEFFF","0xXXXX","(entire block held for customer use, Allegion shall not use)"]
["Unknown Audits (0xFFFF)","Unknown","Unknown","NA","0xFFFF","0xXXXX","Unknown"]

{"sheet":"WIFI Audit Trail Data","index":2,"n_rows":59,"n_cols":4,"rows_kept":59,"cut":false,"hidden":false,"merged":[]}
["WIFI command ACK status definitions","Value","Description","Alert Message"]
["SUCCESS                     ",0,"Successful Association","N/A"]
["NOT_INITIALIZED             ",{"$f":"B2+1","v":1},"Not Initialized","The Wi-Fi failed to turn on.  Please try again.  If the problem persists, contact Technical Support at (877) 671-7011.\n(ref. code 01)"]
["SELFTEST_FAILED             ",2,"Self-Test Failed","The Wi-Fi failed to turn on.  Please try again.  If the problem persists, contact Technical Support at (877) 671-7011.\n(ref. code 02)"]
["BUSY                        ",3,"In Data Mode, Cannot Process Commands","The Wi-Fi failed to turn on.  Please try again.  If the problem persists, contact Technical Support at (877) 671-7011.\n(ref. code 03)"]
["POWERON_FAILURE             ",4,"Power-On Failed","The Wi-Fi failed to turn on.  Please try again.  If the problem persists, contact Technical Support at (877) 671-7011.\n(ref. code 04)"]
["INVALID_PARAMS              ",5,"Invalid Configurations","The Wi-Fi failed to turn on.  Please try again.  If the problem persists, contact Technical Support at (877) 671-7011.\n(ref. code 05)"]
["AP_CONFIG_FAILURE           ",6,"Configuration Failed","Failed to connect to access point.  Confirm the Wi-Fi network SSID and Password and try again.\n(ref. code 06)"]
["AP_ASSOCIATE_FAILURE        ",7,"Association Falied","Failed to connect to access point.  Confirm the Wi-Fi network SSID and Password and try again.\n(ref. code 07)"]
["AP_DISASSOCIATE_FAILURE     ",8,"Disassociation Failed","N/A"]
["GET_IP_ADDR_FAILURE         ",9,"IP Addresss Failed","Failed to resolve IP address.  Confirm Host Configuration settings and try again.  \n(ref. code 9)"]
["HOST_CONNNECT_FAILURE       ","0A","Host Connect Attempt Failed","IN OEM210 MODE:\nFailed to connect to host server.  Confirm Host Configuration settings and try again.  An active internet connection may by required to reach the host server.  \n(ref. code 10)\n\nFOR ENGAGE MANAGED SITE:\nFailed to connect to host server.  Confirm the Wi-Fi network is connected to the internet and try again.  \n(ref. code 10)"]
["HOST_DISCOVERY_FAILURE      ","0B","DNS Failed","DNS Failure.  Failed to resolve host IP.  Confirm Host Configuration settings and try again.  \n(ref. code 11)"]
["NOT_COMMISSIONED            ","0C","Wi-Fi Configurations Not Set","N/A"]
["COMMUNICATION_FAILURE       ","0D","Communcation Failure","The Wi-Fi failed to turn on.  Please try again.  If the problem persists, contact Technical Support at (877) 671-7011.\n(ref. code 13)"]
["CONFIG_STORE_FAILURE        ","0E","Failed to Write Configuration to Flash ","The Wi-Fi settings failed to save to the device.  Please try again.\n(ref. code 14)"]
["DOWNLOAD_FAILURE            ","0F","Connected to Host - Error Getting Data","A problem occurred during transmission.  Please try again.\n(ref. code 15)"]
["SENDDATA_FAILURE            ",10,"Connected to Host - Error Sending Data","A problem occurred during transmission.  Please try again.\n(ref. code 16)"]
["FEATURE_NOT_SUPPORTED       ",11,"Feature is Not Currently Supported","N/A"]
["INVALID_HTTP_RESPONSE       ",12,"HTTP Error Received from Server","IN OEM210 MODE:\nAn error from the server prevented connection.  Confirm Host Configuration settings and try again.  If the problem persists, contact your service provider.\n(ref. code 18)\n\nFOR ENGAGE MANAGED SITE:\nAn error from the server prevented connection.  Confirm the Wi-Fi network is connected to the internet and try again.  \n(ref. code 18)"]
["UNKNOWN_LOCK_NAME           ",13,"Cannot Build URL - Unknown Lock Name","A problem occurred with setup.  Please check configuration settings and try again.\n(ref. code 19)"]
["FTP_CONFIG_FAILURE          ",14,"FTP Configuration Error","A problem occurred with the device access point setup.  Please check configuration settings and try again.\n(ref. code 20)"]
["LOST_CONNECTION             ",15,"Unable to Reconnect to Network AP","Lost connection to host server during transmission.  Please try again.  \n(ref. code 21)"]
["EXCESSIVE_DATA              ",16,"Data Size Too Large","Data handling failure.  Please try again.  \n(ref. code 22)"]
["RX_BUF_NOT_AVAIL            ",17,"Failed to Get Buffer During Download","Buffer failure during download.  Please try again.  \n(ref. code 23)"]
["UART_READ_FAILED            ",18,"UART Read Failed","UART read failed.  Please try again.  \n(ref. code 24)"]
["UART_WRITE_FAILED           ",19,"UART Write Failed","UART write failed.  Please try again.  \n(ref. code 25)"]
["FLASH_WRITE_FAILED          ","1A","Flash Write Failed","Flash write failed.  Please try again.  \n(ref. code 26)"]
["FLASH_ERASE_FAILED          ","1B","Flash Erase Failed","Flash erase failed.  Please try again.  \n(ref. code 27)"]
["DOWNLOAD_FWMGR_ERROR        ","1C","Data Blocks Fail CRC Check","CR check failure.  Please try again.  \n(ref. code 28)"]
["UPGRADE_FWMGR_ERROR         ","1D","Module Upgrade - Values Not Received","N/A"]
["UPGRADE_BAD_PARAMS          ","1E","Module Upgrade - Invalid Values Received","N/A"]
["UPGRADE_XMODEM_FAILED       ","1F","Module Upgrade - Transfer to Module Failed","N/A"]
["UPGRADE_INSTALL_FAILED      ",20,"Module Upgrade - Installation Failed","N/A"]
["DLD_INTERRUPT_FDR           ",{"$f":"B34+1","v":21},"Download Interrupted - FDR Action","An FDR was initated during the download.\n(ref. code 33)"]
["DLD_INTERRUPT_PM            ",22,"Download Interrupted - Power Manager","N/A"]
["DLD_HOST_DISCONNECT         ",23,"Download Interrupted - Host Disconnect","The host was disconnected during the download.  Please try again.\n(ref. code 35)"]
["DLD_AP_DISCONNECT           ",24,"Download Interrupted - Network AP Disconnect","The access point was disconnected during the download.  Please try again.\n(ref. code 36)"]
["DLD_TIMEOUT                 ",25,"Download Timeout","The download timed out.  Please try again.\n(ref. code 37)"]
["AUDIT_FRAME_ERROR           ",26,"Audit JSON Framing Error Received","Audit framing error.  Please try again.  \n(ref. code 38)"]
["HTTP_HDR_CREATE_FAILED      ",27,"Failed to Create HTTP Header","Failed to create HTTP header.  Please try again.  \n(ref. code 39)"]
["NO_RESPONSE_FROM_HOST       ",28,"Host Did Not Respond","No response from host server.  Please try again.  \n(ref. code 40)"]
["DLD_INTERRUPT_ALERT         ",29,"Download Interrrupted Alert","The download was interrupted by another event.  Please try again.\n(ref. code 41)"]
["DLD_NOT_TRIGGERED_TAMPER_ON ","2A","Tamper On Prohibited Download","Tamper detected.  Install the battery cover and try again."]
["ZERO_HTTP_CONTENT           ","2B","No HTTP Content Received","No data to handle.  HTTP content length is 0.  Please try again.  \n(ref. code 43)"]
["ENTER_AP_MODE_FAILED        ","2C","AP Mode Initation Failed","Failed to enter AP mode.  Please try again.  \n(ref. code 44)"]
["CONFIG_CLIENT_MODE_FAILED   ","2D","Configuration Client Mode Failed","The Wi-Fi failed to turn on.  Please try again.  If the problem persists, contact Technical Support at (877) 671-7011.\n(ref. code 45)"]
["LOCK_IN_AP_MODE             ","2E","Lock AP Mode On","N/A"]
["LOCK_NOT_IN_AP_MODE         ","2F","Lock AP Mode Off","N/A"]
["MISSING_SITE_KEY            ",30,"Encrypted Server Authenticaiton Failed","Unable to authenticate with server.  Missing site key.\n(ref. code 48)"]
["CERT_CONFIG_FAILURE  ",31,"Cannot create encrypted server auth due to invalid identity ","Unable to authenticate with server.  Invalid security certificate.\n(ref. code 49)"]
["DLD_RETRY_INPROGRESS ",32,"Indicates download retry will start in few seconds","Attempting to download again.\n(ref. code 50)"]
["AP_MODE_TIMEOUT      ",33,"Soft AP mode time error","The device access point timed out.  Please try again.\n(ref. code 51)"]
["Unused",34,"UNUSED","N/A"]
["ACK_AP_AUTH_ERROR         ",35,"AP personal: AUTH-ERR","Failed to connect to access point.  Confirm the Wi-Fi network Password and try again.\n(ref. code 53)"]
["ACK_AP_ROUTER_NOT_FOUND   ",36,"AP personal: Incorrect SSID/Poor signal","The access point was not found.  Confirm the Wi-Fi network SSID and signal availability and try again.  \n(ref. code 54)"]
["ACK_AP_EAP_FAILED         ",37,"AP Enterprise: Incorrect user-id/Pswd or Poor signal","Failed to connect to access point.  Confirm the Wi-Fi network User Name and Password and try again.\n(ref. code 55)"]
["ACK_HOST_TLS_CERT_FAILURE ",38,"TLS Certificate validation issue","TLS certificate validation failure occurred.  Please try again."]
["WIFI_CMD_ACK_HOST_TLS_CERT_DLD_SUCCESS     ",39,"TLS Certificate download Success ","(ref. code 57) "]

{"sheet":"DbmAuditData List","index":3,"n_rows":685,"n_cols":15,"rows_kept":685,"cut":false,"hidden":false,"merged":[[0,0,0,22],[2,7,2,8],[3,11,3,12]]}
["There are four basic types of audits;1) Fixed data audits, 2) Variable data 3) no data audits and 4) Userdata.\nAudit are defined in categories\nFor Example all 0x0100 are battery audits. \n\nNOTE: This sheet is used by the Orca Team to import Audit Data Type.  \nDO NOT ALTER THE NUMBER OF COLUMNS!!!!\n\nNOTE: This sheet is used by the Firmware Team (Columns A, C, D, and H)\nDO NOT ALTER THESE COLUMNS!!!!"]
[]
["Audit Category",null,null,null,null,null,null,"Data Structure"]
[null,"Audit/Alert/Both","Label","SW Heading (20 Char Max)","SW Text (30 Char Max)","SW Heading Cnt","SW Text Cnt","Audit Event ","Audit Data","Range","Units","Example",null,"SQL Event","SQL Data"]
["Place Holder to allow for easier import to Orca","Audit","Success","Success",null,{"$f":"LEN(D5)","v":7},{"$f":"LEN(E5)","v":0},"0x0000",0,null,null,null,null,{"$f":"IF(LEFT(H5,2)=\"0x\",CONCATENATE(\"IF EXISTS(SELECT TOP 1 * FROM [AuditEvent] WHERE [AuditEventId] = \",H5,\") UPDATE [AuditEvent] SET [Key] = '\",TRIM(D5),\"', [Value] = '\",TRIM(D5),\"', [IsAlert] = \",IF(B5=\"Audit\",0,1),\" WHERE [AuditEventId] = \",H5,\" ELSE INSERT INTO [AuditEvent] ([AuditEventId], [Key], [Value], [IsAlert]) VALUES (\",H5,\", '\",TRIM(D5),\"', '\",TRIM(D5),\"', \",IF(B5=\"Audit\",0,1), \")\"),\"-- no value\")","v":"IF EXISTS(SELECT TOP 1 * FROM [AuditEvent] WHERE [AuditEventId] = 0x0000) UPDATE [AuditEvent] SET [Key] = 'Success', [Value] = 'Success', [IsAlert] = 0 WHERE [AuditEventId] = 0x0000 ELSE INSERT INTO [AuditEvent] ([AuditEventId], [Key], [Value], [IsAlert]) VALUES (0x0000, 'Success', 'Success', 0)"},{"$f":"IF(AND(LEFT(H5,2)=\"0x\",ISNUMBER(HEX2DEC(TRIM(I5))*1)),CONCATENATE(\"IF EXISTS(SELECT TOP 1 * FROM [AuditData] WHERE [AuditDataId] = \",HEX2DEC(I5),\" AND [AuditEventId] = \",H5,\") UPDATE [AuditData] SET [Key] = '\",E5,\"', [Value] = '\",E5,\"', [IsAlert] = 0 WHERE [AuditDataId] = \",HEX2DEC(I5),\" AND [AuditEventId] = \",H5,\" ELSE INSERT INTO [AuditData] ([AuditDataId], [AuditEventId], [Key], [Value], [IsAlert]) VALUES (\",HEX2DEC(I5),\", \",H5,\", '\",E5,\"', '\",E5,\"', 0)\"),\"-- no value\")","v":"IF EXISTS(SELECT TOP 1 * FROM [AuditData] WHERE [AuditDataId] = 0 AND [AuditEventId] = 0x0000) UPDATE [AuditData] SET [Key] = '', [Value] = '', [IsAlert] = 0 WHERE [AuditDataId] = 0 AND [AuditEventId] = 0x0000 ELSE INSERT INTO [AuditData] ([AuditDataId], [AuditEventId], [Key], [Value], [IsAlert]) VALUES (0, 0x0000, '', '', 0)"}]
[null,null,null,null,null,null,null,null,null,null,null,null,null,{"$f":"IF(LEFT(H6,2)=\"0x\",CONCATENATE(\"IF EXISTS(SELECT TOP 1 * FROM [AuditEvent] WHERE [AuditEventId] = \",H6,\") UPDATE [AuditEvent] SET [Key] = '\",TRIM(D6),\"', [Value] = '\",TRIM(D6),\"', [IsAlert] = \",IF(B6=\"Audit\",0,1),\" WHERE [AuditEventId] = \",H6,\" ELSE INSERT INTO [AuditEvent] ([AuditEventId], [Key], [Value], [IsAlert]) VALUES (\",H6,\", '\",TRIM(D6),\"', '\",TRIM(D6),\"', \",IF(B6=\"Audit\",0,1), \")\"),\"-- no value\")","v":"-- no value"},{"$f":"IF(AND(LEFT(H6,2)=\"0x\",ISNUMBER(HEX2DEC(TRIM(I6))*1)),CONCATENATE(\"IF EXISTS(SELECT TOP 1 * FROM [AuditData] WHERE [AuditDataId] = \",HEX2DEC(I6),\" AND [AuditEventId] = \",H6,\") UPDATE [AuditData] SET [Key] = '\",E6,\"', [Value] = '\",E6,\"', [IsAlert] = 0 WHERE [AuditDataId] = \",HEX2DEC(I6),\" AND [AuditEventId] = \",H6,\" ELSE INSERT INTO [AuditData] ([AuditDataId], [AuditEventId], [Key], [Value], [IsAlert]) VALUES (\",HEX2DEC(I6),\", \",H6,\", '\",E6,\"', '\",E6,\"', 0)\"),\"-- no value\")","v":"-- no value"}]
[null,null,null,null,null,null,null,null,null,null,null,null,null,"-- no value","-- no value"]
["Power Audits",null,null,null,null,null,null,null,null,null,null,null,null,"-- no value","-- no value"]
["Base Value",null,null,null,null,null,null,null,null,null,null,null,null,"-- no value","-- no value"]
["0x0100","Both","LOW_BATT","Low Battery (mV)     ","xxxx",{"$f":"LEN(D10)","v":21},4,"0x0100","xxxx","0 to 999","Millivolts","Low Battery (mV)     ","4100 Millivolts","IF EXISTS(SELECT TOP 1 * FROM [AuditEvent] WHERE [AuditEventId] = 0x0100) UPDATE [AuditEvent] SET [Key] = 'Low Battery (mV)', [Value] = 'Low Battery (mV)', [IsAlert] = 1 WHERE [AuditEventId] = 0x0100 ELSE INSERT INTO [AuditEvent] ([AuditEventId], [Key], [Value], [IsAlert]) VALUES (0x0100, 'Low Battery (mV)', 'Low Battery (mV)', 1)","-- no value"]
[null,"Both","CRIT_BATT","Critical Battery (mV) ","xxxx",22,4,"0x0101","xxxx","0 to 999","Millivolts","Critical Battery (mV) ","4100 Millivolts","IF EXISTS(SELECT TOP 1 * FROM [AuditEvent] WHERE [AuditEventId] = 0x0101) UPDATE [AuditEvent] SET [Key] = 'Critical Battery (mV)', [Value] = 'Critical Battery (mV)', [IsAlert] = 1 WHERE [AuditEventId] = 0x0101 ELSE INSERT INTO [AuditEvent] ([AuditEventId], [Key], [Value], [IsAlert]) VALUES (0x0101, 'Critical Battery (mV)', 'Critical Battery (mV)', 1)","-- no value"]
[null,"Audit","LVL_BATT","Battery Level (mV) ","xxxx",19,4,"0x0102","xxxx","0 to 999","Millivolts","Battery Level (mV) ","4100 Millivolts","IF EXISTS(SELECT TOP 1 * FROM [AuditEvent] WHERE [AuditEventId] = 0x0102) UPDATE [AuditEvent] SET [Key] = 'Battery Level (mV)', [Value] = 'Battery Level (mV)', [IsAlert] = 0 WHERE [AuditEventId] = 0x0102 ELSE INSERT INTO [AuditEvent] ([AuditEventId], [Key], [Value], [IsAlert]) VALUES (0x0102, 'Battery Level (mV)', 'Battery Level (mV)', 0)","-- no value"]
[null,"Audit","POWER_SOURCE ","Input Power Source","Input Voltage Source Not Detected",null,null,"0x0180","0000",null,null,null,null,"IF EXISTS(SELECT TOP 1 * FROM [AuditEvent] WHERE [AuditEventId] = 0x0180) UPDATE [AuditEvent] SET [Key] = 'Input Power Source', [Value] = 'Input Power Source', [IsAlert] = 0 WHERE [AuditEventId] = 0x0180 ELSE INSERT INTO [AuditEvent] ([AuditEventId], [Key], [Value], [IsAlert]) VALUES (0x0180, 'Input Power Source', 'Input Power Source', 0)","IF EXISTS(SELECT TOP 1 * FROM [AuditData] WHERE [AuditDataId] = 0 AND [AuditEventId] = 0x0180) UPDATE [AuditData] SET [Key] = 'Input Voltage Source Not Detected', [Value] = 'Input Voltage Source Not Detected', [IsAlert] = 0 WHERE [AuditDataId] = 0 AND [AuditEventId] = 0x0180 ELSE INSERT INTO [AuditData] ([AuditDataId], [AuditEventId], [Key], [Value], [IsAlert]) VALUES (0, 0x0180, 'Input Voltage Source Not Detected', 'Input Voltage Source Not Detected', 0)"]
[null,"Audit","POWER_SOURCE ","Input Power Source","Line Power",null,null,"0x0180","0001",null,null,null,null,"IF EXISTS(SELECT TOP 1 * FROM [AuditEvent] WHERE [AuditEventId] = 0x0180) UPDATE [AuditEvent] SET [Key] = 'Input Power Source', [Value] = 'Input Power Source', [IsAlert] = 0 WHERE [AuditEventId] = 0x0180 ELSE INSERT INTO [AuditEvent] ([AuditEventId], [Key], [Value], [IsAlert]) VALUES (0x0180, 'Input Power Source', 'Input Power Source', 0)","IF EXISTS(SELECT TOP 1 * FROM [AuditData] WHERE [AuditDataId] = 1 AND [AuditEventId] = 0x0180) UPDATE [AuditData] SET [Key] = 'Line Power', [Value] = 'Line Power', [IsAlert] = 0 WHERE [AuditDataId] = 1 AND [AuditEventId] = 0x0180 ELSE INSERT INTO [AuditData] ([AuditDataId], [AuditEventId], [Key], [Value], [IsAlert]) VALUES (1, 0x0180, 'Line Power', 'Line Power', 0)"]
[null,"Audit","POWER_SOURCE ","Input Power Source","POE",null,null,"0x0180","0002",null,null,null,null,"IF EXISTS(SELECT TOP 1 * FROM [AuditEvent] WHERE [AuditEventId] = 0x0180) UPDATE [AuditEvent] SET [Key] = 'Input Power Source', [Value] = 'Input Power Source', [IsAlert] = 0 WHERE [AuditEventId] = 0x0180 ELSE INSERT INTO [AuditEvent] ([AuditEventId], [Key], [Value], [IsAlert]) VALUES (0x0180, 'Input Power Source', 'Input Power Source', 0)","IF EXISTS(SELECT TOP 1 * FROM [AuditData] WHERE [AuditDataId] = 2 AND [AuditEventId] = 0x0180) UPDATE [AuditData] SET [Key] = 'POE', [Value] = 'POE', [IsAlert] = 0 WHERE [AuditDataId] = 2 AND [AuditEventId] = 0x0180 ELSE INSERT INTO [AuditData] ([AuditDataId], [AuditEventId], [Key], [Value], [IsAlert]) VALUES (2, 0x0180, 'POE', 'POE', 0)"]
[null,"Audit","POWER_SOURCE ","Input Power Source","POE+",null,null,"0x0180","0003",null,null,null,null,"IF EXISTS(SELECT TOP 1 * FROM [AuditEvent] WHERE [AuditEventId] = 0x0180) UPDATE [AuditEvent] SET [Key] = 'Input Power Source', [Value] = 'Input Power Source', [IsAlert] = 0 WHERE [AuditEventId] = 0x0180 ELSE INSERT INTO [AuditEvent] ([AuditEventId], [Key], [Value], [IsAlert]) VALUES (0x0180, 'Input Power Source', 'Input Power Source', 0)","IF EXISTS(SELECT TOP 1 * FROM [AuditData] WHERE [AuditDataId] = 3 AND [AuditEventId] = 0x0180) UPDATE [AuditData] SET [Key] = 'POE+', [Value] = 'POE+', [IsAlert] = 0 WHERE [AuditDataId] = 3 AND [AuditEventId] = 0x0180 ELSE INSERT INTO [AuditData] ([AuditDataId], [AuditEventId], [Key], [Value], [IsAlert]) VALUES (3, 0x0180, 'POE+', 'POE+', 0)"]
[null,"Audit","POWER_SOURCE ","Input Power Source","Battery",null,null,"0x0180","0004",null,null,null,null,"IF EXISTS(SELECT TOP 1 * FROM [AuditEvent] WHERE [AuditEventId] = 0x0180) UPDATE [AuditEvent] SET [Key] = 'Input Power Source', [Value] = 'Input Power Source', [IsAlert] = 0 WHERE [AuditEventId] = 0x0180 ELSE INSERT INTO [AuditEvent] ([AuditEventId], [Key], [Value], [IsAlert]) VALUES (0x0180, 'Input Power Source', 'Input Power Source', 0)","IF EXISTS(SELECT TOP 1 * FROM [AuditData] WHERE [AuditDataId] = 4 AND [AuditEventId] = 0x0180) UPDATE [AuditData] SET [Key] = 'Battery', [Value] = 'Battery', [IsAlert] = 0 WHERE [AuditDataId] = 4 AND [AuditEventId] = 0x0180 ELSE INSERT INTO [AuditData] ([AuditDataId], [AuditEventId], [Key], [Value], [IsAlert]) VALUES (4, 0x0180, 'Battery', 'Battery', 0)"]
[null,"Audit","POWER_VOLTAGE","Line Voltage (mV)","xxxx",null,null,"0x0181","xxxx","0 to 999","Millivolts","Line Voltage (mV)",null,"IF EXISTS(SELECT TOP 1 * FROM [AuditEvent] WHERE [AuditEventId] = 0x0181) UPDATE [AuditEvent] SET [Key] = 'Line Voltage (mV)', [Value] = 'Line Voltage (mV)', [IsAlert] = 0 WHERE [AuditEventId] = 0x0181 ELSE INSERT INTO [AuditEvent] ([AuditEventId], [Key], [Value], [IsAlert]) VALUES (0x0181, 'Line Voltage (mV)', 'Line Voltage (mV)', 0)","-- no value"]
[null,null,null,null,null,null,null,null,null,null,null,null,null,"-- no value","-- no value"]
["Bluetooth Low Energy Audits",null,null,null,null,null,null,null,null,null,null,null,null,"-- no value","-- no value"]
["Base Value",null,null,null,null,null,null,null,null,null,null,null,null,"-- no value","-- no value"]
["0x0200","Audit","BLE_MAPP_CONNECTED_DUID0","Bluetooth Low Energy","Connected to Mobile App",{"$f":"LEN(D22)","v":20},{"$f":"LEN(E22)","v":23},"0x0200",0,null,null,null,null,"IF EXISTS(SELECT TOP 1 * FROM [AuditEvent] WHERE [AuditEventId] = 0x0200) UPDATE [AuditEvent] SET [Key] = 'Bluetooth Low Energy', [Value] = 'Bluetooth Low Energy', [IsAlert] = 0 WHERE [AuditEventId] = 0x0200 ELSE INSERT INTO [AuditEvent] ([AuditEventId], [Key], [Value], [IsAlert]) VALUES (0x0200, 'Bluetooth Low Energy', 'Bluetooth Low Energy', 0)","IF EXISTS(SELECT TOP 1 * FROM [AuditData] WHERE [AuditDataId] = 0 AND [AuditEventId] = 0x0200) UPDATE [AuditData] SET [Key] = 'Connected to Mobile App', [Value] = 'Connected to Mobile App', [IsAlert] = 0 WHERE [AuditDataId] = 0 AND [AuditEventId] = 0x0200 ELSE INSERT INTO [AuditData] ([AuditDataId], [AuditEventId], [Key], [Value], [IsAlert]) VALUES (0, 0x0200, 'Connected to Mobile App', 'Connected to Mobile App', 0)"]
[null,"Audit","BLE_MAPP_DISCONNECT","BLE MAPP Disconnect","Invalid JSON data transfer size",{"$f":"LEN(D23)","v":19},{"$f":"LEN(E23)","v":31},"0x0208",0,null,null,null,null,"IF EXISTS(SELECT TOP 1 * FROM [AuditEvent] WHERE [AuditEventId] = 0x0208) UPDATE [AuditEvent] SET [Key] = 'BLE MAPP Disconnect', [Value] = 'BLE MAPP Disconnect', [IsAlert] = 0 WHERE [AuditEventId] = 0x0208 ELSE INSERT INTO [AuditEvent] ([AuditEventId], [Key], [Value], [IsAlert]) VALUES (0x0208, 'BLE MAPP Disconnect', 'BLE MAPP Disconnect', 0)","IF EXISTS(SELECT TOP 1 * FROM [AuditData] WHERE [AuditDataId] = 0 AND [AuditEventId] = 0x0208) UPDATE [AuditData] SET [Key] = 'Invalid JSON data transfer size', [Value] = 'Invalid JSON data transfer size', [IsAlert] = 0 WHERE [AuditDataId] = 0 AND [AuditEventId] = 0x0208 ELSE INSERT INTO [AuditData] ([AuditDataId], [AuditEventId], [Key], [Value], [IsAlert]) VALUES (0, 0x0208, 'Invalid JSON data transfer size', 'Invalid JSON data transfer size', 0)"]
["Reader Audits",null,null,null,null,null,null,null,null,null,null,null,null,"-- no value","-- no value"]
["Base Value",null,null,null,null,null,null,null,null,null,null,null,null,"-- no value","-- no value"]
["0x0300","Audit","INVALID_READER_CONFIG_IGNORED ","Invalid Reader Configuration",null,null,null,"0x0300",0,null,null,null,null,"IF EXISTS(SELECT TOP 1 * FROM [AuditEvent] WHERE [AuditEventId] = 0x0300) UPDATE [AuditEvent] SET [Key] = 'Invalid Reader Configuration', [Value] = 'Invalid Reader Configuration', [IsAlert] = 0 WHERE [AuditEventId] = 0x0300 ELSE INSERT INTO [AuditEvent] ([AuditEventId], [Key], [Value], [IsAlert]) VALUES (0x0300, 'Invalid Reader Configuration', 'Invalid Reader Configuration', 0)","IF EXISTS(SELECT TOP 1 * FROM [AuditData] WHERE [AuditDataId] = 0 AND [AuditEventId] = 0x0300) UPDATE [AuditData] SET [Key] = '', [Value] = '', [IsAlert] = 0 WHERE [AuditDataId] = 0 AND [AuditEventId] = 0x0300 ELSE INSERT INTO [AuditData] ([AuditDataId], [AuditEventId], [Key], [Value], [IsAlert]) VALUES (0, 0x0300, '', '', 0)"]
[null,"Audit","READER_NO_TOUR_NOT_SUPPORTED","No Tour not supported by reader",null,null,null,"0x0301",0,null,null,null,null,"IF EXISTS(SELECT TOP 1 * FROM [AuditEvent] WHERE [AuditEventId] = 0x0301) UPDATE [AuditEvent] SET [Key] = 'No Tour not supported by reader', [Value] = 'No Tour not supported by reader', [IsAlert] = 0 WHERE [AuditEventId] = 0x0301 ELSE INSERT INTO [AuditEvent] ([AuditEventId], [Key], [Value], [IsAlert]) VALUES (0x0301, 'No Tour not supported by reader', 'No Tour not supported by reader', 0)","IF EXISTS(SELECT TOP 1 * FROM [AuditData] WHERE [AuditDataId] = 0 AND [AuditEventId] = 0x0301) UPDATE [AuditData] SET [Key] = '', [Value] = '', [IsAlert] = 0 WHERE [AuditDataId] = 0 AND [AuditEventId] = 0x0301 ELSE INSERT INTO [AuditData] ([AuditDataId], [AuditEventId], [Key], [Value], [IsAlert]) VALUES (0, 0x0301, '', '', 0)"]
[null,"Audit","READER_CONFIGURED_NO_TOUR","Reader Configured for No Tour",null,null,null,"0x0302",0,null,null,null,null,"IF EXISTS(SELECT TOP 1 * FROM [AuditEvent] WHERE [AuditEventId] = 0x0302) UPDATE [AuditEvent] SET [Key] = 'Reader Configured for No Tour', [Value] = 'Reader Configured for No Tour', [IsAlert] = 0 WHERE [AuditEventId] = 0x0302 ELSE INSERT INTO [AuditEvent] ([AuditEventId], [Key], [Value], [IsAlert]) VALUES (0x0302, 'Reader Configured for No Tour', 'Reader Configured for No Tour', 0)","IF EXISTS(SELECT TOP 1 * FROM [AuditData] WHERE [AuditDataId] = 0 AND [AuditEventId] = 0x0302) UPDATE [AuditData] SET [Key] = '', [Value] = '', [IsAlert] = 0 WHERE [AuditDataId] = 0 AND [AuditEventId] = 0x0302 ELSE INSERT INTO [AuditData] ([AuditDataId], [AuditEventId], [Key], [Value], [IsAlert]) VALUES (0, 0x0302, '', '', 0)"]
[null,"Audit","NEEDS_READER_RESYNCKEYSEQ","Unpaired or unsupported reader detected",null,null,null,"0x0303",0,null,null,null,null,"IF EXISTS(SELECT TOP 1 * FROM [AuditEvent] WHERE [AuditEventId] = 0x0303) UPDATE [AuditEvent] SET [Key] = 'Unpaired or unsupported reader detected', [Value] = 'Unpaired or unsupported reader detected', [IsAlert] = 0 WHERE [AuditEventId] = 0x0303 ELSE INSERT INTO [AuditEvent] ([AuditEventId], [Key], [Value], [IsAlert]) VALUES (0x0303, 'Unpaired or unsupported reader detected', 'Unpaired or unsupported reader detected', 0)","IF EXISTS(SELECT TOP 1 * FROM [AuditData] WHERE [AuditDataId] = 0 AND [AuditEventId] = 0x0303) UPDATE [AuditData] SET [Key] = '', [Value] = '', [IsAlert] = 0 WHERE [AuditDataId] = 0 AND [AuditEventId] = 0x0303 ELSE INSERT INTO [AuditData] ([AuditDataId], [AuditEventId], [Key], [Value], [IsAlert]) VALUES (0, 0x0303, '', '', 0)"]
[null,null,null,null,null,null,null,null,null,null,null,null,null,"-- no value","-- no value"]
["Lock Configuration Audits",null,null,null,null,null,null,null,null,null,null,null,null,"-- no value","-- no value"]
["Base Value",null,null,null,null,null,null,null,null,null,null,null,null,"-- no value","-- no value"]
["0x0400","Audit","CONFIG_UPDATE  ","Lock Configurations","Updated successfully",{"$f":"LEN(D33)","v":19},{"$f":"LEN(E33)","v":20},"0x0400",0,null,null,null,null,"IF EXISTS(SELECT TOP 1 * FROM [AuditEvent] WHERE [AuditEventId] = 0x0400) UPDATE [AuditEvent] SET [Key] = 'Lock Configurations', [Value] = 'Lock Configurations', [IsAlert] = 0 WHERE [AuditEventId] = 0x0400 ELSE INSERT INTO [AuditEvent] ([AuditEventId], [Key], [Value], [IsAlert]) VALUES (0x0400, 'Lock Configurations', 'Lock Configurations', 0)","IF EXISTS(SELECT TOP 1 * FROM [AuditData] WHERE [AuditDataId] = 0 AND [AuditEventId] = 0x0400) UPDATE [AuditData] SET [Key] = 'Updated successfully', [Value] = 'Updated successfully', [IsAlert] = 0 WHERE [AuditDataId] = 0 AND [AuditEventId] = 0x0400 ELSE INSERT INTO [AuditData] ([AuditDataId], [AuditEventId], [Key], [Value], [IsAlert]) VALUES (0, 0x0400, 'Updated successfully', 'Updated successfully', 0)"]
[null,"Audit","INVALID_LOCK_PARAMETER_REC  ","Configuration Error","Invalid relock delay value",19,26,"0x0401","0001",null,null,null,null,"IF EXISTS(SELECT TOP 1 * FROM [AuditEvent] WHERE [AuditEventId] = 0x0401) UPDATE [AuditEvent] SET [Key] = 'Configuration Error', [Value] = 'Configuration Error', [IsAlert] = 0 WHERE [AuditEventId] = 0x0401 ELSE INSERT INTO [AuditEvent] ([AuditEventId], [Key], [Value], [IsAlert]) VALUES (0x0401, 'Configuration Error', 'Configuration Error', 0)","IF EXISTS(SELECT TOP 1 * FROM [AuditData] WHERE [AuditDataId] = 1 AND [AuditEventId] = 0x0401) UPDATE [AuditData] SET [Key] = 'Invalid relock delay value', [Value] = 'Invalid relock delay value', [IsAlert] = 0 WHERE [AuditDataId] = 1 AND [AuditEventId] = 0x0401 ELSE INSERT INTO [AuditData] ([AuditDataId], [AuditEventId], [Key], [Value], [IsAlert]) VALUES (1, 0x0401, 'Invalid relock delay value', 'Invalid relock delay value', 0)"]
[null,"Audit","INVALID_LOCK_PARAMETER_REC  ","Configuration Error","Invalid door prop value",19,23,"0x0401","0002",null,null,null,null,"IF EXISTS(SELECT TOP 1 * FROM [AuditEvent] WHERE [AuditEventId] = 0x0401) UPDATE [AuditEvent] SET [Key] = 'Configuration Error', [Value] = 'Configuration Error', [IsAlert] = 0 WHERE [AuditEventId] = 0x0401 ELSE INSERT INTO [AuditEvent] ([AuditEventId], [Key], [Value], [IsAlert]) VALUES (0x0401, 'Configuration Error', 'Configuration Error', 0)","IF EXISTS(SELECT TOP 1 * FROM [AuditData] WHERE [AuditDataId] = 2 AND [AuditEventId] = 0x0401) UPDATE [AuditData] SET [Key] = 'Invalid door prop value', [Value] = 'Invalid door prop value', [IsAlert] = 0 WHERE [AuditDataId] = 2 AND [AuditEventId] = 0x0401 ELSE INSERT INTO [AuditData] ([AuditDataId], [AuditEventId], [Key], [Value], [IsAlert]) VALUES (2, 0x0401, 'Invalid door prop value', 'Invalid door prop value', 0)"]
[null,"Audit","INVALID_LOCK_PARAMETER_REC  ","Configuration Error","Invalid ADA relock value",19,24,"0x0401","0003",null,null,null,null,"IF EXISTS(SELECT TOP 1 * FROM [AuditEvent] WHERE [AuditEventId] = 0x0401) UPDATE [AuditEvent] SET [Key] = 'Configuration Error', [Value] = 'Configuration Error', [IsAlert] = 0 WHERE [AuditEventId] = 0x0401 ELSE INSERT INTO [AuditEvent] ([AuditEventId], [Key], [Value], [IsAlert]) VALUES (0x0401, 'Configuration Error', 'Configuration Error', 0)","IF EXISTS(SELECT TOP 1 * FROM [AuditData] WHERE [AuditDataId] = 3 AND [AuditEventId] = 0x0401) UPDATE [AuditData] SET [Key] = 'Invalid ADA relock value', [Value] = 'Invalid ADA relock value', [IsAlert] = 0 WHERE [AuditDataId] = 3 AND [AuditEventId] = 0x0401 ELSE INSERT INTO [AuditData] ([AuditDataId], [AuditEventId], [Key], [Value], [IsAlert]) VALUES (3, 0x0401, 'Invalid ADA relock value', 'Invalid ADA relock value', 0)"]
[null,"Audit","INVALID_LOCK_PARAMETER_REC  ","Configuration Error","Invalid lock function value",19,27,"0x0401","0004",null,null,null,null,"IF EXISTS(SELECT TOP 1 * FROM [AuditEvent] WHERE [AuditEventId] = 0x0401) UPDATE [AuditEvent] SET [Key] = 'Configuration Error', [Value] = 'Configuration Error', [IsAlert] = 0 WHERE [AuditEventId] = 0x0401 ELSE INSERT INTO [AuditEvent] ([AuditEventId], [Key], [Value], [IsAlert]) VALUES (0x0401, 'Configuration Error', 'Configuration Error', 0)","IF EXISTS(SELECT TOP 1 * FROM [AuditData] WHERE [AuditDataId] = 4 AND [AuditEventId] = 0x0401) UPDATE [AuditData] SET [Key] = 'Invalid lock function value', [Value] = 'Invalid lock function value', [IsAlert] = 0 WHERE [AuditDataId] = 4 AND [AuditEventId] = 0x0401 ELSE INSERT INTO [AuditData] ([AuditDataId], [AuditEventId], [Key], [Value], [IsAlert]) VALUES (4, 0x0401, 'Invalid lock function value', 'Invalid lock function value', 0)"]
[null,"Audit","INVALID_LOCK_PARAMETER_REC  ","Configuration Error","Invalid battery fail value",19,26,"0x0401","0005",null,null,null,null,"IF EXISTS(SELECT TOP 1 * FROM [AuditEvent] WHERE [AuditEventId] = 0x0401) UPDATE [AuditEvent] SET [Key] = 'Configuration Error', [Value] = 'Configuration Error', [IsAlert] = 0 WHERE [AuditEventId] = 0x0401 ELSE INSERT INTO [AuditEvent] ([AuditEventId], [Key], [Value], [IsAlert]) VALUES (0x0401, 'Configuration Error', 'Configuration Error', 0)","IF EXISTS(SELECT TOP 1 * FROM [AuditData] WHERE [AuditDataId] = 5 AND [AuditEventId] = 0x0401) UPDATE [AuditData] SET [Key] = 'Invalid battery fail value', [Value] = 'Invalid battery fail value', [IsAlert] = 0 WHERE [AuditDataId] = 5 AND [AuditEventId] = 0x0401 ELSE INSERT INTO [AuditData] ([AuditDataId], [AuditEventId], [Key], [Value], [IsAlert]) VALUES (5, 0x0401, 'Invalid battery fail value', 'Invalid battery fail value', 0)"]
[null,"Audit","INVALID_LOCK_PARAMETER_REC  ","Configuration Error","Invalid comm. loss fail value",19,29,"0x0401","0006",null,null,null,null,"IF EXISTS(SELECT TOP 1 * FROM [AuditEvent] WHERE [AuditEventId] = 0x0401) UPDATE [AuditEvent] SET [Key] = 'Configuration Error', [Value] = 'Configuration Error', [IsAlert] = 0 WHERE [AuditEventId] = 0x0401 ELSE INSERT INTO [AuditEvent] ([AuditEventId], [Key], [Value], [IsAlert]) VALUES (0x0401, 'Configuration Error', 'Configuration Error', 0)","IF EXISTS(SELECT TOP 1 * FROM [AuditData] WHERE [AuditDataId] = 6 AND [AuditEventId] = 0x0401) UPDATE [AuditData] SET [Key] = 'Invalid comm. loss fail value', [Value] = 'Invalid comm. loss fail value', [IsAlert] = 0 WHERE [AuditDataId] = 6 AND [AuditEventId] = 0x0401 ELSE INSERT INTO [AuditData] ([AuditDataId], [AuditEventId], [Key], [Value], [IsAlert]) VALUES (6, 0x0401, 'Invalid comm. loss fail value', 'Invalid comm. loss fail value', 0)"]
[null,"Audit","INVALID_LOCK_PARAMETER_REC  ","Configuration Error","Invalid auto purge value",19,24,"0x0401","0007",null,null,null,null,"IF EXISTS(SELECT TOP 1 * FROM [AuditEvent] WHERE [AuditEventId] = 0x0401) UPDATE [AuditEvent] SET [Key] = 'Configuration Error', [Value] = 'Configuration Error', [IsAlert] = 0 WHERE [AuditEventId] = 0x0401 ELSE INSERT INTO [AuditEvent] ([AuditEventId], [Key], [Value], [IsAlert]) VALUES (0x0401, 'Configuration Error', 'Configuration Error', 0)","IF EXISTS(SELECT TOP 1 * FROM [AuditData] WHERE [AuditDataId] = 7 AND [AuditEventId] = 0x0401) UPDATE [AuditData] SET [Key] = 'Invalid auto purge value', [Value] = 'Invalid auto purge value', [IsAlert] = 0 WHERE [AuditDataId] = 7 AND [AuditEventId] = 0x0401 ELSE INSERT INTO [AuditData] ([AuditDataId], [AuditEventId], [Key], [Value], [IsAlert]) VALUES (7, 0x0401, 'Invalid auto purge value', 'Invalid auto purge value', 0)"]
[null,"Audit","INVALID_LOCK_PARAMETER_REC  ","Configuration Error","Invalid change bits cache value",19,31,"0x0401","0008",null,null,null,null,"IF EXISTS(SELECT TOP 1 * FROM [AuditEvent] WHERE [AuditEventId] = 0x0401) UPDATE [AuditEvent] SET [Key] = 'Configuration Error', [Value] = 'Configuration Error', [IsAlert] = 0 WHERE [AuditEventId] = 0x0401 ELSE INSERT INTO [AuditEvent] ([AuditEventId], [Key], [Value], [IsAlert]) VALUES (0x0401, 'Configuration Error', 'Configuration Error', 0)","IF EXISTS(SELECT TOP 1 * FROM [AuditData] WHERE [AuditDataId] = 8 AND [AuditEventId] = 0x0401) UPDATE [AuditData] SET [Key] = 'Invalid change bits cache value', [Value] = 'Invalid change bits cache value', [IsAlert] = 0 WHERE [AuditDataId] = 8 AND [AuditEventId] = 0x0401 ELSE INSERT INTO [AuditData] ([AuditDataId], [AuditEventId], [Key], [Value], [IsAlert]) VALUES (8, 0x0401, 'Invalid change bits cache value', 'Invalid change bits cache value', 0)"]
[null,"Audit","INVALID_LOCK_PARAMETER_REC  ","Configuration Error","Invalid bits to store value",19,27,"0x0401","0009",null,null,null,null,"IF EXISTS(SELECT TOP 1 * FROM [AuditEvent] WHERE [AuditEventId] = 0x0401) UPDATE [AuditEvent] SET [Key] = 'Configuration Error', [Value] = 'Configuration Error', [IsAlert] = 0 WHERE [AuditEventId] = 0x0401 ELSE INSERT INTO [AuditEvent] ([AuditEventId], [Key], [Value], [IsAlert]) VALUES (0x0401, 'Configuration Error', 'Configuration Error', 0)","IF EXISTS(SELECT TOP 1 * FROM [AuditData] WHERE [AuditDataId] = 9 AND [AuditEventId] = 0x0401) UPDATE [AuditData] SET [Key] = 'Invalid bits to store value', [Value] = 'Invalid bits to store value', [IsAlert] = 0 WHERE [AuditDataId] = 9 AND [AuditEventId] = 0x0401 ELSE INSERT INTO [AuditData] ([AuditDataId], [AuditEventId], [Key], [Value], [IsAlert]) VALUES (9, 0x0401, 'Invalid bits to store value', 'Invalid bits to store value', 0)"]
[null,"Audit","INVALID_LOCK_PARAMETER_REC  ","Configuration Error","Invalid lock mode setting",19,25,"0x0401","000A",null,null,null,null,"IF EXISTS(SELECT TOP 1 * FROM [AuditEvent] WHERE [AuditEventId] = 0x0401) UPDATE [AuditEvent] SET [Key] = 'Configuration Error', [Value] = 'Configuration Error', [IsAlert] = 0 WHERE [AuditEventId] = 0x0401 ELSE INSERT INTO [AuditEvent] ([AuditEventId], [Key], [Value], [IsAlert]) VALUES (0x0401, 'Configuration Error', 'Configuration Error', 0)","IF EXISTS(SELECT TOP 1 * FROM [AuditData] WHERE [AuditDataId] = 10 AND [AuditEventId] = 0x0401) UPDATE [AuditData] SET [Key] = 'Invalid lock mode setting', [Value] = 'Invalid lock mode setting', [IsAlert] = 0 WHERE [AuditDataId] = 10 AND [AuditEventId] = 0x0401 ELSE INSERT INTO [AuditData] ([AuditDataId], [AuditEventId], [Key], [Value], [IsAlert]) VALUES (10, 0x0401, 'Invalid lock mode setting', 'Invalid lock mode setting', 0)"]
[null,"Audit","INVALID_LOCK_PARAMETER_REC  ","Configuration Error","Invalid lock name",19,17,"0x0401","000B",null,null,null,null,"IF EXISTS(SELECT TOP 1 * FROM [AuditEvent] WHERE [AuditEventId] = 0x0401) UPDATE [AuditEvent] SET [Key] = 'Configuration Error', [Value] = 'Configuration Error', [IsAlert] = 0 WHERE [AuditEventId] = 0x0401 ELSE INSERT INTO [AuditEvent] ([AuditEventId], [Key], [Value], [IsAlert]) VALUES (0x0401, 'Configuration Error', 'Configuration Error', 0)","IF EXISTS(SELECT TOP 1 * FROM [AuditData] WHERE [AuditDataId] = 11 AND [AuditEventId] = 0x0401) UPDATE [AuditData] SET [Key] = 'Invalid lock name', [Value] = 'Invalid lock name', [IsAlert] = 0 WHERE [AuditDataId] = 11 AND [AuditEventId] = 0x0401 ELSE INSERT INTO [AuditData] ([AuditDataId], [AuditEventId], [Key], [Value], [IsAlert]) VALUES (11, 0x0401, 'Invalid lock name', 'Invalid lock name', 0)"]
[null,"Audit","INVALID_LOCK_PARAMETER_REC  ","Configuration Error","Invalid Sector - No Tour",19,24,"0x0401","000C",null,null,null,null,"IF EXISTS(SELECT TOP 1 * FROM [AuditEvent] WHERE [AuditEventId] = 0x0401) UPDATE [AuditEvent] SET [Key] = 'Configuration Error', [Value] = 'Configuration Error', [IsAlert] = 0 WHERE [AuditEventId] = 0x0401 ELSE INSERT INTO [AuditEvent] ([AuditEventId], [Key], [Value], [IsAlert]) VALUES (0x0401, 'Configuration Error', 'Configuration Error', 0)","IF EXISTS(SELECT TOP 1 * FROM [AuditData] WHERE [AuditDataId] = 12 AND [AuditEventId] = 0x0401) UPDATE [AuditData] SET [Key] = 'Invalid Sector - No Tour', [Value] = 'Invalid Sector - No Tour', [IsAlert] = 0 WHERE [AuditDataId] = 12 AND [AuditEventId] = 0x0401 ELSE INSERT INTO [AuditData] ([AuditDataId], [AuditEventId], [Key], [Value], [IsAlert]) VALUES (12, 0x0401, 'Invalid Sector - No Tour', 'Invalid Sector - No Tour', 0)"]
[null,"Audit","INVALID_LOCK_PARAMETER_REC  ","Configuration Error","Invalid Credential Sector",19,25,"0x0401","000D",null,null,null,null,"IF EXISTS(SELECT TOP 1 * FROM [AuditEvent] WHERE [AuditEventId] = 0x0401) UPDATE [AuditEvent] SET [Key] = 'Configuration Error', [Value] = 'Configuration Error', [IsAlert] = 0 WHERE [AuditEventId] = 0x0401 ELSE INSERT INTO [AuditEvent] ([AuditEventId], [Key], [Value], [IsAlert]) VALUES (0x0401, 'Configuration Error', 'Configuration Error', 0)","IF EXISTS(SELECT TOP 1 * FROM [AuditData] WHERE [AuditDataId] = 13 AND [AuditEventId] = 0x0401) UPDATE [AuditData] SET [Key] = 'Invalid Credential Sector', [Value] = 'Invalid Credential Sector', [IsAlert] = 0 WHERE [AuditDataId] = 13 AND [AuditEventId] = 0x0401 ELSE INSERT INTO [AuditData] ([AuditDataId], [AuditEventId], [Key], [Value], [IsAlert]) VALUES (13, 0x0401, 'Invalid Credential Sector', 'Invalid Credential Sector', 0)"]
[null,"Audit","INVALID_LOCK_PARAMETER_REC  ","Configuration Error","Invalid Decision Mode",19,21,"0x0401","000E",null,null,null,null,"IF EXISTS(SELECT TOP 1 * FROM [AuditEvent] WHERE [AuditEventId] = 0x0401) UPDATE [AuditEvent] SET [Key] = 'Configuration Error', [Value] = 'Configuration Error', [IsAlert] = 0 WHERE [AuditEventId] = 0x0401 ELSE INSERT INTO [AuditEvent] ([AuditEventId], [Key], [Value], [IsAlert]) VALUES (0x0401, 'Configuration Error', 'Configuration Error', 0)","IF EXISTS(SELECT TOP 1 * FROM [AuditData] WHERE [AuditDataId] = 14 AND [AuditEventId] = 0x0401) UPDATE [AuditData] SET [Key] = 'Invalid Decision Mode', [Value] = 'Invalid Decision Mode', [IsAlert] = 0 WHERE [AuditDataId] = 14 AND [AuditEventId] = 0x0401 ELSE INSERT INTO [AuditData] ([AuditDataId], [AuditEventId], [Key], [Value], [IsAlert]) VALUES (14, 0x0401, 'Invalid Decision Mode', 'Invalid Decision Mode', 0)"]
[null,"Audit","INVALID_LOCK_PARAMETER_REC  ","Configuration Error","Invalid Heartbeat Time",19,22,"0x0401","000F",null,null,null,null,"IF EXISTS(SELECT TOP 1 * FROM [AuditEvent] WHERE [AuditEventId] = 0x0401) UPDATE [AuditEvent] SET [Key] = 'Configuration Error', [Value] = 'Configuration Error', [IsAlert] = 0 WHERE [AuditEventId] = 0x0401 ELSE INSERT INTO [AuditEvent] ([AuditEventId], [Key], [Value], [IsAlert]) VALUES (0x0401, 'Configuration Error', 'Configuration Error', 0)","IF EXISTS(SELECT TOP 1 * FROM [AuditData] WHERE [AuditDataId] = 15 AND [AuditEventId] = 0x0401) UPDATE [AuditData] SET [Key] = 'Invalid Heartbeat Time', [Value] = 'Invalid Heartbeat Time', [IsAlert] = 0 WHERE [AuditDataId] = 15 AND [AuditEventId] = 0x0401 ELSE INSERT INTO [AuditData] ([AuditDataId], [AuditEventId], [Key], [Value], [IsAlert]) VALUES (15, 0x0401, 'Invalid Heartbeat Time', 'Invalid Heartbeat Time', 0)"]
[null,"Audit","INVALID_LOCK_PARAMETER_REC  ","Configuration Error","Invalid retry time",19,18,"0x0401","0010",null,null,null,null,"IF EXISTS(SELECT TOP 1 * FROM [AuditEvent] WHERE [AuditEventId] = 0x0401) UPDATE [AuditEvent] SET [Key] = 'Configuration Error', [Value] = 'Configuration Error', [IsAlert] = 0 WHERE [AuditEventId] = 0x0401 ELSE INSERT INTO [AuditEvent] ([AuditEventId], [Key], [Value], [IsAlert]) VALUES (0x0401, 'Configuration Error', 'Configuration Error', 0)","IF EXISTS(SELECT TOP 1 * FROM [AuditData] WHERE [AuditDataId] = 16 AND [AuditEventId] = 0x0401) UPDATE [AuditData] SET [Key] = 'Invalid retry time', [Value] = 'Invalid retry time', [IsAlert] = 0 WHERE [AuditDataId] = 16 AND [AuditEventId] = 0x0401 ELSE INSERT INTO [AuditData] ([AuditDataId], [AuditEventId], [Key], [Value], [IsAlert]) VALUES (16, 0x0401, 'Invalid retry time', 'Invalid retry time', 0)"]
[null,"Audit","INVALID_LOCK_PARAMETER_REC  ","Configuration Error","Invalid Sequence Delay",19,22,"0x0401","0011",null,null,null,null,"IF EXISTS(SELECT TOP 1 * FROM [AuditEvent] WHERE [AuditEventId] = 0x0401) UPDATE [AuditEvent] SET [Key] = 'Configuration Error', [Value] = 'Configuration Error', [IsAlert] = 0 WHERE [AuditEventId] = 0x0401 ELSE INSERT INTO [AuditEvent] ([AuditEventId], [Key], [Value], [IsAlert]) VALUES (0x0401, 'Configuration Error', 'Configuration Error', 0)","IF EXISTS(SELECT TOP 1 * FROM [AuditData] WHERE [AuditDataId] = 17 AND [AuditEventId] = 0x0401) UPDATE [AuditData] SET [Key] = 'Invalid Sequence Delay', [Value] = 'Invalid Sequence Delay', [IsAlert] = 0 WHERE [AuditDataId] = 17 AND [AuditEventId] = 0x0401 ELSE INSERT INTO [AuditData] ([AuditDataId], [AuditEventId], [Key], [Value], [IsAlert]) VALUES (17, 0x0401, 'Invalid Sequence Delay', 'Invalid Sequence Delay', 0)"]
[null,"Audit","INVALID_LOCK_PARAMETER_REC  ","Configuration Error","Invalid First Delay",19,19,"0x0401","0012",null,null,null,null,"IF EXISTS(SELECT TOP 1 * FROM [AuditEvent] WHERE [AuditEventId] = 0x0401) UPDATE [AuditEvent] SET [Key] = 'Configuration Error', [Value] = 'Configuration Error', [IsAlert] = 0 WHERE [AuditEventId] = 0x0401 ELSE INSERT INTO [AuditEvent] ([AuditEventId], [Key], [Value], [IsAlert]) VALUES (0x0401, 'Configuration Error', 'Configuration Error', 0)","IF EXISTS(SELECT TOP 1 * FROM [AuditData] WHERE [AuditDataId] = 18 AND [AuditEventId] = 0x0401) UPDATE [AuditData] SET [Key] = 'Invalid First Delay', [Value] = 'Invalid First Delay', [IsAlert] = 0 WHERE [AuditDataId] = 18 AND [AuditEventId] = 0x0401 ELSE INSERT INTO [AuditData] ([AuditDataId], [AuditEventId], [Key], [Value], [IsAlert]) VALUES (18, 0x0401, 'Invalid First Delay', 'Invalid First Delay', 0)"]
[null,"Audit","INVALID_LOCK_PARAMETER_REC  ","Configuration Error","Invalid Tamper Open Action",{"$f":"LEN(D52)","v":19},{"$f":"LEN(E52)","v":26},"0x0401",13,null,null,null,null,"IF EXISTS(SELECT TOP 1 * FROM [AuditEvent] WHERE [AuditEventId] = 0x0401) UPDATE [AuditEvent] SET [Key] = 'Configuration Error', [Value] = 'Configuration Error', [IsAlert] = 0 WHERE [AuditEventId] = 0x0401 ELSE INSERT INTO [AuditEvent] ([AuditEventId], [Key], [Value], [IsAlert]) VALUES (0x0401, 'Configuration Error', 'Configuration Error', 0)","IF EXISTS(SELECT TOP 1 * FROM [AuditData] WHERE [AuditDataId] = 19 AND [AuditEventId] = 0x0401) UPDATE [AuditData] SET [Key] = 'Invalid Tamper Open Action', [Value] = 'Invalid Tamper Open Action', [IsAlert] = 0 WHERE [AuditDataId] = 19 AND [AuditEventId] = 0x0401 ELSE INSERT INTO [AuditData] ([AuditDataId], [AuditEventId], [Key], [Value], [IsAlert]) VALUES (19, 0x0401, 'Invalid Tamper Open Action', 'Invalid Tamper Open Action', 0)"]
[null,"Audit","INVALID_LOCK_PARAMETER_REC  ","Configuration Error","Invalid Wi-Fi DB Download Retry Time",{"$f":"LEN(D53)","v":19},{"$f":"LEN(E53)","v":36},"0x0401",14,null,null,null,null,"IF EXISTS(SELECT TOP 1 * FROM [AuditEvent] WHERE [AuditEventId] = 0x0401) UPDATE [AuditEvent] SET [Key] = 'Configuration Error', [Value] = 'Configuration Error', [IsAlert] = 0 WHERE [AuditEventId] = 0x0401 ELSE INSERT INTO [AuditEvent] ([AuditEventId], [Key], [Value], [IsAlert]) VALUES (0x0401, 'Configuration Error', 'Configuration Error', 0)","IF EXISTS(SELECT TOP 1 * FROM [AuditData] WHERE [AuditDataId] = 20 AND [AuditEventId] = 0x0401) UPDATE [AuditData] SET [Key] = 'Invalid Wi-Fi DB Download Retry Time', [Value] = 'Invalid Wi-Fi DB Download Retry Time', [IsAlert] = 0 WHERE [AuditDataId] = 20 AND [AuditEventId] = 0x0401 ELSE INSERT INTO [AuditData] ([AuditDataId], [AuditEventId], [Key], [Value], [IsAlert]) VALUES (20, 0x0401, 'Invalid Wi-Fi DB Download Retry Time', 'Invalid Wi-Fi DB Download Retry Time', 0)"]
[null,"Audit","INVALID_LOCK_PARAMETER_REC  ","Configuration Error","Invalid Wi-Fi DB Download Retry Count",{"$f":"LEN(D54)","v":19},{"$f":"LEN(E54)","v":37},"0x0401",15,null,null,null,null,"IF EXISTS(SELECT TOP 1 * FROM [AuditEvent] WHERE [AuditEventId] = 0x0401) UPDATE [AuditEvent] SET [Key] = 'Configuration Error', [Value] = 'Configuration Error', [IsAlert] = 0 WHERE [AuditEventId] = 0x0401 ELSE INSERT INTO [AuditEvent] ([AuditEventId], [Key], [Value], [IsAlert]) VALUES (0x0401, 'Configuration Error', 'Configuration Error', 0)","IF EXISTS(SELECT TOP 1 * FROM [AuditData] WHERE [AuditDataId] = 21 AND [AuditEventId] = 0x0401) UPDATE [AuditData] SET [Key] = 'Invalid Wi-Fi DB Download Retry Count', [Value] = 'Invalid Wi-Fi DB Download Retry Count', [IsAlert] = 0 WHERE [AuditDataId] = 21 AND [AuditEventId] = 0x0401 ELSE INSERT INTO [AuditData] ([AuditDataId], [AuditEventId], [Key], [Value], [IsAlert]) VALUES (21, 0x0401, 'Invalid Wi-Fi DB Download Retry Count', 'Invalid Wi-Fi DB Download Retry Count', 0)"]
[null,"Audit","INVALID_LOCK_PARAMETER_REC  ","Configuration Error","Invalid IPB Long Press",{"$f":"LEN(D55)","v":19},{"$f":"LEN(E55)","v":22},"0x0401",16,null,null,null,null,"IF EXISTS(SELECT TOP 1 * FROM [AuditEvent] WHERE [AuditEventId] = 0x0401) UPDATE [AuditEvent] SET [Key] = 'Configuration Error', [Value] = 'Configuration Error', [IsAlert] = 0 WHERE [AuditEventId] = 0x0401 ELSE INSERT INTO [AuditEvent] ([AuditEventId], [Key], [Value], [IsAlert]) VALUES (0x0401, 'Configuration Error', 'Configuration Error', 0)","IF EXISTS(SELECT TOP 1 * FROM [AuditData] WHERE [AuditDataId] = 22 AND [AuditEventId] = 0x0401) UPDATE [AuditData] SET [Key] = 'Invalid IPB Long Press', [Value] = 'Invalid IPB Long Press', [IsAlert] = 0 WHERE [AuditDataId] = 22 AND [AuditEventId] = 0x0401 ELSE INSERT INTO [AuditData] ([AuditDataId], [AuditEventId], [Key], [Value], [IsAlert]) VALUES (22, 0x0401, 'Invalid IPB Long Press', 'Invalid IPB Long Press', 0)"]
[null,"Audit","INVALID_LOCK_PARAMETER_REC  ","Configuration Error","Invalid Lock ID",{"$f":"LEN(D56)","v":19},{"$f":"LEN(E56)","v":15},"0x0401",17,null,null,null,null,"IF EXISTS(SELECT TOP 1 * FROM [AuditEvent] WHERE [AuditEventId] = 0x0401) UPDATE [AuditEvent] SET [Key] = 'Configuration Error', [Value] = 'Configuration Error', [IsAlert] = 0 WHERE [AuditEventId] = 0x0401 ELSE INSERT INTO [AuditEvent] ([AuditEventId], [Key], [Value], [IsAlert]) VALUES (0x0401, 'Configuration Error', 'Configuration Error', 0)","IF EXISTS(SELECT TOP 1 * FROM [AuditData] WHERE [AuditDataId] = 23 AND [AuditEventId] = 0x0401) UPDATE [AuditData] SET [Key] = 'Invalid Lock ID', [Value] = 'Invalid Lock ID', [IsAlert] = 0 WHERE [AuditDataId] = 23 AND [AuditEventId] = 0x0401 ELSE INSERT INTO [AuditData] ([AuditDataId], [AuditEventId], [Key], [Value], [IsAlert]) VALUES (23, 0x0401, 'Invalid Lock ID', 'Invalid Lock ID', 0)"]
[null,"Audit","INVALID_LOCK_PARAMETER_REC  ","Configuration Error","Invalid Group ID",19,16,"0x0401",18,null,null,null,null,"IF EXISTS(SELECT TOP 1 * FROM [AuditEvent] WHERE [AuditEventId] = 0x0401) UPDATE [AuditEvent] SET [Key] = 'Configuration Error', [Value] = 'Configuration Error', [IsAlert] = 0 WHERE [AuditEventId] = 0x0401 ELSE INSERT INTO [AuditEvent] ([AuditEventId], [Key], [Value], [IsAlert]) VALUES (0x0401, 'Configuration Error', 'Configuration Error', 0)","IF EXISTS(SELECT TOP 1 * FROM [AuditData] WHERE [AuditDataId] = 24 AND [AuditEventId] = 0x0401) UPDATE [AuditData] SET [Key] = 'Invalid Group ID', [Value] = 'Invalid Group ID', [IsAlert] = 0 WHERE [AuditDataId] = 24 AND [AuditEventId] = 0x0401 ELSE INSERT INTO [AuditData] ([AuditDataId], [AuditEventId], [Key], [Value], [IsAlert]) VALUES (24, 0x0401, 'Invalid Group ID', 'Invalid Group ID', 0)"]
[null,"Audit","INVALID_LOCK_PARAMETER_REC  ","Configuration Error","Invalid Group Elements in Array",19,31,"0x0401",19,null,null,null,null,"IF EXISTS(SELECT TOP 1 * FROM [AuditEvent] WHERE [AuditEventId] = 0x0401) UPDATE [AuditEvent] SET [Key] = 'Configuration Error', [Value] = 'Configuration Error', [IsAlert] = 0 WHERE [AuditEventId] = 0x0401 ELSE INSERT INTO [AuditEvent] ([AuditEventId], [Key], [Value], [IsAlert]) VALUES (0x0401, 'Configuration Error', 'Configuration Error', 0)","IF EXISTS(SELECT TOP 1 * FROM [AuditData] WHERE [AuditDataId] = 25 AND [AuditEventId] = 0x0401) UPDATE [AuditData] SET [Key] = 'Invalid Group Elements in Array', [Value] = 'Invalid Group Elements in Array', [IsAlert] = 0 WHERE [AuditDataId] = 25 AND [AuditEventId] = 0x0401 ELSE INSERT INTO [AuditData] ([AuditDataId], [AuditEventId], [Key], [Value], [IsAlert]) VALUES (25, 0x0401, 'Invalid Group Elements in Array', 'Invalid Group Elements in Array', 0)"]
[null,"Audit","INVALID_LOCK_PARAMETER_REC  ","Configuration Error","Invalid Pin Length",{"$f":"LEN(D59)","v":19},{"$f":"LEN(E59)","v":18},"0x0401","001A",null,null,null,null,"IF EXISTS(SELECT TOP 1 * FROM [AuditEvent] WHERE [AuditEventId] = 0x0401) UPDATE [AuditEvent] SET [Key] = 'Configuration Error', [Value] = 'Configuration Error', [IsAlert] = 0 WHERE [AuditEventId] = 0x0401 ELSE INSERT INTO [AuditEvent] ([AuditEventId], [Key], [Value], [IsAlert]) VALUES (0x0401, 'Configuration Error', 'Configuration Error', 0)","IF EXISTS(SELECT TOP 1 * FROM [AuditData] WHERE [AuditDataId] = 26 AND [AuditEventId] = 0x0401) UPDATE [AuditData] SET [Key] = 'Invalid Pin Length', [Value] = 'Invalid Pin Length', [IsAlert] = 0 WHERE [AuditDataId] = 26 AND [AuditEventId] = 0x0401 ELSE INSERT INTO [AuditData] ([AuditDataId], [AuditEventId], [Key], [Value], [IsAlert]) VALUES (26, 0x0401, 'Invalid Pin Length', 'Invalid Pin Length', 0)"]
[null,"Audit","PREVENT_CONSTRUCTION_MODE","Prevent Construction Mode","Disabled",{"$f":"LEN(D60)","v":25},{"$f":"LEN(E60)","v":8},"0x0402",0,null,null,null,null,"IF EXISTS(SELECT TOP 1 * FROM [AuditEvent] WHERE [AuditEventId] = 0x0402) UPDATE [AuditEvent] SET [Key] = 'Prevent Construction Mode', [Value] = 'Prevent Construction Mode', [IsAlert] = 0 WHERE [AuditEventId] = 0x0402 ELSE INSERT INTO [AuditEvent] ([AuditEventId], [Key], [Value], [IsAlert]) VALUES (0x0402, 'Prevent Construction Mode', 'Prevent Construction Mode', 0)","IF EXISTS(SELECT TOP 1 * FROM [AuditData] WHERE [AuditDataId] = 0 AND [AuditEventId] = 0x0402) UPDATE [AuditData] SET [Key] = 'Disabled', [Value] = 'Disabled', [IsAlert] = 0 WHERE [AuditDataId] = 0 AND [AuditEventId] = 0x0402 ELSE INSERT INTO [AuditData] ([AuditDataId], [AuditEventId], [Key], [Value], [IsAlert]) VALUES (0, 0x0402, 'Disabled', 'Disabled', 0)"]
[null,"Audit","PREVENT_CONSTRUCTION_MODE","Prevent Construction Mode","Enabled",25,7,"0x0402",1,null,null,null,null,"IF EXISTS(SELECT TOP 1 * FROM [AuditEvent] WHERE [AuditEventId] = 0x0402) UPDATE [AuditEvent] SET [Key] = 'Prevent Construction Mode', [Value] = 'Prevent Construction Mode', [IsAlert] = 0 WHERE [AuditEventId] = 0x0402 ELSE INSERT INTO [AuditEvent] ([AuditEventId], [Key], [Value], [IsAlert]) VALUES (0x0402, 'Prevent Construction Mode', 'Prevent Construction Mode', 0)","IF EXISTS(SELECT TOP 1 * FROM [AuditData] WHERE [AuditDataId] = 1 AND [AuditEventId] = 0x0402) UPDATE [AuditData] SET [Key] = 'Enabled', [Value] = 'Enabled', [IsAlert] = 0 WHERE [AuditDataId] = 1 AND [AuditEventId] = 0x0402 ELSE INSERT INTO [AuditData] ([AuditDataId], [AuditEventId], [Key], [Value], [IsAlert]) VALUES (1, 0x0402, 'Enabled', 'Enabled', 0)"]
[null,"Audit","ASM_KEY_UPDATED","ASM Key Update","Updated successfully",14,20,"0x0403",0,null,null,null,null,"IF EXISTS(SELECT TOP 1 * FROM [AuditEvent] WHERE [AuditEventId] = 0x0403) UPDATE [AuditEvent] SET [Key] = 'ASM Key Update', [Value] = 'ASM Key Update', [IsAlert] = 0 WHERE [AuditEventId] = 0x0403 ELSE INSERT INTO [AuditEvent] ([AuditEventId], [Key], [Value], [IsAlert]) VALUES (0x0403, 'ASM Key Update', 'ASM Key Update', 0)","IF EXISTS(SELECT TOP 1 * FROM [AuditData] WHERE [AuditDataId] = 0 AND [AuditEventId] = 0x0403) UPDATE [AuditData] SET [Key] = 'Updated successfully', [Value] = 'Updated successfully', [IsAlert] = 0 WHERE [AuditDataId] = 0 AND [AuditEventId] = 0x0403 ELSE INSERT INTO [AuditData] ([AuditDataId], [AuditEventId], [Key], [Value], [IsAlert]) VALUES (0, 0x0403, 'Updated successfully', 'Updated successfully', 0)"]
[null,null,null,null,null,null,null,null,null,null,null,null,null,"-- no value","-- no value"]
["Credential Audits",null,null,null,null,null,null,null,null,null,null,null,null,"-- no value","-- no value"]
["Base Value",null,null,null,null,null,null,null,null,null,null,null,null,"-- no value","-- no value"]
["0x0500","Audit","LOCKDOWN  ","Lockdown",null,{"$f":"LEN(D66)","v":8},{"$f":"LEN(E66)","v":0},"0x0500",0,null,null,null,null,"IF EXISTS(SELECT TOP 1 * FROM [AuditEvent] WHERE [AuditEventId] = 0x0500) UPDATE [AuditEvent] SET [Key] = 'Lockdown', [Value] = 'Lockdown', [IsAlert] = 0 WHERE [AuditEventId] = 0x0500 ELSE INSERT INTO [AuditEvent] ([AuditEventId], [Key], [Value], [IsAlert]) VALUES (0x0500, 'Lockdown', 'Lockdown', 0)","IF EXISTS(SELECT TOP 1 * FROM [AuditData] WHERE [AuditDataId] = 0 AND [AuditEventId] = 0x0500) UPDATE [AuditData] SET [Key] = '', [Value] = '', [IsAlert] = 0 WHERE [AuditDataId] = 0 AND [AuditEventId] = 0x0500 ELSE INSERT INTO [AuditData] ([AuditDataId], [AuditEventId], [Key], [Value], [IsAlert]) VALUES (0, 0x0500, '', '', 0)"]
[null,"Audit","LOCKDOWN_CANCELED  ","Lockdown Canceled  ",null,19,0,"0x0501",0,null,null,null,null,"IF EXISTS(SELECT TOP 1 * FROM [AuditEvent] WHERE [AuditEventId] = 0x0501) UPDATE [AuditEvent] SET [Key] = 'Lockdown Canceled', [Value] = 'Lockdown Canceled', [IsAlert] = 0 WHERE [AuditEventId] = 0x0501 ELSE INSERT INTO [AuditEvent] ([AuditEventId], [Key], [Value], [IsAlert]) VALUES (0x0501, 'Lockdown Canceled', 'Lockdown Canceled', 0)","IF EXISTS(SELECT TOP 1 * FROM [AuditData] WHERE [AuditDataId] = 0 AND [AuditEventId] = 0x0501) UPDATE [AuditData] SET [Key] = '', [Value] = '', [IsAlert] = 0 WHERE [AuditDataId] = 0 AND [AuditEventId] = 0x0501 ELSE INSERT INTO [AuditData] ([AuditDataId], [AuditEventId], [Key], [Value], [IsAlert]) VALUES (0, 0x0501, '', '', 0)"]
[null,"Audit","PASSAGE  ","Passage  ",null,9,0,"0x0502",0,null,null,null,null,"IF EXISTS(SELECT TOP 1 * FROM [AuditEvent] WHERE [AuditEventId] = 0x0502) UPDATE [AuditEvent] SET [Key] = 'Passage', [Value] = 'Passage', [IsAlert] = 0 WHERE [AuditEventId] = 0x0502 ELSE INSERT INTO [AuditEvent] ([AuditEventId], [Key], [Value], [IsAlert]) VALUES (0x0502, 'Passage', 'Passage', 0)","IF EXISTS(SELECT TOP 1 * FROM [AuditData] WHERE [AuditDataId] = 0 AND [AuditEventId] = 0x0502) UPDATE [AuditData] SET [Key] = '', [Value] = '', [IsAlert] = 0 WHERE [AuditDataId] = 0 AND [AuditEventId] = 0x0502 ELSE INSERT INTO [AuditData] ([AuditDataId], [AuditEventId], [Key], [Value], [IsAlert]) VALUES (0, 0x0502, '', '', 0)"]
[null,"Audit","PASSAGE  ","Passage","Device Schedule Event",null,null,"0x0502",1,null,null,null,null,"IF EXISTS(SELECT TOP 1 * FROM [AuditEvent] WHERE [AuditEventId] = 0x0502) UPDATE [AuditEvent] SET [Key] = 'Passage', [Value] = 'Passage', [IsAlert] = 0 WHERE [AuditEventId] = 0x0502 ELSE INSERT INTO [AuditEvent] ([AuditEventId], [Key], [Value], [IsAlert]) VALUES (0x0502, 'Passage', 'Passage', 0)","IF EXISTS(SELECT TOP 1 * FROM [AuditData] WHERE [AuditDataId] = 1 AND [AuditEventId] = 0x0502) UPDATE [AuditData] SET [Key] = 'Device Schedule Event', [Value] = 'Device Schedule Event', [IsAlert] = 0 WHERE [AuditDataId] = 1 AND [AuditEventId] = 0x0502 ELSE INSERT INTO [AuditData] ([AuditDataId], [AuditEventId], [Key], [Value], [IsAlert]) VALUES (1, 0x0502, 'Device Schedule Event', 'Device Schedule Event', 0)"]
[null,"Audit","PASSAGE  ","Passage","Holiday Schedule Event Occurred",null,null,"0x0502",2,null,null,null,null,{"$f":"IF(LEFT(H70,2)=\"0x\",CONCATENATE(\"IF EXISTS(SELECT TOP 1 * FROM [AuditEvent] WHERE [AuditEventId] = \",H70,\") UPDATE [AuditEvent] SET [Key] = '\",TRIM(D70),\"', [Value] = '\",TRIM(D70),\"', [IsAlert] = \",IF(B70=\"Audit\",0,1),\" WHERE [AuditEventId] = \",H70,\" ELSE INSERT INTO [AuditEvent] ([AuditEventId], [Key], [Value], [IsAlert]) VALUES (\",H70,\", '\",TRIM(D70),\"', '\",TRIM(D70),\"', \",IF(B70=\"Audit\",0,1), \")\"),\"-- no value\")","v":"IF EXISTS(SELECT TOP 1 * FROM [AuditEvent] WHERE [AuditEventId] = 0x0502) UPDATE [AuditEvent] SET [Key] = 'Passage', [Value] = 'Passage', [IsAlert] = 0 WHERE [AuditEventId] = 0x0502 ELSE INSERT INTO [AuditEvent] ([AuditEventId], [Key], [Value], [IsAlert]) VALUES (0x0502, 'Passage', 'Passage', 0)"},{"$f":"IF(AND(LEFT(H70,2)=\"0x\",ISNUMBER(HEX2DEC(TRIM(I70))*1)),CONCATENATE(\"IF EXISTS(SELECT TOP 1 * FROM [AuditData] WHERE [AuditDataId] = \",HEX2DEC(I70),\" AND [AuditEventId] = \",H70,\") UPDATE [AuditData] SET [Key] = '\",E70,\"', [Value] = '\",E70,\"', [IsAlert] = 0 WHERE [AuditDataId] = \",HEX2DEC(I70),\" AND [AuditEventId] = \",H70,\" ELSE INSERT INTO [AuditData] ([AuditDataId], [AuditEventId], [Key], [Value], [IsAlert]) VALUES (\",HEX2DEC(I70),\", \",H70,\", '\",E70,\"', '\",E70,\"', 0)\"),\"-- no value\")","v":"IF EXISTS(SELECT TOP 1 * FROM [AuditData] WHERE [AuditDataId] = 2 AND [AuditEventId] = 0x0502) UPDATE [AuditData] SET [Key] = 'Holiday Schedule Event Occurred', [Value] = 'Holiday Schedule Event Occurred', [IsAlert] = 0 WHERE [AuditDataId] = 2 AND [AuditEventId] = 0x0502 ELSE INSERT INTO [AuditData] ([AuditDataId], [AuditEventId], [Key], [Value], [IsAlert]) VALUES (2, 0x0502, 'Holiday Schedule Event Occurred', 'Holiday Schedule Event Occurred', 0)"}]
[null,"Audit","SECURED  ","Secured  ",null,9,0,"0x0503",0,null,null,null,null,"IF EXISTS(SELECT TOP 1 * FROM [AuditEvent] WHERE [AuditEventId] = 0x0503) UPDATE [AuditEvent] SET [Key] = 'Secured', [Value] = 'Secured', [IsAlert] = 0 WHERE [AuditEventId] = 0x0503 ELSE INSERT INTO [AuditEvent] ([AuditEventId], [Key], [Value], [IsAlert]) VALUES (0x0503, 'Secured', 'Secured', 0)","IF EXISTS(SELECT TOP 1 * FROM [AuditData] WHERE [AuditDataId] = 0 AND [AuditEventId] = 0x0503) UPDATE [AuditData] SET [Key] = '', [Value] = '', [IsAlert] = 0 WHERE [AuditDataId] = 0 AND [AuditEventId] = 0x0503 ELSE INSERT INTO [AuditData] ([AuditDataId], [AuditEventId], [Key], [Value], [IsAlert]) VALUES (0, 0x0503, '', '', 0)"]
[null,"Audit","SECURED  ","Secured","Device Schedule Event",null,null,"0x0503",1,null,null,null,null,"IF EXISTS(SELECT TOP 1 * FROM [AuditEvent] WHERE [AuditEventId] = 0x0503) UPDATE [AuditEvent] SET [Key] = 'Secured', [Value] = 'Secured', [IsAlert] = 0 WHERE [AuditEventId] = 0x0503 ELSE INSERT INTO [AuditEvent] ([AuditEventId], [Key], [Value], [IsAlert]) VALUES (0x0503, 'Secured', 'Secured', 0)","IF EXISTS(SELECT TOP 1 * FROM [AuditData] WHERE [AuditDataId] = 1 AND [AuditEventId] = 0x0503) UPDATE [AuditData] SET [Key] = 'Device Schedule Event', [Value] = 'Device Schedule Event', [IsAlert] = 0 WHERE [AuditDataId] = 1 AND [AuditEventId] = 0x0503 ELSE INSERT INTO [AuditData] ([AuditDataId], [AuditEventId], [Key], [Value], [IsAlert]) VALUES (1, 0x0503, 'Device Schedule Event', 'Device Schedule Event', 0)"]
[null,"Audit","SECURED  ","Secured","Holiday Schedule Event Occurred",null,null,"0x0503",2,null,null,null,null,"IF EXISTS(SELECT TOP 1 * FROM [AuditEvent] WHERE [AuditEventId] = 0x0503) UPDATE [AuditEvent] SET [Key] = 'Secured', [Value] = 'Secured', [IsAlert] = 0 WHERE [AuditEventId] = 0x0503 ELSE INSERT INTO [AuditEvent] ([AuditEventId], [Key], [Value], [IsAlert]) VALUES (0x0503, 'Secured', 'Secured', 0)","IF EXISTS(SELECT TOP 1 * FROM [AuditData] WHERE [AuditDataId] = 2 AND [AuditEventId] = 0x0503) UPDATE [AuditData] SET [Key] = 'Holiday Schedule Event Occurred', [Value] = 'Holiday Schedule Event Occurred', [IsAlert] = 0 WHERE [AuditDataId] = 2 AND [AuditEventId] = 0x0503 ELSE INSERT INTO [AuditData] ([AuditDataId], [AuditEventId], [Key], [Value], [IsAlert]) VALUES (2, 0x0503, 'Holiday Schedule Event Occurred', 'Holiday Schedule Event Occurred', 0)"]
[null,"Audit","TOGGLE_UNSEC  ","Toggle Passage  ",null,16,0,"0x0504",0,null,null,null,null,"IF EXISTS(SELECT TOP 1 * FROM [AuditEvent] WHERE [AuditEventId] = 0x0504) UPDATE [AuditEvent] SET [Key] = 'Toggle Passage', [Value] = 'Toggle Passage', [IsAlert] = 0 WHERE [AuditEventId] = 0x0504 ELSE INSERT INTO [AuditEvent] ([AuditEventId], [Key], [Value], [IsAlert]) VALUES (0x0504, 'Toggle Passage', 'Toggle Passage', 0)","IF EXISTS(SELECT TOP 1 * FROM [AuditData] WHERE [AuditDataId] = 0 AND [AuditEventId] = 0x0504) UPDATE [AuditData] SET [Key] = '', [Value] = '', [IsAlert] = 0 WHERE [AuditDataId] = 0 AND [AuditEventId] = 0x0504 ELSE INSERT INTO [AuditData] ([AuditDataId], [AuditEventId], [Key], [Value], [IsAlert]) VALUES (0, 0x0504, '', '', 0)"]
[null,"Audit","TOGGLE_SEC  ","Toggle Secured",null,14,0,"0x0505",0,null,null,null,null,"IF EXISTS(SELECT TOP 1 * FROM [AuditEvent] WHERE [AuditEventId] = 0x0505) UPDATE [AuditEvent] SET [Key] = 'Toggle Secured', [Value] = 'Toggle Secured', [IsAlert] = 0 WHERE [AuditEventId] = 0x0505 ELSE INSERT INTO [AuditEvent] ([AuditEventId], [Key], [Value], [IsAlert]) VALUES (0x0505, 'Toggle Secured', 'Toggle Secured', 0)","IF EXISTS(SELECT TOP 1 * FROM [AuditData] WHERE [AuditDataId] = 0 AND [AuditEventId] = 0x0505) UPDATE [AuditData] SET [Key] = '', [Value] = '', [IsAlert] = 0 WHERE [AuditDataId] = 0 AND [AuditEventId] = 0x0505 ELSE INSERT INTO [AuditData] ([AuditDataId], [AuditEventId], [Key], [Value], [IsAlert]) VALUES (0, 0x0505, '', '', 0)"]
[null,"Audit","DEL_USR_REC_W_AUDIT  ","Delete With Alarm  ",null,19,0,"0x0506",0,null,null,null,null,"IF EXISTS(SELECT TOP 1 * FROM [AuditEvent] WHERE [AuditEventId] = 0x0506) UPDATE [AuditEvent] SET [Key] = 'Delete With Alarm', [Value] = 'Delete With Alarm', [IsAlert] = 0 WHERE [AuditEventId] = 0x0506 ELSE INSERT INTO [AuditEvent] ([AuditEventId], [Key], [Value], [IsAlert]) VALUES (0x0506, 'Delete With Alarm', 'Delete With Alarm', 0)","IF EXISTS(SELECT TOP 1 * FROM [AuditData] WHERE [AuditDataId] = 0 AND [AuditEventId] = 0x0506) UPDATE [AuditData] SET [Key] = '', [Value] = '', [IsAlert] = 0 WHERE [AuditDataId] = 0 AND [AuditEventId] = 0x0506 ELSE INSERT INTO [AuditData] ([AuditDataId], [AuditEventId], [Key], [Value], [IsAlert]) VALUES (0, 0x0506, '', '', 0)"]
[null,"Audit","PASS_THROUGH","Pass Through",null,12,0,"0x0507",0,null,null,null,null,"IF EXISTS(SELECT TOP 1 * FROM [AuditEvent] WHERE [AuditEventId] = 0x0507) UPDATE [AuditEvent] SET [Key] = 'Pass Through', [Value] = 'Pass Through', [IsAlert] = 0 WHERE [AuditEventId] = 0x0507 ELSE INSERT INTO [AuditEvent] ([AuditEventId], [Key], [Value], [IsAlert]) VALUES (0x0507, 'Pass Through', 'Pass Through', 0)","IF EXISTS(SELECT TOP 1 * FROM [AuditData] WHERE [AuditDataId] = 0 AND [AuditEventId] = 0x0507) UPDATE [AuditData] SET [Key] = '', [Value] = '', [IsAlert] = 0 WHERE [AuditDataId] = 0 AND [AuditEventId] = 0x0507 ELSE INSERT INTO [AuditData] ([AuditDataId], [AuditEventId], [Key], [Value], [IsAlert]) VALUES (0, 0x0507, '', '', 0)"]
[null,"Audit","ACCESS_OUTSIDE_TIMEZONE","Denied - Schedule Violation",null,27,0,"0x0508",0,null,null,null,null,"IF EXISTS(SELECT TOP 1 * FROM [AuditEvent] WHERE [AuditEventId] = 0x0508) UPDATE [AuditEvent] SET [Key] = 'Denied - Schedule Violation', [Value] = 'Denied - Schedule Violation', [IsAlert] = 0 WHERE [AuditEventId] = 0x0508 ELSE INSERT INTO [AuditEvent] ([AuditEventId], [Key], [Value], [IsAlert]) VALUES (0x0508, 'Denied - Schedule Violation', 'Denied - Schedule Violation', 0)","IF EXISTS(SELECT TOP 1 * FROM [AuditData] WHERE [AuditDataId] = 0 AND [AuditEventId] = 0x0508) UPDATE [AuditData] SET [Key] = '', [Value] = '', [IsAlert] = 0 WHERE [AuditDataId] = 0 AND [AuditEventId] = 0x0508 ELSE INSERT INTO [AuditData] ([AuditDataId], [AuditEventId], [Key], [Value], [IsAlert]) VALUES (0, 0x0508, '', '', 0)"]
[null,"Audit","ACCESS_OUTSIDE_ACTIVATION_DATE","Denied - Not Active",null,19,0,"0x0509",0,null,null,null,null,"IF EXISTS(SELECT TOP 1 * FROM [AuditEvent] WHERE [AuditEventId] = 0x0509) UPDATE [AuditEvent] SET [Key] = 'Denied - Not Active', [Value] = 'Denied - Not Active', [IsAlert] = 0 WHERE [AuditEventId] = 0x0509 ELSE INSERT INTO [AuditEvent] ([AuditEventId], [Key], [Value], [IsAlert]) VALUES (0x0509, 'Denied - Not Active', 'Denied - Not Active', 0)","IF EXISTS(SELECT TOP 1 * FROM [AuditData] WHERE [AuditDataId] = 0 AND [AuditEventId] = 0x0509) UPDATE [AuditData] SET [Key] = '', [Value] = '', [IsAlert] = 0 WHERE [AuditDataId] = 0 AND [AuditEventId] = 0x0509 ELSE INSERT INTO [AuditData] ([AuditDataId], [AuditEventId], [Key], [Value], [IsAlert]) VALUES (0, 0x0509, '', '', 0)"]
[null,"Audit","ACCESS_OUTSIDE_EXPIRATION_DATE","Denied - Expired",null,16,0,"0x050A",0,null,null,null,null,"IF EXISTS(SELECT TOP 1 * FROM [AuditEvent] WHERE [AuditEventId] = 0x050A) UPDATE [AuditEvent] SET [Key] = 'Denied - Expired', [Value] = 'Denied - Expired', [IsAlert] = 0 WHERE [AuditEventId] = 0x050A ELSE INSERT INTO [AuditEvent] ([AuditEventId], [Key], [Value], [IsAlert]) VALUES (0x050A, 'Denied - Expired', 'Denied - Expired', 0)","IF EXISTS(SELECT TOP 1 * FROM [AuditData] WHERE [AuditDataId] = 0 AND [AuditEventId] = 0x050A) UPDATE [AuditData] SET [Key] = '', [Value] = '', [IsAlert] = 0 WHERE [AuditDataId] = 0 AND [AuditEventId] = 0x050A ELSE INSERT INTO [AuditData] ([AuditDataId], [AuditEventId], [Key], [Value], [IsAlert]) VALUES (0, 0x050A, '', '', 0)"]
[null,"Audit","ACCESS_CARD_TYPE_UNKNOWN","Unknown Credential Presented",null,28,0,"0x050B",0,null,null,null,null,"IF EXISTS(SELECT TOP 1 * FROM [AuditEvent] WHERE [AuditEventId] = 0x050B) UPDATE [AuditEvent] SET [Key] = 'Unknown Credential Presented', [Value] = 'Unknown Credential Presented', [IsAlert] = 0 WHERE [AuditEventId] = 0x050B ELSE INSERT INTO [AuditEvent] ([AuditEventId], [Key], [Value], [IsAlert]) VALUES (0x050B, 'Unknown Credential Presented', 'Unknown Credential Presented', 0)","IF EXISTS(SELECT TOP 1 * FROM [AuditData] WHERE [AuditDataId] = 0 AND [AuditEventId] = 0x050B) UPDATE [AuditData] SET [Key] = '', [Value] = '', [IsAlert] = 0 WHERE [AuditDataId] = 0 AND [AuditEventId] = 0x050B ELSE INSERT INTO [AuditData] ([AuditDataId], [AuditEventId], [Key], [Value], [IsAlert]) VALUES (0, 0x050B, '', '', 0)"]
[null,"Audit","ACCESS_WHILE_IN_REST_SECURE","Denied - Restricted Secured",null,27,0,"0x050C",0,null,null,null,null,"IF EXISTS(SELECT TOP 1 * FROM [AuditEvent] WHERE [AuditEventId] = 0x050C) UPDATE [AuditEvent] SET [Key] = 'Denied - Restricted Secured', [Value] = 'Denied - Restricted Secured', [IsAlert] = 0 WHERE [AuditEventId] = 0x050C ELSE INSERT INTO [AuditEvent] ([AuditEventId], [Key], [Value], [IsAlert]) VALUES (0x050C, 'Denied - Restricted Secured', 'Denied - Restricted Secured', 0)","IF EXISTS(SELECT TOP 1 * FROM [AuditData] WHERE [AuditDataId] = 0 AND [AuditEventId] = 0x050C) UPDATE [AuditData] SET [Key] = '', [Value] = '', [IsAlert] = 0 WHERE [AuditDataId] = 0 AND [AuditEventId] = 0x050C ELSE INSERT INTO [AuditData] ([AuditDataId], [AuditEventId], [Key], [Value], [IsAlert]) VALUES (0, 0x050C, '', '', 0)"]
[null,"Audit","ACCESS_WHILE_IN_LOCKOUT","Denied - Lockout",null,16,0,"0x050D",0,null,null,null,null,"IF EXISTS(SELECT TOP 1 * FROM [AuditEvent] WHERE [AuditEventId] = 0x050D) UPDATE [AuditEvent] SET [Key] = 'Denied - Lockout', [Value] = 'Denied - Lockout', [IsAlert] = 0 WHERE [AuditEventId] = 0x050D ELSE INSERT INTO [AuditEvent] ([AuditEventId], [Key], [Value], [IsAlert]) VALUES (0x050D, 'Denied - Lockout', 'Denied - Lockout', 0)","IF EXISTS(SELECT TOP 1 * FROM [AuditData] WHERE [AuditDataId] = 0 AND [AuditEventId] = 0x050D) UPDATE [AuditData] SET [Key] = '', [Value] = '', [IsAlert] = 0 WHERE [AuditDataId] = 0 AND [AuditEventId] = 0x050D ELSE INSERT INTO [AuditData] ([AuditDataId], [AuditEventId], [Key], [Value], [IsAlert]) VALUES (0, 0x050D, '', '', 0)"]
[null,"Audit","ACCESS_BY_ONETIME_USER","One-Time-Use Presented",null,22,0,"0x050E",0,null,null,null,null,"IF EXISTS(SELECT TOP 1 * FROM [AuditEvent] WHERE [AuditEventId] = 0x050E) UPDATE [AuditEvent] SET [Key] = 'One-Time-Use Presented', [Value] = 'One-Time-Use Presented', [IsAlert] = 0 WHERE [AuditEventId] = 0x050E ELSE INSERT INTO [AuditEvent] ([AuditEventId], [Key], [Value], [IsAlert]) VALUES (0x050E, 'One-Time-Use Presented', 'One-Time-Use Presented', 0)","IF EXISTS(SELECT TOP 1 * FROM [AuditData] WHERE [AuditDataId] = 0 AND [AuditEventId] = 0x050E) UPDATE [AuditData] SET [Key] = '', [Value] = '', [IsAlert] = 0 WHERE [AuditDataId] = 0 AND [AuditEventId] = 0x050E ELSE INSERT INTO [AuditData] ([AuditDataId], [AuditEventId], [Key], [Value], [IsAlert]) VALUES (0, 0x050E, '', '', 0)"]
[null,"Audit","STATE_CHG_REST_SEC","Restricted Secured to Secured",null,29,0,"0x050F",0,null,null,null,null,"IF EXISTS(SELECT TOP 1 * FROM [AuditEvent] WHERE [AuditEventId] = 0x050F) UPDATE [AuditEvent] SET [Key] = 'Restricted Secured to Secured', [Value] = 'Restricted Secured to Secured', [IsAlert] = 0 WHERE [AuditEventId] = 0x050F ELSE INSERT INTO [AuditEvent] ([AuditEventId], [Key], [Value], [IsAlert]) VALUES (0x050F, 'Restricted Secured to Secured', 'Restricted Secured to Secured', 0)","IF EXISTS(SELECT TOP 1 * FROM [AuditData] WHERE [AuditDataId] = 0 AND [AuditEventId] = 0x050F) UPDATE [AuditData] SET [Key] = '', [Value] = '', [IsAlert] = 0 WHERE [AuditDataId] = 0 AND [AuditEventId] = 0x050F ELSE INSERT INTO [AuditData] ([AuditDataId], [AuditEventId], [Key], [Value], [IsAlert]) VALUES (0, 0x050F, '', '', 0)"]
[null,"Audit","STATE_CHG_REST_PASSAGE","Restricted Secured to Passage",null,29,0,"0x0510",0,null,null,null,null,"IF EXISTS(SELECT TOP 1 * FROM [AuditEvent] WHERE [AuditEventId] = 0x0510) UPDATE [AuditEvent] SET [Key] = 'Restricted Secured to Passage', [Value] = 'Restricted Secured to Passage', [IsAlert] = 0 WHERE [AuditEventId] = 0x0510 ELSE INSERT INTO [AuditEvent] ([AuditEventId], [Key], [Value], [IsAlert]) VALUES (0x0510, 'Restricted Secured to Passage', 'Restricted Secured to Passage', 0)","IF EXISTS(SELECT TOP 1 * FROM [AuditData] WHERE [AuditDataId] = 0 AND [AuditEventId] = 0x0510) UPDATE [AuditData] SET [Key] = '', [Value] = '', [IsAlert] = 0 WHERE [AuditDataId] = 0 AND [AuditEventId] = 0x0510 ELSE INSERT INTO [AuditData] ([AuditDataId], [AuditEventId], [Key], [Value], [IsAlert]) VALUES (0, 0x0510, '', '', 0)"]
[null,"Audit","STATE_CHG_SEC_REST","Secured to Restricted Secured",null,29,0,"0x0511",0,null,null,null,null,"IF EXISTS(SELECT TOP 1 * FROM [AuditEvent] WHERE [AuditEventId] = 0x0511) UPDATE [AuditEvent] SET [Key] = 'Secured to Restricted Secured', [Value] = 'Secured to Restricted Secured', [IsAlert] = 0 WHERE [AuditEventId] = 0x0511 ELSE INSERT INTO [AuditEvent] ([AuditEventId], [Key], [Value], [IsAlert]) VALUES (0x0511, 'Secured to Restricted Secured', 'Secured to Restricted Secured', 0)","IF EXISTS(SELECT TOP 1 * FROM [AuditData] WHERE [AuditDataId] = 0 AND [AuditEventId] = 0x0511) UPDATE [AuditData] SET [Key] = '', [Value] = '', [IsAlert] = 0 WHERE [AuditDataId] = 0 AND [AuditEventId] = 0x0511 ELSE INSERT INTO [AuditData] ([AuditDataId], [AuditEventId], [Key], [Value], [IsAlert]) VALUES (0, 0x0511, '', '', 0)"]
[null,"Audit","STATE_CHG_PASS_REST","Passage to Restricted Secured",null,29,0,"0x0512",0,null,null,null,null,"IF EXISTS(SELECT TOP 1 * FROM [AuditEvent] WHERE [AuditEventId] = 0x0512) UPDATE [AuditEvent] SET [Key] = 'Passage to Restricted Secured', [Value] = 'Passage to Restricted Secured', [IsAlert] = 0 WHERE [AuditEventId] = 0x0512 ELSE INSERT INTO [AuditEvent] ([AuditEventId], [Key], [Value], [IsAlert]) VALUES (0x0512, 'Passage to Restricted Secured', 'Passage to Restricted Secured', 0)","IF EXISTS(SELECT TOP 1 * FROM [AuditData] WHERE [AuditDataId] = 0 AND [AuditEventId] = 0x0512) UPDATE [AuditData] SET [Key] = '', [Value] = '', [IsAlert] = 0 WHERE [AuditDataId] = 0 AND [AuditEventId] = 0x0512 ELSE INSERT INTO [AuditData] ([AuditDataId], [AuditEventId], [Key], [Value], [IsAlert]) VALUES (0, 0x0512, '', '', 0)"]
[null,"Audit","FREEZE_PASSAGE","Freeze Passage",null,14,0,"0x0513",0,null,null,null,null,"IF EXISTS(SELECT TOP 1 * FROM [AuditEvent] WHERE [AuditEventId] = 0x0513) UPDATE [AuditEvent] SET [Key] = 'Freeze Passage', [Value] = 'Freeze Passage', [IsAlert] = 0 WHERE [AuditEventId] = 0x0513 ELSE INSERT INTO [AuditEvent] ([AuditEventId], [Key], [Value], [IsAlert]) VALUES (0x0513, 'Freeze Passage', 'Freeze Passage', 0)","IF EXISTS(SELECT TOP 1 * FROM [AuditData] WHERE [AuditDataId] = 0 AND [AuditEventId] = 0x0513) UPDATE [AuditData] SET [Key] = '', [Value] = '', [IsAlert] = 0 WHERE [AuditDataId] = 0 AND [AuditEventId] = 0x0513 ELSE INSERT INTO [AuditData] ([AuditDataId], [AuditEventId], [Key], [Value], [IsAlert]) VALUES (0, 0x0513, '', '', 0)"]
[null,"Audit","FREEZE_SECURED","Freeze Secured",null,14,0,"0x0514",0,null,null,null,null,"IF EXISTS(SELECT TOP 1 * FROM [AuditEvent] WHERE [AuditEventId] = 0x0514) UPDATE [AuditEvent] SET [Key] = 'Freeze Secured', [Value] = 'Freeze Secured', [IsAlert] = 0 WHERE [AuditEventId] = 0x0514 ELSE INSERT INTO [AuditEvent] ([AuditEventId], [Key], [Value], [IsAlert]) VALUES (0x0514, 'Freeze Secured', 'Freeze Secured', 0)","IF EXISTS(SELECT TOP 1 * FROM [AuditData] WHERE [AuditDataId] = 0 AND [AuditEventId] = 0x0514) UPDATE [AuditData] SET [Key] = '', [Value] = '', [IsAlert] = 0 WHERE [AuditDataId] = 0 AND [AuditEventId] = 0x0514 ELSE INSERT INTO [AuditData] ([AuditDataId], [AuditEventId], [Key], [Value], [IsAlert]) VALUES (0, 0x0514, '', '', 0)"]
[null,"Audit","PRIVACY_SECURE_ON","Privacy Mode Initiated",null,{"$f":"LEN(D91)","v":22},{"$f":"LEN(E91)","v":0},"0x0515",0,null,null,null,null,"IF EXISTS(SELECT TOP 1 * FROM [AuditEvent] WHERE [AuditEventId] = 0x0515) UPDATE [AuditEvent] SET [Key] = 'Privacy Mode Initiated', [Value] = 'Privacy Mode Initiated', [IsAlert] = 0 WHERE [AuditEventId] = 0x0515 ELSE INSERT INTO [AuditEvent] ([AuditEventId], [Key], [Value], [IsAlert]) VALUES (0x0515, 'Privacy Mode Initiated', 'Privacy Mode Initiated', 0)","IF EXISTS(SELECT TOP 1 * FROM [AuditData] WHERE [AuditDataId] = 0 AND [AuditEventId] = 0x0515) UPDATE [AuditData] SET [Key] = '', [Value] = '', [IsAlert] = 0 WHERE [AuditDataId] = 0 AND [AuditEventId] = 0x0515 ELSE INSERT INTO [AuditData] ([AuditDataId], [AuditEventId], [Key], [Value], [IsAlert]) VALUES (0, 0x0515, '', '', 0)"]
[null,"Audit","PRIVACY_SECURE_OFF","Privacy Mode Cancelled",null,22,0,"0x0516",0,null,null,null,null,"IF EXISTS(SELECT TOP 1 * FROM [AuditEvent] WHERE [AuditEventId] = 0x0516) UPDATE [AuditEvent] SET [Key] = 'Privacy Mode Cancelled', [Value] = 'Privacy Mode Cancelled', [IsAlert] = 0 WHERE [AuditEventId] = 0x0516 ELSE INSERT INTO [AuditEvent] ([AuditEventId], [Key], [Value], [IsAlert]) VALUES (0x0516, 'Privacy Mode Cancelled', 'Privacy Mode Cancelled', 0)","IF EXISTS(SELECT TOP 1 * FROM [AuditData] WHERE [AuditDataId] = 0 AND [AuditEventId] = 0x0516) UPDATE [AuditData] SET [Key] = '', [Value] = '', [IsAlert] = 0 WHERE [AuditDataId] = 0 AND [AuditEventId] = 0x0516 ELSE INSERT INTO [AuditData] ([AuditDataId], [AuditEventId], [Key], [Value], [IsAlert]) VALUES (0, 0x0516, '', '', 0)"]
[null,"Audit","AUTOUNLOCK_EVENT_OCCURRED","Device Schedule Event",null,21,null,"0x0517",0,null,null,null,null,"IF EXISTS(SELECT TOP 1 * FROM [AuditEvent] WHERE [AuditEventId] = 0x0517) UPDATE [AuditEvent] SET [Key] = 'Device Schedule Event', [Value] = 'Device Schedule Event', [IsAlert] = 0 WHERE [AuditEventId] = 0x0517 ELSE INSERT INTO [AuditEvent] ([AuditEventId], [Key], [Value], [IsAlert]) VALUES (0x0517, 'Device Schedule Event', 'Device Schedule Event', 0)","IF EXISTS(SELECT TOP 1 * FROM [AuditData] WHERE [AuditDataId] = 0 AND [AuditEventId] = 0x0517) UPDATE [AuditData] SET [Key] = '', [Value] = '', [IsAlert] = 0 WHERE [AuditDataId] = 0 AND [AuditEventId] = 0x0517 ELSE INSERT INTO [AuditData] ([AuditDataId], [AuditEventId], [Key], [Value], [IsAlert]) VALUES (0, 0x0517, '', '', 0)"]
[null,"Audit","AUTOUNLOCK_EVENT_OCCURRED","Device Schedule Event","Auto Event - Passage",{"$f":"LEN(D94)","v":21},null,"0x0517",1,null,null,null,null,{"$f":"IF(LEFT(H94,2)=\"0x\",CONCATENATE(\"IF EXISTS(SELECT TOP 1 * FROM [AuditEvent] WHERE [AuditEventId] = \",H94,\") UPDATE [AuditEvent] SET [Key] = '\",TRIM(D94),\"', [Value] = '\",TRIM(D94),\"', [IsAlert] = \",IF(B94=\"Audit\",0,1),\" WHERE [AuditEventId] = \",H94,\" ELSE INSERT INTO [AuditEvent] ([AuditEventId], [Key], [Value], [IsAlert]) VALUES (\",H94,\", '\",TRIM(D94),\"', '\",TRIM(D94),\"', \",IF(B94=\"Audit\",0,1), \")\"),\"-- no value\")","v":"IF EXISTS(SELECT TOP 1 * FROM [AuditEvent] WHERE [AuditEventId] = 0x0517) UPDATE [AuditEvent] SET [Key] = 'Device Schedule Event', [Value] = 'Device Schedule Event', [IsAlert] = 0 WHERE [AuditEventId] = 0x0517 ELSE INSERT INTO [AuditEvent] ([AuditEventId], [Key], [Value], [IsAlert]) VALUES (0x0517, 'Device Schedule Event', 'Device Schedule Event', 0)"},{"$f":"IF(AND(LEFT(H94,2)=\"0x\",ISNUMBER(HEX2DEC(TRIM(I94))*1)),CONCATENATE(\"IF EXISTS(SELECT TOP 1 * FROM [AuditData] WHERE [AuditDataId] = \",HEX2DEC(I94),\" AND [AuditEventId] = \",H94,\") UPDATE [AuditData] SET [Key] = '\",E94,\"', [Value] = '\",E94,\"', [IsAlert] = 0 WHERE [AuditDataId] = \",HEX2DEC(I94),\" AND [AuditEventId] = \",H94,\" ELSE INSERT INTO [AuditData] ([AuditDataId], [AuditEventId], [Key], [Value], [IsAlert]) VALUES (\",HEX2DEC(I94),\", \",H94,\", '\",E94,\"', '\",E94,\"', 0)\"),\"-- no value\")","v":"IF EXISTS(SELECT TOP 1 * FROM [AuditData] WHERE [AuditDataId] = 1 AND [AuditEventId] = 0x0517) UPDATE [AuditData] SET [Key] = 'Auto Event - Passage', [Value] = 'Auto Event - Passage', [IsAlert] = 0 WHERE [AuditDataId] = 1 AND [AuditEventId] = 0x0517 ELSE INSERT INTO [AuditData] ([AuditDataId], [AuditEventId], [Key], [Value], [IsAlert]) VALUES (1, 0x0517, 'Auto Event - Passage', 'Auto Event - Passage', 0)"}]
[null,"Audit","AUTOUNLOCK_EVENT_OCCURRED","Device Schedule Event","Auto Event - Secure",{"$f":"LEN(D95)","v":21},null,"0x0517",2,null,null,null,null,{"$f":"IF(LEFT(H95,2)=\"0x\",CONCATENATE(\"IF EXISTS(SELECT TOP 1 * FROM [AuditEvent] WHERE [AuditEventId] = \",H95,\") UPDATE [AuditEvent] SET [Key] = '\",TRIM(D95),\"', [Value] = '\",TRIM(D95),\"', [IsAlert] = \",IF(B95=\"Audit\",0,1),\" WHERE [AuditEventId] = \",H95,\" ELSE INSERT INTO [AuditEvent] ([AuditEventId], [Key], [Value], [IsAlert]) VALUES (\",H95,\", '\",TRIM(D95),\"', '\",TRIM(D95),\"', \",IF(B95=\"Audit\",0,1), \")\"),\"-- no value\")","v":"IF EXISTS(SELECT TOP 1 * FROM [AuditEvent] WHERE [AuditEventId] = 0x0517) UPDATE [AuditEvent] SET [Key] = 'Device Schedule Event', [Value] = 'Device Schedule Event', [IsAlert] = 0 WHERE [AuditEventId] = 0x0517 ELSE INSERT INTO [AuditEvent] ([AuditEventId], [Key], [Value], [IsAlert]) VALUES (0x0517, 'Device Schedule Event', 'Device Schedule Event', 0)"},{"$f":"IF(AND(LEFT(H95,2)=\"0x\",ISNUMBER(HEX2DEC(TRIM(I95))*1)),CONCATENATE(\"IF EXISTS(SELECT TOP 1 * FROM [AuditData] WHERE [AuditDataId] = \",HEX2DEC(I95),\" AND [AuditEventId] = \",H95,\") UPDATE [AuditData] SET [Key] = '\",E95,\"', [Value] = '\",E95,\"', [IsAlert] = 0 WHERE [AuditDataId] = \",HEX2DEC(I95),\" AND [AuditEventId] = \",H95,\" ELSE INSERT INTO [AuditData] ([AuditDataId], [AuditEventId], [Key], [Value], [IsAlert]) VALUES (\",HEX2DEC(I95),\", \",H95,\", '\",E95,\"', '\",E95,\"', 0)\"),\"-- no value\")","v":"IF EXISTS(SELECT TOP 1 * FROM [AuditData] WHERE [AuditDataId] = 2 AND [AuditEventId] = 0x0517) UPDATE [AuditData] SET [Key] = 'Auto Event - Secure', [Value] = 'Auto Event - Secure', [IsAlert] = 0 WHERE [AuditDataId] = 2 AND [AuditEventId] = 0x0517 ELSE INSERT INTO [AuditData] ([AuditDataId], [AuditEventId], [Key], [Value], [IsAlert]) VALUES (2, 0x0517, 'Auto Event - Secure', 'Auto Event - Secure', 0)"}]
[null,"Audit","AUTOUNLOCK_EVENT_OCCURRED","Device Schedule Event","Auto Event First In - Passage",{"$f":"LEN(D96)","v":21},null,"0x0517",11,null,null,null,null,{"$f":"IF(LEFT(H96,2)=\"0x\",CONCATENATE(\"IF EXISTS(SELECT TOP 1 * FROM [AuditEvent] WHERE [AuditEventId] = \",H96,\") UPDATE [AuditEvent] SET [Key] = '\",TRIM(D96),\"', [Value] = '\",TRIM(D96),\"', [IsAlert] = \",IF(B96=\"Audit\",0,1),\" WHERE [AuditEventId] = \",H96,\" ELSE INSERT INTO [AuditEvent] ([AuditEventId], [Key], [Value], [IsAlert]) VALUES (\",H96,\", '\",TRIM(D96),\"', '\",TRIM(D96),\"', \",IF(B96=\"Audit\",0,1), \")\"),\"-- no value\")","v":"IF EXISTS(SELECT TOP 1 * FROM [AuditEvent] WHERE [AuditEventId] = 0x0517) UPDATE [AuditEvent] SET [Key] = 'Device Schedule Event', [Value] = 'Device Schedule Event', [IsAlert] = 0 WHERE [AuditEventId] = 0x0517 ELSE INSERT INTO [AuditEvent] ([AuditEventId], [Key], [Value], [IsAlert]) VALUES (0x0517, 'Device Schedule Event', 'Device Schedule Event', 0)"},{"$f":"IF(AND(LEFT(H96,2)=\"0x\",ISNUMBER(HEX2DEC(TRIM(I96))*1)),CONCATENATE(\"IF EXISTS(SELECT TOP 1 * FROM [AuditData] WHERE [AuditDataId] = \",HEX2DEC(I96),\" AND [AuditEventId] = \",H96,\") UPDATE [AuditData] SET [Key] = '\",E96,\"', [Value] = '\",E96,\"', [IsAlert] = 0 WHERE [AuditDataId] = \",HEX2DEC(I96),\" AND [AuditEventId] = \",H96,\" ELSE INSERT INTO [AuditData] ([AuditDataId], [AuditEventId], [Key], [Value], [IsAlert]) VALUES (\",HEX2DEC(I96),\", \",H96,\", '\",E96,\"', '\",E96,\"', 0)\"),\"-- no value\")","v":"IF EXISTS(SELECT TOP 1 * FROM [AuditData] WHERE [AuditDataId] = 17 AND [AuditEventId] = 0x0517) UPDATE [AuditData] SET [Key] = 'Auto Event First In - Passage', [Value] = 'Auto Event First In - Passage', [IsAlert] = 0 WHERE [AuditDataId] = 17 AND [AuditEventId] = 0x0517 ELSE INSERT INTO [AuditData] ([AuditDataId], [AuditEventId], [Key], [Value], [IsAlert]) VALUES (17, 0x0517, 'Auto Event First In - Passage', 'Auto Event First In - Passage', 0)"}]
[null,"Audit","AUTOUNLOCK_EVENT_OCCURRED","Device Schedule Event","Auto Event First In - Secure",{"$f":"LEN(D97)","v":21},null,"0x0517",12,null,null,null,null,{"$f":"IF(LEFT(H97,2)=\"0x\",CONCATENATE(\"IF EXISTS(SELECT TOP 1 * FROM [AuditEvent] WHERE [AuditEventId] = \",H97,\") UPDATE [AuditEvent] SET [Key] = '\",TRIM(D97),\"', [Value] = '\",TRIM(D97),\"', [IsAlert] = \",IF(B97=\"Audit\",0,1),\" WHERE [AuditEventId] = \",H97,\" ELSE INSERT INTO [AuditEvent] ([AuditEventId], [Key], [Value], [IsAlert]) VALUES (\",H97,\", '\",TRIM(D97),\"', '\",TRIM(D97),\"', \",IF(B97=\"Audit\",0,1), \")\"),\"-- no value\")","v":"IF EXISTS(SELECT TOP 1 * FROM [AuditEvent] WHERE [AuditEventId] = 0x0517) UPDATE [AuditEvent] SET [Key] = 'Device Schedule Event', [Value] = 'Device Schedule Event', [IsAlert] = 0 WHERE [AuditEventId] = 0x0517 ELSE INSERT INTO [AuditEvent] ([AuditEventId], [Key], [Value], [IsAlert]) VALUES (0x0517, 'Device Schedule Event', 'Device Schedule Event', 0)"},{"$f":"IF(AND(LEFT(H97,2)=\"0x\",ISNUMBER(HEX2DEC(TRIM(I97))*1)),CONCATENATE(\"IF EXISTS(SELECT TOP 1 * FROM [AuditData] WHERE [AuditDataId] = \",HEX2DEC(I97),\" AND [AuditEventId] = \",H97,\") UPDATE [AuditData] SET [Key] = '\",E97,\"', [Value] = '\",E97,\"', [IsAlert] = 0 WHERE [AuditDataId] = \",HEX2DEC(I97),\" AND [AuditEventId] = \",H97,\" ELSE INSERT INTO [AuditData] ([AuditDataId], [AuditEventId], [Key], [Value], [IsAlert]) VALUES (\",HEX2DEC(I97),\", \",H97,\", '\",E97,\"', '\",E97,\"', 0)\"),\"-- no value\")","v":"IF EXISTS(SELECT TOP 1 * FROM [AuditData] WHERE [AuditDataId] = 18 AND [AuditEventId] = 0x0517) UPDATE [AuditData] SET [Key] = 'Auto Event First In - Secure', [Value] = 'Auto Event First In - Secure', [IsAlert] = 0 WHERE [AuditDataId] = 18 AND [AuditEventId] = 0x0517 ELSE INSERT INTO [AuditData] ([AuditDataId], [AuditEventId], [Key], [Value], [IsAlert]) VALUES (18, 0x0517, 'Auto Event First In - Secure', 'Auto Event First In - Secure', 0)"}]
[null,"Audit","HOLIDAY_EVENT_OCCURRED","Holiday Schedule Event",null,null,null,"0x0518",0,null,null,null,null,"IF EXISTS(SELECT TOP 1 * FROM [AuditEvent] WHERE [AuditEventId] = 0x0518) UPDATE [AuditEvent] SET [Key] = 'Holiday Schedule Event', [Value] = 'Holiday Schedule Event', [IsAlert] = 0 WHERE [AuditEventId] = 0x0518 ELSE INSERT INTO [AuditEvent] ([AuditEventId], [Key], [Value], [IsAlert]) VALUES (0x0518, 'Holiday Schedule Event', 'Holiday Schedule Event', 0)","IF EXISTS(SELECT TOP 1 * FROM [AuditData] WHERE [AuditDataId] = 0 AND [AuditEventId] = 0x0518) UPDATE [AuditData] SET [Key] = '', [Value] = '', [IsAlert] = 0 WHERE [AuditDataId] = 0 AND [AuditEventId] = 0x0518 ELSE INSERT INTO [AuditData] ([AuditDataId], [AuditEventId], [Key], [Value], [IsAlert]) VALUES (0, 0x0518, '', '', 0)"]
[null,"Audit","HOLIDAY_EVENT_OCCURRED","Holiday Schedule Event","Passage Start",null,null,"0x0518",1,null,null,null,null,{"$f":"IF(LEFT(H99,2)=\"0x\",CONCATENATE(\"IF EXISTS(SELECT TOP 1 * FROM [AuditEvent] WHERE [AuditEventId] = \",H99,\") UPDATE [AuditEvent] SET [Key] = '\",TRIM(D99),\"', [Value] = '\",TRIM(D99),\"', [IsAlert] = \",IF(B99=\"Audit\",0,1),\" WHERE [AuditEventId] = \",H99,\" ELSE INSERT INTO [AuditEvent] ([AuditEventId], [Key], [Value], [IsAlert]) VALUES (\",H99,\", '\",TRIM(D99),\"', '\",TRIM(D99),\"', \",IF(B99=\"Audit\",0,1), \")\"),\"-- no value\")","v":"IF EXISTS(SELECT TOP 1 * FROM [AuditEvent] WHERE [AuditEventId] = 0x0518) UPDATE [AuditEvent] SET [Key] = 'Holiday Schedule Event', [Value] = 'Holiday Schedule Event', [IsAlert] = 0 WHERE [AuditEventId] = 0x0518 ELSE INSERT INTO [AuditEvent] ([AuditEventId], [Key], [Value], [IsAlert]) VALUES (0x0518, 'Holiday Schedule Event', 'Holiday Schedule Event', 0)"},{"$f":"IF(AND(LEFT(H99,2)=\"0x\",ISNUMBER(HEX2DEC(TRIM(I99))*1)),CONCATENATE(\"IF EXISTS(SELECT TOP 1 * FROM [AuditData] WHERE [AuditDataId] = \",HEX2DEC(I99),\" AND [AuditEventId] = \",H99,\") UPDATE [AuditData] SET [Key] = '\",E99,\"', [Value] = '\",E99,\"', [IsAlert] = 0 WHERE [AuditDataId] = \",HEX2DEC(I99),\" AND [AuditEventId] = \",H99,\" ELSE INSERT INTO [AuditData] ([AuditDataId], [AuditEventId], [Key], [Value], [IsAlert]) VALUES (\",HEX2DEC(I99),\", \",H99,\", '\",E99,\"', '\",E99,\"', 0)\"),\"-- no value\")","v":"IF EXISTS(SELECT TOP 1 * FROM [AuditData] WHERE [AuditDataId] = 1 AND [AuditEventId] = 0x0518) UPDATE [AuditData] SET [Key] = 'Passage Start', [Value] = 'Passage Start', [IsAlert] = 0 WHERE [AuditDataId] = 1 AND [AuditEventId] = 0x0518 ELSE INSERT INTO [AuditData] ([AuditDataId], [AuditEventId], [Key], [Value], [IsAlert]) VALUES (1, 0x0518, 'Passage Start', 'Passage Start', 0)"}]
[null,"Audit","HOLIDAY_EVENT_OCCURRED","Holiday Schedule Event","Passage End",null,null,"0x0518",2,null,null,null,null,{"$f":"IF(LEFT(H100,2)=\"0x\",CONCATENATE(\"IF EXISTS(SELECT TOP 1 * FROM [AuditEvent] WHERE [AuditEventId] = \",H100,\") UPDATE [AuditEvent] SET [Key] = '\",TRIM(D100),\"', [Value] = '\",TRIM(D100),\"', [IsAlert] = \",IF(B100=\"Audit\",0,1),\" WHERE [AuditEventId] = \",H100,\" ELSE INSERT INTO [AuditEvent] ([AuditEventId], [Key], [Value], [IsAlert]) VALUES (\",H100,\", '\",TRIM(D100),\"', '\",TRIM(D100),\"', \",IF(B100=\"Audit\",0,1), \")\"),\"-- no value\")","v":"IF EXISTS(SELECT TOP 1 * FROM [AuditEvent] WHERE [AuditEventId] = 0x0518) UPDATE [AuditEvent] SET [Key] = 'Holiday Schedule Event', [Value] = 'Holiday Schedule Event', [IsAlert] = 0 WHERE [AuditEventId] = 0x0518 ELSE INSERT INTO [AuditEvent] ([AuditEventId], [Key], [Value], [IsAlert]) VALUES (0x0518, 'Holiday Schedule Event', 'Holiday Schedule Event', 0)"},{"$f":"IF(AND(LEFT(H100,2)=\"0x\",ISNUMBER(HEX2DEC(TRIM(I100))*1)),CONCATENATE(\"IF EXISTS(SELECT TOP 1 * FROM [AuditData] WHERE [AuditDataId] = \",HEX2DEC(I100),\" AND [AuditEventId] = \",H100,\") UPDATE [AuditData] SET [Key] = '\",E100,\"', [Value] = '\",E100,\"', [IsAlert] = 0 WHERE [AuditDataId] = \",HEX2DEC(I100),\" AND [AuditEventId] = \",H100,\" ELSE INSERT INTO [AuditData] ([AuditDataId], [AuditEventId], [Key], [Value], [IsAlert]) VALUES (\",HEX2DEC(I100),\", \",H100,\", '\",E100,\"', '\",E100,\"', 0)\"),\"-- no value\")","v":"IF EXISTS(SELECT TOP 1 * FROM [AuditData] WHERE [AuditDataId] = 2 AND [AuditEventId] = 0x0518) UPDATE [AuditData] SET [Key] = 'Passage End', [Value] = 'Passage End', [IsAlert] = 0 WHERE [AuditDataId] = 2 AND [AuditEventId] = 0x0518 ELSE INSERT INTO [AuditData] ([AuditDataId], [AuditEventId], [Key], [Value], [IsAlert]) VALUES (2, 0x0518, 'Passage End', 'Passage End', 0)"}]
[null,"Audit","HOLIDAY_EVENT_OCCURRED","Holiday Schedule Event","Secure Start",null,null,"0x0518",11,null,null,null,null,{"$f":"IF(LEFT(H101,2)=\"0x\",CONCATENATE(\"IF EXISTS(SELECT TOP 1 * FROM [AuditEvent] WHERE [AuditEventId] = \",H101,\") UPDATE [AuditEvent] SET [Key] = '\",TRIM(D101),\"', [Value] = '\",TRIM(D101),\"', [IsAlert] = \",IF(B101=\"Audit\",0,1),\" WHERE [AuditEventId] = \",H101,\" ELSE INSERT INTO [AuditEvent] ([AuditEventId], [Key], [Value], [IsAlert]) VALUES (\",H101,\", '\",TRIM(D101),\"', '\",TRIM(D101),\"', \",IF(B101=\"Audit\",0,1), \")\"),\"-- no value\")","v":"IF EXISTS(SELECT TOP 1 * FROM [AuditEvent] WHERE [AuditEventId] = 0x0518) UPDATE [AuditEvent] SET [Key] = 'Holiday Schedule Event', [Value] = 'Holiday Schedule Event', [IsAlert] = 0 WHERE [AuditEventId] = 0x0518 ELSE INSERT INTO [AuditEvent] ([AuditEventId], [Key], [Value], [IsAlert]) VALUES (0x0518, 'Holiday Schedule Event', 'Holiday Schedule Event', 0)"},{"$f":"IF(AND(LEFT(H101,2)=\"0x\",ISNUMBER(HEX2DEC(TRIM(I101))*1)),CONCATENATE(\"IF EXISTS(SELECT TOP 1 * FROM [AuditData] WHERE [AuditDataId] = \",HEX2DEC(I101),\" AND [AuditEventId] = \",H101,\") UPDATE [AuditData] SET [Key] = '\",E101,\"', [Value] = '\",E101,\"', [IsAlert] = 0 WHERE [AuditDataId] = \",HEX2DEC(I101),\" AND [AuditEventId] = \",H101,\" ELSE INSERT INTO [AuditData] ([AuditDataId], [AuditEventId], [Key], [Value], [IsAlert]) VALUES (\",HEX2DEC(I101),\", \",H101,\", '\",E101,\"', '\",E101,\"', 0)\"),\"-- no value\")","v":"IF EXISTS(SELECT TOP 1 * FROM [AuditData] WHERE [AuditDataId] = 17 AND [AuditEventId] = 0x0518) UPDATE [AuditData] SET [Key] = 'Secure Start', [Value] = 'Secure Start', [IsAlert] = 0 WHERE [AuditDataId] = 17 AND [AuditEventId] = 0x0518 ELSE INSERT INTO [AuditData] ([AuditDataId], [AuditEventId], [Key], [Value], [IsAlert]) VALUES (17, 0x0518, 'Secure Start', 'Secure Start', 0)"}]
[null,"Audit","HOLIDAY_EVENT_OCCURRED","Holiday Schedule Event","Secure End",null,null,"0x0518",12,null,null,null,null,{"$f":"IF(LEFT(H102,2)=\"0x\",CONCATENATE(\"IF EXISTS(SELECT TOP 1 * FROM [AuditEvent] WHERE [AuditEventId] = \",H102,\") UPDATE [AuditEvent] SET [Key] = '\",TRIM(D102),\"', [Value] = '\",TRIM(D102),\"', [IsAlert] = \",IF(B102=\"Audit\",0,1),\" WHERE [AuditEventId] = \",H102,\" ELSE INSERT INTO [AuditEvent] ([AuditEventId], [Key], [Value], [IsAlert]) VALUES (\",H102,\", '\",TRIM(D102),\"', '\",TRIM(D102),\"', \",IF(B102=\"Audit\",0,1), \")\"),\"-- no value\")","v":"IF EXISTS(SELECT TOP 1 * FROM [AuditEvent] WHERE [AuditEventId] = 0x0518) UPDATE [AuditEvent] SET [Key] = 'Holiday Schedule Event', [Value] = 'Holiday Schedule Event', [IsAlert] = 0 WHERE [AuditEventId] = 0x0518 ELSE INSERT INTO [AuditEvent] ([AuditEventId], [Key], [Value], [IsAlert]) VALUES (0x0518, 'Holiday Schedule Event', 'Holiday Schedule Event', 0)"},{"$f":"IF(AND(LEFT(H102,2)=\"0x\",ISNUMBER(HEX2DEC(TRIM(I102))*1)),CONCATENATE(\"IF EXISTS(SELECT TOP 1 * FROM [AuditData] WHERE [AuditDataId] = \",HEX2DEC(I102),\" AND [AuditEventId] = \",H102,\") UPDATE [AuditData] SET [Key] = '\",E102,\"', [Value] = '\",E102,\"', [IsAlert] = 0 WHERE [AuditDataId] = \",HEX2DEC(I102),\" AND [AuditEventId] = \",H102,\" ELSE INSERT INTO [AuditData] ([AuditDataId], [AuditEventId], [Key], [Value], [IsAlert]) VALUES (\",HEX2DEC(I102),\", \",H102,\", '\",E102,\"', '\",E102,\"', 0)\"),\"-- no value\")","v":"IF EXISTS(SELECT TOP 1 * FROM [AuditData] WHERE [AuditDataId] = 18 AND [AuditEventId] = 0x0518) UPDATE [AuditData] SET [Key] = 'Secure End', [Value] = 'Secure End', [IsAlert] = 0 WHERE [AuditDataId] = 18 AND [AuditEventId] = 0x0518 ELSE INSERT INTO [AuditData] ([AuditDataId], [AuditEventId], [Key], [Value], [IsAlert]) VALUES (18, 0x0518, 'Secure End', 'Secure End', 0)"}]
[null,"Audit","HOLIDAY_EVENT_OCCURRED","Holiday Schedule Event","Restricted Secure Start",null,null,"0x0518",21,null,null,null,null,{"$f":"IF(LEFT(H103,2)=\"0x\",CONCATENATE(\"IF EXISTS(SELECT TOP 1 * FROM [AuditEvent] WHERE [AuditEventId] = \",H103,\") UPDATE [AuditEvent] SET [Key] = '\",TRIM(D103),\"', [Value] = '\",TRIM(D103),\"', [IsAlert] = \",IF(B103=\"Audit\",0,1),\" WHERE [AuditEventId] = \",H103,\" ELSE INSERT INTO [AuditEvent] ([AuditEventId], [Key], [Value], [IsAlert]) VALUES (\",H103,\", '\",TRIM(D103),\"', '\",TRIM(D103),\"', \",IF(B103=\"Audit\",0,1), \")\"),\"-- no value\")","v":"IF EXISTS(SELECT TOP 1 * FROM [AuditEvent] WHERE [AuditEventId] = 0x0518) UPDATE [AuditEvent] SET [Key] = 'Holiday Schedule Event', [Value] = 'Holiday Schedule Event', [IsAlert] = 0 WHERE [AuditEventId] = 0x0518 ELSE INSERT INTO [AuditEvent] ([AuditEventId], [Key], [Value], [IsAlert]) VALUES (0x0518, 'Holiday Schedule Event', 'Holiday Schedule Event', 0)"},{"$f":"IF(AND(LEFT(H103,2)=\"0x\",ISNUMBER(HEX2DEC(TRIM(I103))*1)),CONCATENATE(\"IF EXISTS(SELECT TOP 1 * FROM [AuditData] WHERE [AuditDataId] = \",HEX2DEC(I103),\" AND [AuditEventId] = \",H103,\") UPDATE [AuditData] SET [Key] = '\",E103,\"', [Value] = '\",E103,\"', [IsAlert] = 0 WHERE [AuditDataId] = \",HEX2DEC(I103),\" AND [AuditEventId] = \",H103,\" ELSE INSERT INTO [AuditData] ([AuditDataId], [AuditEventId], [Key], [Value], [IsAlert]) VALUES (\",HEX2DEC(I103),\", \",H103,\", '\",E103,\"', '\",E103,\"', 0)\"),\"-- no value\")","v":"IF EXISTS(SELECT TOP 1 * FROM [AuditData] WHERE [AuditDataId] = 33 AND [AuditEventId] = 0x0518) UPDATE [AuditData] SET [Key] = 'Restricted Secure Start', [Value] = 'Restricted Secure Start', [IsAlert] = 0 WHERE [AuditDataId] = 33 AND [AuditEventId] = 0x0518 ELSE INSERT INTO [AuditData] ([AuditDataId], [AuditEventId], [Key], [Value], [IsAlert]) VALUES (33, 0x0518, 'Restricted Secure Start', 'Restricted Secure Start', 0)"}]
[null,"Audit","HOLIDAY_EVENT_OCCURRED","Holiday Schedule Event","Restricted Secure End",null,null,"0x0518",22,null,null,null,null,{"$f":"IF(LEFT(H104,2)=\"0x\",CONCATENATE(\"IF EXISTS(SELECT TOP 1 * FROM [AuditEvent] WHERE [AuditEventId] = \",H104,\") UPDATE [AuditEvent] SET [Key] = '\",TRIM(D104),\"', [Value] = '\",TRIM(D104),\"', [IsAlert] = \",IF(B104=\"Audit\",0,1),\" WHERE [AuditEventId] = \",H104,\" ELSE INSERT INTO [AuditEvent] ([AuditEventId], [Key], [Value], [IsAlert]) VALUES (\",H104,\", '\",TRIM(D104),\"', '\",TRIM(D104),\"', \",IF(B104=\"Audit\",0,1), \")\"),\"-- no value\")","v":"IF EXISTS(SELECT TOP 1 * FROM [AuditEvent] WHERE [AuditEventId] = 0x0518) UPDATE [AuditEvent] SET [Key] = 'Holiday Schedule Event', [Value] = 'Holiday Schedule Event', [IsAlert] = 0 WHERE [AuditEventId] = 0x0518 ELSE INSERT INTO [AuditEvent] ([AuditEventId], [Key], [Value], [IsAlert]) VALUES (0x0518, 'Holiday Schedule Event', 'Holiday Schedule Event', 0)"},{"$f":"IF(AND(LEFT(H104,2)=\"0x\",ISNUMBER(HEX2DEC(TRIM(I104))*1)),CONCATENATE(\"IF EXISTS(SELECT TOP 1 * FROM [AuditData] WHERE [AuditDataId] = \",HEX2DEC(I104),\" AND [AuditEventId] = \",H104,\") UPDATE [AuditData] SET [Key] = '\",E104,\"', [Value] = '\",E104,\"', [IsAlert] = 0 WHERE [AuditDataId] = \",HEX2DEC(I104),\" AND [AuditEventId] = \",H104,\" ELSE INSERT INTO [AuditData] ([AuditDataId], [AuditEventId], [Key], [Value], [IsAlert]) VALUES (\",HEX2DEC(I104),\", \",H104,\", '\",E104,\"', '\",E104,\"', 0)\"),\"-- no value\")","v":"IF EXISTS(SELECT TOP 1 * FROM [AuditData] WHERE [AuditDataId] = 34 AND [AuditEventId] = 0x0518) UPDATE [AuditData] SET [Key] = 'Restricted Secure End', [Value] = 'Restricted Secure End', [IsAlert] = 0 WHERE [AuditDataId] = 34 AND [AuditEventId] = 0x0518 ELSE INSERT INTO [AuditData] ([AuditDataId], [AuditEventId], [Key], [Value], [IsAlert]) VALUES (34, 0x0518, 'Restricted Secure End', 'Restricted Secure End', 0)"}]
[null,"Audit","DOG_ON_NEXT_EXIT","Dog On Next Exit",null,null,null,"0x0519",0,null,null,null,null,"IF EXISTS(SELECT TOP 1 * FROM [AuditEvent] WHERE [AuditEventId] = 0x0519) UPDATE [AuditEvent] SET [Key] = 'Dog On Next Exit', [Value] = 'Dog On Next Exit', [IsAlert] = 0 WHERE [AuditEventId] = 0x0519 ELSE INSERT INTO [AuditEvent] ([AuditEventId], [Key], [Value], [IsAlert]) VALUES (0x0519, 'Dog On Next Exit', 'Dog On Next Exit', 0)","IF EXISTS(SELECT TOP 1 * FROM [AuditData] WHERE [AuditDataId] = 0 AND [AuditEventId] = 0x0519) UPDATE [AuditData] SET [Key] = '', [Value] = '', [IsAlert] = 0 WHERE [AuditDataId] = 0 AND [AuditEventId] = 0x0519 ELSE INSERT INTO [AuditData] ([AuditDataId], [AuditEventId], [Key], [Value], [IsAlert]) VALUES (0, 0x0519, '', '', 0)"]
[null,"Audit","FREEZE_DOG_ON_NEXT_EXIT","Freeze Dog On Next Exit",null,null,null,"0x051A",0,null,null,null,null,"IF EXISTS(SELECT TOP 1 * FROM [AuditEvent] WHERE [AuditEventId] = 0x051A) UPDATE [AuditEvent] SET [Key] = 'Freeze Dog On Next Exit', [Value] = 'Freeze Dog On Next Exit', [IsAlert] = 0 WHERE [AuditEventId] = 0x051A ELSE INSERT INTO [AuditEvent] ([AuditEventId], [Key], [Value], [IsAlert]) VALUES (0x051A, 'Freeze Dog On Next Exit', 'Freeze Dog On Next Exit', 0)","IF EXISTS(SELECT TOP 1 * FROM [AuditData] WHERE [AuditDataId] = 0 AND [AuditEventId] = 0x051A) UPDATE [AuditData] SET [Key] = '', [Value] = '', [IsAlert] = 0 WHERE [AuditDataId] = 0 AND [AuditEventId] = 0x051A ELSE INSERT INTO [AuditData] ([AuditDataId], [AuditEventId], [Key], [Value], [IsAlert]) VALUES (0, 0x051A, '', '', 0)"]
[null,"Audit","DOUBLE_TAP_PASSAGE","Double Tap Passage",null,null,null,"0x051B",0,null,null,null,null,{"$f":"IF(LEFT(H107,2)=\"0x\",CONCATENATE(\"IF EXISTS(SELECT TOP 1 * FROM [AuditEvent] WHERE [AuditEventId] = \",H107,\") UPDATE [AuditEvent] SET [Key] = '\",TRIM(D107),\"', [Value] = '\",TRIM(D107),\"', [IsAlert] = \",IF(B107=\"Audit\",0,1),\" WHERE [AuditEventId] = \",H107,\" ELSE INSERT INTO [AuditEvent] ([AuditEventId], [Key], [Value], [IsAlert]) VALUES (\",H107,\", '\",TRIM(D107),\"', '\",TRIM(D107),\"', \",IF(B107=\"Audit\",0,1), \")\"),\"-- no value\")","v":"IF EXISTS(SELECT TOP 1 * FROM [AuditEvent] WHERE [AuditEventId] = 0x051B) UPDATE [AuditEvent] SET [Key] = 'Double Tap Passage', [Value] = 'Double Tap Passage', [IsAlert] = 0 WHERE [AuditEventId] = 0x051B ELSE INSERT INTO [AuditEvent] ([AuditEventId], [Key], [Value], [IsAlert]) VALUES (0x051B, 'Double Tap Passage', 'Double Tap Passage', 0)"},{"$f":"IF(AND(LEFT(H107,2)=\"0x\",ISNUMBER(HEX2DEC(TRIM(I107))*1)),CONCATENATE(\"IF EXISTS(SELECT TOP 1 * FROM [AuditData] WHERE [AuditDataId] = \",HEX2DEC(I107),\" AND [AuditEventId] = \",H107,\") UPDATE [AuditData] SET [Key] = '\",E107,\"', [Value] = '\",E107,\"', [IsAlert] = 0 WHERE [AuditDataId] = \",HEX2DEC(I107),\" AND [AuditEventId] = \",H107,\" ELSE INSERT INTO [AuditData] ([AuditDataId], [AuditEventId], [Key], [Value], [IsAlert]) VALUES (\",HEX2DEC(I107),\", \",H107,\", '\",E107,\"', '\",E107,\"', 0)\"),\"-- no value\")","v":"IF EXISTS(SELECT TOP 1 * FROM [AuditData] WHERE [AuditDataId] = 0 AND [AuditEventId] = 0x051B) UPDATE [AuditData] SET [Key] = '', [Value] = '', [IsAlert] = 0 WHERE [AuditDataId] = 0 AND [AuditEventId] = 0x051B ELSE INSERT INTO [AuditData] ([AuditDataId], [AuditEventId], [Key], [Value], [IsAlert]) VALUES (0, 0x051B, '', '', 0)"}]
[null,"Audit","DOUBLE_TAP_SECURED","Double Tap Secured",null,null,null,"0x051C",0,null,null,null,null,"IF EXISTS(SELECT TOP 1 * FROM [AuditEvent] WHERE [AuditEventId] = 0x051C) UPDATE [AuditEvent] SET [Key] = 'Double Tap Secured', [Value] = 'Double Tap Secured', [IsAlert] = 0 WHERE [AuditEventId] = 0x051C ELSE INSERT INTO [AuditEvent] ([AuditEventId], [Key], [Value], [IsAlert]) VALUES (0x051C, 'Double Tap Secured', 'Double Tap Secured', 0)","IF EXISTS(SELECT TOP 1 * FROM [AuditData] WHERE [AuditDataId] = 0 AND [AuditEventId] = 0x051C) UPDATE [AuditData] SET [Key] = '', [Value] = '', [IsAlert] = 0 WHERE [AuditDataId] = 0 AND [AuditEventId] = 0x051C ELSE INSERT INTO [AuditData] ([AuditDataId], [AuditEventId], [Key], [Value], [IsAlert]) VALUES (0, 0x051C, '', '', 0)"]
[null,"Audit","ACCESS_DENIED","Access Denied",null,13,0,"0x0540",0,null,null,null,null,"IF EXISTS(SELECT TOP 1 * FROM [AuditEvent] WHERE [AuditEventId] = 0x0540) UPDATE [AuditEvent] SET [Key] = 'Access Denied', [Value] = 'Access Denied', [IsAlert] = 0 WHERE [AuditEventId] = 0x0540 ELSE INSERT INTO [AuditEvent] ([AuditEventId], [Key], [Value], [IsAlert]) VALUES (0x0540, 'Access Denied', 'Access Denied', 0)","IF EXISTS(SELECT TOP 1 * FROM [AuditData] WHERE [AuditDataId] = 0 AND [AuditEventId] = 0x0540) UPDATE [AuditData] SET [Key] = '', [Value] = '', [IsAlert] = 0 WHERE [AuditDataId] = 0 AND [AuditEventId] = 0x0540 ELSE INSERT INTO [AuditData] ([AuditDataId], [AuditEventId], [Key], [Value], [IsAlert]) VALUES (0, 0x0540, '', '', 0)"]
[null,"Audit","ACCESS_BLOCKED","Access Blocked",null,14,0,"0x0541",0,null,null,null,null,"IF EXISTS(SELECT TOP 1 * FROM [AuditEvent] WHERE [AuditEventId] = 0x0541) UPDATE [AuditEvent] SET [Key] = 'Access Blocked', [Value] = 'Access Blocked', [IsAlert] = 0 WHERE [AuditEventId] = 0x0541 ELSE INSERT INTO [AuditEvent] ([AuditEventId], [Key], [Value], [IsAlert]) VALUES (0x0541, 'Access Blocked', 'Access Blocked', 0)","IF EXISTS(SELECT TOP 1 * FROM [AuditData] WHERE [AuditDataId] = 0 AND [AuditEventId] = 0x0541) UPDATE [AuditData] SET [Key] = '', [Value] = '', [IsAlert] = 0 WHERE [AuditDataId] = 0 AND [AuditEventId] = 0x0541 ELSE INSERT INTO [AuditData] ([AuditDataId], [AuditEventId], [Key], [Value], [IsAlert]) VALUES (0, 0x0541, '', '', 0)"]
[null,"Audit","REMOTE_AUTHORIZATION","Remote Authorization",null,20,0,"0x0542",0,null,null,null,null,"IF EXISTS(SELECT TOP 1 * FROM [AuditEvent] WHERE [AuditEventId] = 0x0542) UPDATE [AuditEvent] SET [Key] = 'Remote Authorization', [Value] = 'Remote Authorization', [IsAlert] = 0 WHERE [AuditEventId] = 0x0542 ELSE INSERT INTO [AuditEvent] ([AuditEventId], [Key], [Value], [IsAlert]) VALUES (0x0542, 'Remote Authorization', 'Remote Authorization', 0)","IF EXISTS(SELECT TOP 1 * FROM [AuditData] WHERE [AuditDataId] = 0 AND [AuditEventId] = 0x0542) UPDATE [AuditData] SET [Key] = '', [Value] = '', [IsAlert] = 0 WHERE [AuditDataId] = 0 AND [AuditEventId] = 0x0542 ELSE INSERT INTO [AuditData] ([AuditDataId], [AuditEventId], [Key], [Value], [IsAlert]) VALUES (0, 0x0542, '', '', 0)"]
[null,"Audit","REMOTE_LOCKDOWN","Remote Lockdown",null,null,null,"0x0543",0,null,null,null,null,"IF EXISTS(SELECT TOP 1 * FROM [AuditEvent] WHERE [AuditEventId] = 0x0543) UPDATE [AuditEvent] SET [Key] = 'Remote Lockdown', [Value] = 'Remote Lockdown', [IsAlert] = 0 WHERE [AuditEventId] = 0x0543 ELSE INSERT INTO [AuditEvent] ([AuditEventId], [Key], [Value], [IsAlert]) VALUES (0x0543, 'Remote Lockdown', 'Remote Lockdown', 0)","IF EXISTS(SELECT TOP 1 * FROM [AuditData] WHERE [AuditDataId] = 0 AND [AuditEventId] = 0x0543) UPDATE [AuditData] SET [Key] = '', [Value] = '', [IsAlert] = 0 WHERE [AuditDataId] = 0 AND [AuditEventId] = 0x0543 ELSE INSERT INTO [AuditData] ([AuditDataId], [AuditEventId], [Key], [Value], [IsAlert]) VALUES (0, 0x0543, '', '', 0)"]
[null,"Audit","REMOTE_LOCKDOWN_CLEAR","Remote Lockdown Clear",null,null,null,"0x0544",0,null,null,null,null,"IF EXISTS(SELECT TOP 1 * FROM [AuditEvent] WHERE [AuditEventId] = 0x0544) UPDATE [AuditEvent] SET [Key] = 'Remote Lockdown Clear', [Value] = 'Remote Lockdown Clear', [IsAlert] = 0 WHERE [AuditEventId] = 0x0544 ELSE INSERT INTO [AuditEvent] ([AuditEventId], [Key], [Value], [IsAlert]) VALUES (0x0544, 'Remote Lockdown Clear', 'Remote Lockdown Clear', 0)","IF EXISTS(SELECT TOP 1 * FROM [AuditData] WHERE [AuditDataId] = 0 AND [AuditEventId] = 0x0544) UPDATE [AuditData] SET [Key] = '', [Value] = '', [IsAlert] = 0 WHERE [AuditDataId] = 0 AND [AuditEventId] = 0x0544 ELSE INSERT INTO [AuditData] ([AuditDataId], [AuditEventId], [Key], [Value], [IsAlert]) VALUES (0, 0x0544, '', '', 0)"]
[null,"Audit","CREDENTIAL_ACCESS_DISABLED","Credential Access Temporarily disabled",null,null,null,"0x0545",0,null,null,null,null,"IF EXISTS(SELECT TOP 1 * FROM [AuditEvent] WHERE [AuditEventId] = 0x0545) UPDATE [AuditEvent] SET [Key] = 'Credential Access Temporarily disabled', [Value] = 'Credential Access Temporarily disabled', [IsAlert] = 0 WHERE [AuditEventId] = 0x0545 ELSE INSERT INTO [AuditEvent] ([AuditEventId], [Key], [Value], [IsAlert]) VALUES (0x0545, 'Credential Access Temporarily disabled', 'Credential Access Temporarily disabled', 0)",{"$f":"IF(AND(LEFT(H114,2)=\"0x\",ISNUMBER(HEX2DEC(TRIM(I114))*1)),CONCATENATE(\"IF EXISTS(SELECT TOP 1 * FROM [AuditData] WHERE [AuditDataId] = \",HEX2DEC(I114),\" AND [AuditEventId] = \",H114,\") UPDATE [AuditData] SET [Key] = '\",E114,\"', [Value] = '\",E114,\"', [IsAlert] = 0 WHERE [AuditDataId] = \",HEX2DEC(I114),\" AND [AuditEventId] = \",H114,\" ELSE INSERT INTO [AuditData] ([AuditDataId], [AuditEventId], [Key], [Value], [IsAlert]) VALUES (\",HEX2DEC(I114),\", \",H114,\", '\",E114,\"', '\",E114,\"', 0)\"),\"-- no value\")","v":"IF EXISTS(SELECT TOP 1 * FROM [AuditData] WHERE [AuditDataId] = 0 AND [AuditEventId] = 0x0545) UPDATE [AuditData] SET [Key] = '', [Value] = '', [IsAlert] = 0 WHERE [AuditDataId] = 0 AND [AuditEventId] = 0x0545 ELSE INSERT INTO [AuditData] ([AuditDataId], [AuditEventId], [Key], [Value], [IsAlert]) VALUES (0, 0x0545, '', '', 0)"}]
[null,"Audit","CREDENTIAL_ACCESS_ENABLED","Credential Access enabled",null,null,null,"0x0546",0,null,null,null,null,"IF EXISTS(SELECT TOP 1 * FROM [AuditEvent] WHERE [AuditEventId] = 0x0546) UPDATE [AuditEvent] SET [Key] = 'Credential Access enabled', [Value] = 'Credential Access enabled', [IsAlert] = 0 WHERE [AuditEventId] = 0x0546 ELSE INSERT INTO [AuditEvent] ([AuditEventId], [Key], [Value], [IsAlert]) VALUES (0x0546, 'Credential Access enabled', 'Credential Access enabled', 0)",{"$f":"IF(AND(LEFT(H115,2)=\"0x\",ISNUMBER(HEX2DEC(TRIM(I115))*1)),CONCATENATE(\"IF EXISTS(SELECT TOP 1 * FROM [AuditData] WHERE [AuditDataId] = \",HEX2DEC(I115),\" AND [AuditEventId] = \",H115,\") UPDATE [AuditData] SET [Key] = '\",E115,\"', [Value] = '\",E115,\"', [IsAlert] = 0 WHERE [AuditDataId] = \",HEX2DEC(I115),\" AND [AuditEventId] = \",H115,\" ELSE INSERT INTO [AuditData] ([AuditDataId], [AuditEventId], [Key], [Value], [IsAlert]) VALUES (\",HEX2DEC(I115),\", \",H115,\", '\",E115,\"', '\",E115,\"', 0)\"),\"-- no value\")","v":"IF EXISTS(SELECT TOP 1 * FROM [AuditData] WHERE [AuditDataId] = 0 AND [AuditEventId] = 0x0546) UPDATE [AuditData] SET [Key] = '', [Value] = '', [IsAlert] = 0 WHERE [AuditDataId] = 0 AND [AuditEventId] = 0x0546 ELSE INSERT INTO [AuditData] ([AuditDataId], [AuditEventId], [Key], [Value], [IsAlert]) VALUES (0, 0x0546, '', '', 0)"}]
[null,"Audit","TWO_FACTOR","Two-Factor","Success",null,null,"0x0550",0,null,null,null,null,"IF EXISTS(SELECT TOP 1 * FROM [AuditEvent] WHERE [AuditEventId] = 0x0550) UPDATE [AuditEvent] SET [Key] = 'Two-Factor', [Value] = 'Two-Factor', [IsAlert] = 0 WHERE [AuditEventId] = 0x0550 ELSE INSERT INTO [AuditEvent] ([AuditEventId], [Key], [Value], [IsAlert]) VALUES (0x0550, 'Two-Factor', 'Two-Factor', 0)","IF EXISTS(SELECT TOP 1 * FROM [AuditData] WHERE [AuditDataId] = 0 AND [AuditEventId] = 0x0550) UPDATE [AuditData] SET [Key] = 'Success', [Value] = 'Success', [IsAlert] = 0 WHERE [AuditDataId] = 0 AND [AuditEventId] = 0x0550 ELSE INSERT INTO [AuditData] ([AuditDataId], [AuditEventId], [Key], [Value], [IsAlert]) VALUES (0, 0x0550, 'Success', 'Success', 0)"]
[null,"Audit","TWO_FACTOR","Two-Factor","Rejected - Timeout",null,null,"0x0550",1,null,null,null,null,"IF EXISTS(SELECT TOP 1 * FROM [AuditEvent] WHERE [AuditEventId] = 0x0550) UPDATE [AuditEvent] SET [Key] = 'Two-Factor', [Value] = 'Two-Factor', [IsAlert] = 0 WHERE [AuditEventId] = 0x0550 ELSE INSERT INTO [AuditEvent] ([AuditEventId], [Key], [Value], [IsAlert]) VALUES (0x0550, 'Two-Factor', 'Two-Factor', 0)","IF EXISTS(SELECT TOP 1 * FROM [AuditData] WHERE [AuditDataId] = 1 AND [AuditEventId] = 0x0550) UPDATE [AuditData] SET [Key] = 'Rejected - Timeout', [Value] = 'Rejected - Timeout', [IsAlert] = 0 WHERE [AuditDataId] = 1 AND [AuditEventId] = 0x0550 ELSE INSERT INTO [AuditData] ([AuditDataId], [AuditEventId], [Key], [Value], [IsAlert]) VALUES (1, 0x0550, 'Rejected - Timeout', 'Rejected - Timeout', 0)"]
[null,"Audit","TWO_FACTOR","Two-Factor","Rejected - Bad Second Credential",null,null,"0x0550",2,null,null,null,null,"IF EXISTS(SELECT TOP 1 * FROM [AuditEvent] WHERE [AuditEventId] = 0x0550) UPDATE [AuditEvent] SET [Key] = 'Two-Factor', [Value] = 'Two-Factor', [IsAlert] = 0 WHERE [AuditEventId] = 0x0550 ELSE INSERT INTO [AuditEvent] ([AuditEventId], [Key], [Value], [IsAlert]) VALUES (0x0550, 'Two-Factor', 'Two-Factor', 0)","IF EXISTS(SELECT TOP 1 * FROM [AuditData] WHERE [AuditDataId] = 2 AND [AuditEventId] = 0x0550) UPDATE [AuditData] SET [Key] = 'Rejected - Bad Second Credential', [Value] = 'Rejected - Bad Second Credential', [IsAlert] = 0 WHERE [AuditDataId] = 2 AND [AuditEventId] = 0x0550 ELSE INSERT INTO [AuditData] ([AuditDataId], [AuditEventId], [Key], [Value], [IsAlert]) VALUES (2, 0x0550, 'Rejected - Bad Second Credential', 'Rejected - Bad Second Credential', 0)"]
[null,"Audit","TWO_FACTOR_TWO_USER","Two-Factor Two-User","User 1 Success",null,null,"0x0551",0,null,null,null,null,"IF EXISTS(SELECT TOP 1 * FROM [AuditEvent] WHERE [AuditEventId] = 0x0551) UPDATE [AuditEvent] SET [Key] = 'Two-Factor Two-User', [Value] = 'Two-Factor Two-User', [IsAlert] = 0 WHERE [AuditEventId] = 0x0551 ELSE INSERT INTO [AuditEvent] ([AuditEventId], [Key], [Value], [IsAlert]) VALUES (0x0551, 'Two-Factor Two-User', 'Two-Factor Two-User', 0)","IF EXISTS(SELECT TOP 1 * FROM [AuditData] WHERE [AuditDataId] = 0 AND [AuditEventId] = 0x0551) UPDATE [AuditData] SET [Key] = 'User 1 Success', [Value] = 'User 1 Success', [IsAlert] = 0 WHERE [AuditDataId] = 0 AND [AuditEventId] = 0x0551 ELSE INSERT INTO [AuditData] ([AuditDataId], [AuditEventId], [Key], [Value], [IsAlert]) VALUES (0, 0x0551, 'User 1 Success', 'User 1 Success', 0)"]
[null,"Audit","TWO_FACTOR_TWO_USER","Two-Factor Two-User","User 1 Rejected - Timeout",null,null,"0x0551",1,null,null,null,null,"IF EXISTS(SELECT TOP 1 * FROM [AuditEvent] WHERE [AuditEventId] = 0x0551) UPDATE [AuditEvent] SET [Key] = 'Two-Factor Two-User', [Value] = 'Two-Factor Two-User', [IsAlert] = 0 WHERE [AuditEventId] = 0x0551 ELSE INSERT INTO [AuditEvent] ([AuditEventId], [Key], [Value], [IsAlert]) VALUES (0x0551, 'Two-Factor Two-User', 'Two-Factor Two-User', 0)","IF EXISTS(SELECT TOP 1 * FROM [AuditData] WHERE [AuditDataId] = 1 AND [AuditEventId] = 0x0551) UPDATE [AuditData] SET [Key] = 'User 1 Rejected - Timeout', [Value] = 'User 1 Rejected - Timeout', [IsAlert] = 0 WHERE [AuditDataId] = 1 AND [AuditEventId] = 0x0551 ELSE INSERT INTO [AuditData] ([AuditDataId], [AuditEventId], [Key], [Value], [IsAlert]) VALUES (1, 0x0551, 'User 1 Rejected - Timeout', 'User 1 Rejected - Timeout', 0)"]
[null,"Audit","TWO_FACTOR_TWO_USER","Two-Factor Two-User","User 1 Rejected - Bad Second Credential",null,null,"0x0551",2,null,null,null,null,"IF EXISTS(SELECT TOP 1 * FROM [AuditEvent] WHERE [AuditEventId] = 0x0551) UPDATE [AuditEvent] SET [Key] = 'Two-Factor Two-User', [Value] = 'Two-Factor Two-User', [IsAlert] = 0 WHERE [AuditEventId] = 0x0551 ELSE INSERT INTO [AuditEvent] ([AuditEventId], [Key], [Value], [IsAlert]) VALUES (0x0551, 'Two-Factor Two-User', 'Two-Factor Two-User', 0)","IF EXISTS(SELECT TOP 1 * FROM [AuditData] WHERE [AuditDataId] = 2 AND [AuditEventId] = 0x0551) UPDATE [AuditData] SET [Key] = 'User 1 Rejected - Bad Second Credential', [Value] = 'User 1 Rejected - Bad Second Credential', [IsAlert] = 0 WHERE [AuditDataId] = 2 AND [AuditEventId] = 0x0551 ELSE INSERT INTO [AuditData] ([AuditDataId], [AuditEventId], [Key], [Value], [IsAlert]) VALUES (2, 0x0551, 'User 1 Rejected - Bad Second Credential', 'User 1 Rejected - Bad Second Credential', 0)"]
[null,"Audit","TWO_FACTOR_TWO_USER","Two-Factor Two-User","User 2 Success",null,null,"0x0551",4,null,null,null,null,"IF EXISTS(SELECT TOP 1 * FROM [AuditEvent] WHERE [AuditEventId] = 0x0551) UPDATE [AuditEvent] SET [Key] = 'Two-Factor Two-User', [Value] = 'Two-Factor Two-User', [IsAlert] = 0 WHERE [AuditEventId] = 0x0551 ELSE INSERT INTO [AuditEvent] ([AuditEventId], [Key], [Value], [IsAlert]) VALUES (0x0551, 'Two-Factor Two-User', 'Two-Factor Two-User', 0)","IF EXISTS(SELECT TOP 1 * FROM [AuditData] WHERE [AuditDataId] = 4 AND [AuditEventId] = 0x0551) UPDATE [AuditData] SET [Key] = 'User 2 Success', [Value] = 'User 2 Success', [IsAlert] = 0 WHERE [AuditDataId] = 4 AND [AuditEventId] = 0x0551 ELSE INSERT INTO [AuditData] ([AuditDataId], [AuditEventId], [Key], [Value], [IsAlert]) VALUES (4, 0x0551, 'User 2 Success', 'User 2 Success', 0)"]
[null,"Audit","TWO_FACTOR_TWO_USER","Two-Factor Two-User","User 2 Access Denied",null,null,"0x0551",5,null,null,null,null,"IF EXISTS(SELECT TOP 1 * FROM [AuditEvent] WHERE [AuditEventId] = 0x0551) UPDATE [AuditEvent] SET [Key] = 'Two-Factor Two-User', [Value] = 'Two-Factor Two-User', [IsAlert] = 0 WHERE [AuditEventId] = 0x0551 ELSE INSERT INTO [AuditEvent] ([AuditEventId], [Key], [Value], [IsAlert]) VALUES (0x0551, 'Two-Factor Two-User', 'Two-Factor Two-User', 0)","IF EXISTS(SELECT TOP 1 * FROM [AuditData] WHERE [AuditDataId] = 5 AND [AuditEventId] = 0x0551) UPDATE [AuditData] SET [Key] = 'User 2 Access Denied', [Value] = 'User 2 Access Denied', [IsAlert] = 0 WHERE [AuditDataId] = 5 AND [AuditEventId] = 0x0551 ELSE INSERT INTO [AuditData] ([AuditDataId], [AuditEventId], [Key], [Value], [IsAlert]) VALUES (5, 0x0551, 'User 2 Access Denied', 'User 2 Access Denied', 0)"]
[null,"Audit","TWO_FACTOR_TWO_USER","Two-Factor Two-User","User 2 Rejected - Timeout",null,null,"0x0551",6,null,null,null,null,"IF EXISTS(SELECT TOP 1 * FROM [AuditEvent] WHERE [AuditEventId] = 0x0551) UPDATE [AuditEvent] SET [Key] = 'Two-Factor Two-User', [Value] = 'Two-Factor Two-User', [IsAlert] = 0 WHERE [AuditEventId] = 0x0551 ELSE INSERT INTO [AuditEvent] ([AuditEventId], [Key], [Value], [IsAlert]) VALUES (0x0551, 'Two-Factor Two-User', 'Two-Factor Two-User', 0)","IF EXISTS(SELECT TOP 1 * FROM [AuditData] WHERE [AuditDataId] = 6 AND [AuditEventId] = 0x0551) UPDATE [AuditData] SET [Key] = 'User 2 Rejected - Timeout', [Value] = 'User 2 Rejected - Timeout', [IsAlert] = 0 WHERE [AuditDataId] = 6 AND [AuditEventId] = 0x0551 ELSE INSERT INTO [AuditData] ([AuditDataId], [AuditEventId], [Key], [Value], [IsAlert]) VALUES (6, 0x0551, 'User 2 Rejected - Timeout', 'User 2 Rejected - Timeout', 0)"]
[null,"Audit","TWO_FACTOR_TWO_USER","Two-Factor Two-User","User 2 Rejected - Bad Second Credential",null,null,"0x0551",7,null,null,null,null,"IF EXISTS(SELECT TOP 1 * FROM [AuditEvent] WHERE [AuditEventId] = 0x0551) UPDATE [AuditEvent] SET [Key] = 'Two-Factor Two-User', [Value] = 'Two-Factor Two-User', [IsAlert] = 0 WHERE [AuditEventId] = 0x0551 ELSE INSERT INTO [AuditEvent] ([AuditEventId], [Key], [Value], [IsAlert]) VALUES (0x0551, 'Two-Factor Two-User', 'Two-Factor Two-User', 0)","IF EXISTS(SELECT TOP 1 * FROM [AuditData] WHERE [AuditDataId] = 7 AND [AuditEventId] = 0x0551) UPDATE [AuditData] SET [Key] = 'User 2 Rejected - Bad Second Credential', [Value] = 'User 2 Rejected - Bad Second Credential', [IsAlert] = 0 WHERE [AuditDataId] = 7 AND [AuditEventId] = 0x0551 ELSE INSERT INTO [AuditData] ([AuditDataId], [AuditEventId], [Key], [Value], [IsAlert]) VALUES (7, 0x0551, 'User 2 Rejected - Bad Second Credential', 'User 2 Rejected - Bad Second Credential', 0)"]
[null,"Audit","ONE_FACTOR_TWO_USER","One-Factor Two-User","User 1 Success",null,null,"0x0552",0,null,null,null,null,{"$f":"IF(LEFT(H126,2)=\"0x\",CONCATENATE(\"IF EXISTS(SELECT TOP 1 * FROM [AuditEvent] WHERE [AuditEventId] = \",H126,\") UPDATE [AuditEvent] SET [Key] = '\",TRIM(D126),\"', [Value] = '\",TRIM(D126),\"', [IsAlert] = \",IF(B126=\"Audit\",0,1),\" WHERE [AuditEventId] = \",H126,\" ELSE INSERT INTO [AuditEvent] ([AuditEventId], [Key], [Value], [IsAlert]) VALUES (\",H126,\", '\",TRIM(D126),\"', '\",TRIM(D126),\"', \",IF(B126=\"Audit\",0,1), \")\"),\"-- no value\")","v":"IF EXISTS(SELECT TOP 1 * FROM [AuditEvent] WHERE [AuditEventId] = 0x0552) UPDATE [AuditEvent] SET [Key] = 'One-Factor Two-User', [Value] = 'One-Factor Two-User', [IsAlert] = 0 WHERE [AuditEventId] = 0x0552 ELSE INSERT INTO [AuditEvent] ([AuditEventId], [Key], [Value], [IsAlert]) VALUES (0x0552, 'One-Factor Two-User', 'One-Factor Two-User', 0)"},"IF EXISTS(SELECT TOP 1 * FROM [AuditData] WHERE [AuditDataId] = 0 AND [AuditEventId] = 0x0552) UPDATE [AuditData] SET [Key] = 'User 1 Success', [Value] = 'User 1 Success', [IsAlert] = 0 WHERE [AuditDataId] = 0 AND [AuditEventId] = 0x0552 ELSE INSERT INTO [AuditData] ([AuditDataId], [AuditEventId], [Key], [Value], [IsAlert]) VALUES (0, 0x0552, 'User 1 Success', 'User 1 Success', 0)"]
[null,"Audit","ONE_FACTOR_TWO_USER","One-Factor Two-User","User 2 Success",null,null,"0x0552",4,null,null,null,null,"IF EXISTS(SELECT TOP 1 * FROM [AuditEvent] WHERE [AuditEventId] = 0x0552) UPDATE [AuditEvent] SET [Key] = 'One-Factor Two-User', [Value] = 'One-Factor Two-User', [IsAlert] = 0 WHERE [AuditEventId] = 0x0552 ELSE INSERT INTO [AuditEvent] ([AuditEventId], [Key], [Value], [IsAlert]) VALUES (0x0552, 'One-Factor Two-User', 'One-Factor Two-User', 0)","IF EXISTS(SELECT TOP 1 * FROM [AuditData] WHERE [AuditDataId] = 4 AND [AuditEventId] = 0x0552) UPDATE [AuditData] SET [Key] = 'User 2 Success', [Value] = 'User 2 Success', [IsAlert] = 0 WHERE [AuditDataId] = 4 AND [AuditEventId] = 0x0552 ELSE INSERT INTO [AuditData] ([AuditDataId], [AuditEventId], [Key], [Value], [IsAlert]) VALUES (4, 0x0552, 'User 2 Success', 'User 2 Success', 0)"]
[null,"Audit","ONE_FACTOR_TWO_USER","One-Factor Two-User","User 2 Access Denied",null,null,"0x0552",5,null,null,null,null,"IF EXISTS(SELECT TOP 1 * FROM [AuditEvent] WHERE [AuditEventId] = 0x0552) UPDATE [AuditEvent] SET [Key] = 'One-Factor Two-User', [Value] = 'One-Factor Two-User', [IsAlert] = 0 WHERE [AuditEventId] = 0x0552 ELSE INSERT INTO [AuditEvent] ([AuditEventId], [Key], [Value], [IsAlert]) VALUES (0x0552, 'One-Factor Two-User', 'One-Factor Two-User', 0)","IF EXISTS(SELECT TOP 1 * FROM [AuditData] WHERE [AuditDataId] = 5 AND [AuditEventId] = 0x0552) UPDATE [AuditData] SET [Key] = 'User 2 Access Denied', [Value] = 'User 2 Access Denied', [IsAlert] = 0 WHERE [AuditDataId] = 5 AND [AuditEventId] = 0x0552 ELSE INSERT INTO [AuditData] ([AuditDataId], [AuditEventId], [Key], [Value], [IsAlert]) VALUES (5, 0x0552, 'User 2 Access Denied', 'User 2 Access Denied', 0)"]
[null,"Audit","ONE_FACTOR_TWO_USER","One-Factor Two-User","User 2 Rejected - Timeout",null,null,"0x0552",6,null,null,null,null,"IF EXISTS(SELECT TOP 1 * FROM [AuditEvent] WHERE [AuditEventId] = 0x0552) UPDATE [AuditEvent] SET [Key] = 'One-Factor Two-User', [Value] = 'One-Factor Two-User', [IsAlert] = 0 WHERE [AuditEventId] = 0x0552 ELSE INSERT INTO [AuditEvent] ([AuditEventId], [Key], [Value], [IsAlert]) VALUES (0x0552, 'One-Factor Two-User', 'One-Factor Two-User', 0)","IF EXISTS(SELECT TOP 1 * FROM [AuditData] WHERE [AuditDataId] = 6 AND [AuditEventId] = 0x0552) UPDATE [AuditData] SET [Key] = 'User 2 Rejected - Timeout', [Value] = 'User 2 Rejected - Timeout', [IsAlert] = 0 WHERE [AuditDataId] = 6 AND [AuditEventId] = 0x0552 ELSE INSERT INTO [AuditData] ([AuditDataId], [AuditEventId], [Key], [Value], [IsAlert]) VALUES (6, 0x0552, 'User 2 Rejected - Timeout', 'User 2 Rejected - Timeout', 0)"]
[null,null,null,null,null,null,null,null,null,null,null,null,null,"-- no value","-- no value"]
["Database Audits",null,null,null,null,null,null,null,null,null,null,null,null,"-- no value","-- no value"]
["Base Value",null,null,null,null,null,null,null,null,null,null,null,null,"-- no value","-- no value"]
["0x0600","Audit","USR_REC_OPS","Database Error","Add User Failed",{"$f":"LEN(D133)","v":14},{"$f":"LEN(E133)","v":15},"0x0600","0001",null,null,null,null,"IF EXISTS(SELECT TOP 1 * FROM [AuditEvent] WHERE [AuditEventId] = 0x0600) UPDATE [AuditEvent] SET [Key] = 'Database Error', [Value] = 'Database Error', [IsAlert] = 0 WHERE [AuditEventId] = 0x0600 ELSE INSERT INTO [AuditEvent] ([AuditEventId], [Key], [Value], [IsAlert]) VALUES (0x0600, 'Database Error', 'Database Error', 0)","IF EXISTS(SELECT TOP 1 * FROM [AuditData] WHERE [AuditDataId] = 1 AND [AuditEventId] = 0x0600) UPDATE [AuditData] SET [Key] = 'Add User Failed', [Value] = 'Add User Failed', [IsAlert] = 0 WHERE [AuditDataId] = 1 AND [AuditEventId] = 0x0600 ELSE INSERT INTO [AuditData] ([AuditDataId], [AuditEventId], [Key], [Value], [IsAlert]) VALUES (1, 0x0600, 'Add User Failed', 'Add User Failed', 0)"]
[null,"Audit","USR_REC_OPS","Database Error","Update User Failed",14,18,"0x0600","0002",null,null,null,null,"IF EXISTS(SELECT TOP 1 * FROM [AuditEvent] WHERE [AuditEventId] = 0x0600) UPDATE [AuditEvent] SET [Key] = 'Database Error', [Value] = 'Database Error', [IsAlert] = 0 WHERE [AuditEventId] = 0x0600 ELSE INSERT INTO [AuditEvent] ([AuditEventId], [Key], [Value], [IsAlert]) VALUES (0x0600, 'Database Error', 'Database Error', 0)","IF EXISTS(SELECT TOP 1 * FROM [AuditData] WHERE [AuditDataId] = 2 AND [AuditEventId] = 0x0600) UPDATE [AuditData] SET [Key] = 'Update User Failed', [Value] = 'Update User Failed', [IsAlert] = 0 WHERE [AuditDataId] = 2 AND [AuditEventId] = 0x0600 ELSE INSERT INTO [AuditData] ([AuditDataId], [AuditEventId], [Key], [Value], [IsAlert]) VALUES (2, 0x0600, 'Update User Failed', 'Update User Failed', 0)"]
[null,"Audit","USR_REC_OPS","Database Error","Delete User Failed",14,18,"0x0600","0003",null,null,null,null,"IF EXISTS(SELECT TOP 1 * FROM [AuditEvent] WHERE [AuditEventId] = 0x0600) UPDATE [AuditEvent] SET [Key] = 'Database Error', [Value] = 'Database Error', [IsAlert] = 0 WHERE [AuditEventId] = 0x0600 ELSE INSERT INTO [AuditEvent] ([AuditEventId], [Key], [Value], [IsAlert]) VALUES (0x0600, 'Database Error', 'Database Error', 0)","IF EXISTS(SELECT TOP 1 * FROM [AuditData] WHERE [AuditDataId] = 3 AND [AuditEventId] = 0x0600) UPDATE [AuditData] SET [Key] = 'Delete User Failed', [Value] = 'Delete User Failed', [IsAlert] = 0 WHERE [AuditDataId] = 3 AND [AuditEventId] = 0x0600 ELSE INSERT INTO [AuditData] ([AuditDataId], [AuditEventId], [Key], [Value], [IsAlert]) VALUES (3, 0x0600, 'Delete User Failed', 'Delete User Failed', 0)"]
[null,"Audit","USR_REC_OPS","Database Error","User Limit Reached",null,null,"0x0600","0004",null,null,null,null,"IF EXISTS(SELECT TOP 1 * FROM [AuditEvent] WHERE [AuditEventId] = 0x0600) UPDATE [AuditEvent] SET [Key] = 'Database Error', [Value] = 'Database Error', [IsAlert] = 0 WHERE [AuditEventId] = 0x0600 ELSE INSERT INTO [AuditEvent] ([AuditEventId], [Key], [Value], [IsAlert]) VALUES (0x0600, 'Database Error', 'Database Error', 0)","IF EXISTS(SELECT TOP 1 * FROM [AuditData] WHERE [AuditDataId] = 4 AND [AuditEventId] = 0x0600) UPDATE [AuditData] SET [Key] = 'User Limit Reached', [Value] = 'User Limit Reached', [IsAlert] = 0 WHERE [AuditDataId] = 4 AND [AuditEventId] = 0x0600 ELSE INSERT INTO [AuditData] ([AuditDataId], [AuditEventId], [Key], [Value], [IsAlert]) VALUES (4, 0x0600, 'User Limit Reached', 'User Limit Reached', 0)"]
[null,"Audit","USER_DB_UPDATE_COMPLETE","Doorfile Update Successful","Database download and Audit upload",26,34,"0x0601",0,null,null,null,null,"IF EXISTS(SELECT TOP 1 * FROM [AuditEvent] WHERE [AuditEventId] = 0x0601) UPDATE [AuditEvent] SET [Key] = 'Doorfile Update Successful', [Value] = 'Doorfile Update Successful', [IsAlert] = 0 WHERE [AuditEventId] = 0x0601 ELSE INSERT INTO [AuditEvent] ([AuditEventId], [Key], [Value], [IsAlert]) VALUES (0x0601, 'Doorfile Update Successful', 'Doorfile Update Successful', 0)","IF EXISTS(SELECT TOP 1 * FROM [AuditData] WHERE [AuditDataId] = 0 AND [AuditEventId] = 0x0601) UPDATE [AuditData] SET [Key] = 'Database download and Audit upload', [Value] = 'Database download and Audit upload', [IsAlert] = 0 WHERE [AuditDataId] = 0 AND [AuditEventId] = 0x0601 ELSE INSERT INTO [AuditData] ([AuditDataId], [AuditEventId], [Key], [Value], [IsAlert]) VALUES (0, 0x0601, 'Database download and Audit upload', 'Database download and Audit upload', 0)"]
[null,"Audit","AUDIT_UPLOAD_TRIG","Start Audit Upload",null,18,0,"0x0602",0,null,null,null,null,"IF EXISTS(SELECT TOP 1 * FROM [AuditEvent] WHERE [AuditEventId] = 0x0602) UPDATE [AuditEvent] SET [Key] = 'Start Audit Upload', [Value] = 'Start Audit Upload', [IsAlert] = 0 WHERE [AuditEventId] = 0x0602 ELSE INSERT INTO [AuditEvent] ([AuditEventId], [Key], [Value], [IsAlert]) VALUES (0x0602, 'Start Audit Upload', 'Start Audit Upload', 0)","IF EXISTS(SELECT TOP 1 * FROM [AuditData] WHERE [AuditDataId] = 0 AND [AuditEventId] = 0x0602) UPDATE [AuditData] SET [Key] = '', [Value] = '', [IsAlert] = 0 WHERE [AuditDataId] = 0 AND [AuditEventId] = 0x0602 ELSE INSERT INTO [AuditData] ([AuditDataId], [AuditEventId], [Key], [Value], [IsAlert]) VALUES (0, 0x0602, '', '', 0)"]
[null,"Audit","USER_DB_PRESORT_RESULT ","Database Sort Status","Database Presorted    ",20,22,"0x0603","0000",null,null,null,null,"IF EXISTS(SELECT TOP 1 * FROM [AuditEvent] WHERE [AuditEventId] = 0x0603) UPDATE [AuditEvent] SET [Key] = 'Database Sort Status', [Value] = 'Database Sort Status', [IsAlert] = 0 WHERE [AuditEventId] = 0x0603 ELSE INSERT INTO [AuditEvent] ([AuditEventId], [Key], [Value], [IsAlert]) VALUES (0x0603, 'Database Sort Status', 'Database Sort Status', 0)","IF EXISTS(SELECT TOP 1 * FROM [AuditData] WHERE [AuditDataId] = 0 AND [AuditEventId] = 0x0603) UPDATE [AuditData] SET [Key] = 'Database Presorted    ', [Value] = 'Database Presorted    ', [IsAlert] = 0 WHERE [AuditDataId] = 0 AND [AuditEventId] = 0x0603 ELSE INSERT INTO [AuditData] ([AuditDataId], [AuditEventId], [Key], [Value], [IsAlert]) VALUES (0, 0x0603, 'Database Presorted    ', 'Database Presorted    ', 0)"]
[null,"Audit","USER_DB_PRESORT_RESULT ","Database Sort Status","Database Not Presorted  ",20,24,"0x0603","0001",null,null,null,null,"IF EXISTS(SELECT TOP 1 * FROM [AuditEvent] WHERE [AuditEventId] = 0x0603) UPDATE [AuditEvent] SET [Key] = 'Database Sort Status', [Value] = 'Database Sort Status', [IsAlert] = 0 WHERE [AuditEventId] = 0x0603 ELSE INSERT INTO [AuditEvent] ([AuditEventId], [Key], [Value], [IsAlert]) VALUES (0x0603, 'Database Sort Status', 'Database Sort Status', 0)","IF EXISTS(SELECT TOP 1 * FROM [AuditData] WHERE [AuditDataId] = 1 AND [AuditEventId] = 0x0603) UPDATE [AuditData] SET [Key] = 'Database Not Presorted  ', [Value] = 'Database Not Presorted  ', [IsAlert] = 0 WHERE [AuditDataId] = 1 AND [AuditEventId] = 0x0603 ELSE INSERT INTO [AuditData] ([AuditDataId], [AuditEventId], [Key], [Value], [IsAlert]) VALUES (1, 0x0603, 'Database Not Presorted  ', 'Database Not Presorted  ', 0)"]
[null,"Audit","USER_DB_PRESORT_RESULT ","Database Sort Status","Unknown Database Presorting",20,27,"0x0603","00FF",null,null,null,null,"IF EXISTS(SELECT TOP 1 * FROM [AuditEvent] WHERE [AuditEventId] = 0x0603) UPDATE [AuditEvent] SET [Key] = 'Database Sort Status', [Value] = 'Database Sort Status', [IsAlert] = 0 WHERE [AuditEventId] = 0x0603 ELSE INSERT INTO [AuditEvent] ([AuditEventId], [Key], [Value], [IsAlert]) VALUES (0x0603, 'Database Sort Status', 'Database Sort Status', 0)","IF EXISTS(SELECT TOP 1 * FROM [AuditData] WHERE [AuditDataId] = 255 AND [AuditEventId] = 0x0603) UPDATE [AuditData] SET [Key] = 'Unknown Database Presorting', [Value] = 'Unknown Database Presorting', [IsAlert] = 0 WHERE [AuditDataId] = 255 AND [AuditEventId] = 0x0603 ELSE INSERT INTO [AuditData] ([AuditDataId], [AuditEventId], [Key], [Value], [IsAlert]) VALUES (255, 0x0603, 'Unknown Database Presorting', 'Unknown Database Presorting', 0)"]
[null,"Both","USER_DB_CORRUPT","User Database Corrupt",null,21,0,"0x0604",0,null,null,null,null,"IF EXISTS(SELECT TOP 1 * FROM [AuditEvent] WHERE [AuditEventId] = 0x0604) UPDATE [AuditEvent] SET [Key] = 'User Database Corrupt', [Value] = 'User Database Corrupt', [IsAlert] = 1 WHERE [AuditEventId] = 0x0604 ELSE INSERT INTO [AuditEvent] ([AuditEventId], [Key], [Value], [IsAlert]) VALUES (0x0604, 'User Database Corrupt', 'User Database Corrupt', 1)","IF EXISTS(SELECT TOP 1 * FROM [AuditData] WHERE [AuditDataId] = 0 AND [AuditEventId] = 0x0604) UPDATE [AuditData] SET [Key] = '', [Value] = '', [IsAlert] = 0 WHERE [AuditDataId] = 0 AND [AuditEventId] = 0x0604 ELSE INSERT INTO [AuditData] ([AuditDataId], [AuditEventId], [Key], [Value], [IsAlert]) VALUES (0, 0x0604, '', '', 0)"]
[null,"Audit","LOSS_OF_AUDITS","Unread Audits Overwritten","Device",25,null,"0x0605",0,null,null,null,null,"IF EXISTS(SELECT TOP 1 * FROM [AuditEvent] WHERE [AuditEventId] = 0x0605) UPDATE [AuditEvent] SET [Key] = 'Unread Audits Overwritten', [Value] = 'Unread Audits Overwritten', [IsAlert] = 0 WHERE [AuditEventId] = 0x0605 ELSE INSERT INTO [AuditEvent] ([AuditEventId], [Key], [Value], [IsAlert]) VALUES (0x0605, 'Unread Audits Overwritten', 'Unread Audits Overwritten', 0)","IF EXISTS(SELECT TOP 1 * FROM [AuditData] WHERE [AuditDataId] = 0 AND [AuditEventId] = 0x0605) UPDATE [AuditData] SET [Key] = 'Device', [Value] = 'Device', [IsAlert] = 0 WHERE [AuditDataId] = 0 AND [AuditEventId] = 0x0605 ELSE INSERT INTO [AuditData] ([AuditDataId], [AuditEventId], [Key], [Value], [IsAlert]) VALUES (0, 0x0605, 'Device', 'Device', 0)"]
[null,"Audit","LOSS_OF_AUDITS","Unread Audits Overwritten","Gateway",null,null,"0x0605",1,null,null,null,null,"IF EXISTS(SELECT TOP 1 * FROM [AuditEvent] WHERE [AuditEventId] = 0x0605) UPDATE [AuditEvent] SET [Key] = 'Unread Audits Overwritten', [Value] = 'Unread Audits Overwritten', [IsAlert] = 0 WHERE [AuditEventId] = 0x0605 ELSE INSERT INTO [AuditEvent] ([AuditEventId], [Key], [Value], [IsAlert]) VALUES (0x0605, 'Unread Audits Overwritten', 'Unread Audits Overwritten', 0)","IF EXISTS(SELECT TOP 1 * FROM [AuditData] WHERE [AuditDataId] = 1 AND [AuditEventId] = 0x0605) UPDATE [AuditData] SET [Key] = 'Gateway', [Value] = 'Gateway', [IsAlert] = 0 WHERE [AuditDataId] = 1 AND [AuditEventId] = 0x0605 ELSE INSERT INTO [AuditData] ([AuditDataId], [AuditEventId], [Key], [Value], [IsAlert]) VALUES (1, 0x0605, 'Gateway', 'Gateway', 0)"]
[null,"Audit","USER_DB_PARTIAL_DOWNLOAD","Doorfile Partial Database Download",null,null,null,"0x0606","00xx","2-240","last successful index",null,null,"IF EXISTS(SELECT TOP 1 * FROM [AuditEvent] WHERE [AuditEventId] = 0x0606) UPDATE [AuditEvent] SET [Key] = 'Doorfile Partial Database Download', [Value] = 'Doorfile Partial Database Download', [IsAlert] = 0 WHERE [AuditEventId] = 0x0606 ELSE INSERT INTO [AuditEvent] ([AuditEventId], [Key], [Value], [IsAlert]) VALUES (0x0606, 'Doorfile Partial Database Download', 'Doorfile Partial Database Download', 0)","-- no value"]
[null,"Audit","USER_DB_PARTIAL_DOWNLOAD_FAULT","Doorfile Partial Database Download Fault","Out of Order",null,null,"0x0607",0,null,null,null,null,"IF EXISTS(SELECT TOP 1 * FROM [AuditEvent] WHERE [AuditEventId] = 0x0607) UPDATE [AuditEvent] SET [Key] = 'Doorfile Partial Database Download Fault', [Value] = 'Doorfile Partial Database Download Fault', [IsAlert] = 0 WHERE [AuditEventId] = 0x0607 ELSE INSERT INTO [AuditEvent] ([AuditEventId], [Key], [Value], [IsAlert]) VALUES (0x0607, 'Doorfile Partial Database Download Fault', 'Doorfile Partial Database Download Fault', 0)","IF EXISTS(SELECT TOP 1 * FROM [AuditData] WHERE [AuditDataId] = 0 AND [AuditEventId] = 0x0607) UPDATE [AuditData] SET [Key] = 'Out of Order', [Value] = 'Out of Order', [IsAlert] = 0 WHERE [AuditDataId] = 0 AND [AuditEventId] = 0x0607 ELSE INSERT INTO [AuditData] ([AuditDataId], [AuditEventId], [Key], [Value], [IsAlert]) VALUES (0, 0x0607, 'Out of Order', 'Out of Order', 0)"]
[null,"Audit","USER_DB_PARTIAL_DOWNLOAD_FAULT","Doorfile Partial Database Download Fault","Timeout",null,null,"0x0607",1,null,null,null,null,"IF EXISTS(SELECT TOP 1 * FROM [AuditEvent] WHERE [AuditEventId] = 0x0607) UPDATE [AuditEvent] SET [Key] = 'Doorfile Partial Database Download Fault', [Value] = 'Doorfile Partial Database Download Fault', [IsAlert] = 0 WHERE [AuditEventId] = 0x0607 ELSE INSERT INTO [AuditEvent] ([AuditEventId], [Key], [Value], [IsAlert]) VALUES (0x0607, 'Doorfile Partial Database Download Fault', 'Doorfile Partial Database Download Fault', 0)",{"$f":"IF(AND(LEFT(H147,2)=\"0x\",ISNUMBER(HEX2DEC(TRIM(I147))*1)),CONCATENATE(\"IF EXISTS(SELECT TOP 1 * FROM [AuditData] WHERE [AuditDataId] = \",HEX2DEC(I147),\" AND [AuditEventId] = \",H147,\") UPDATE [AuditData] SET [Key] = '\",E147,\"', [Value] = '\",E147,\"', [IsAlert] = 0 WHERE [AuditDataId] = \",HEX2DEC(I147),\" AND [AuditEventId] = \",H147,\" ELSE INSERT INTO [AuditData] ([AuditDataId], [AuditEventId], [Key], [Value], [IsAlert]) VALUES (\",HEX2DEC(I147),\", \",H147,\", '\",E147,\"', '\",E147,\"', 0)\"),\"-- no value\")","v":"IF EXISTS(SELECT TOP 1 * FROM [AuditData] WHERE [AuditDataId] = 1 AND [AuditEventId] = 0x0607) UPDATE [AuditData] SET [Key] = 'Timeout', [Value] = 'Timeout', [IsAlert] = 0 WHERE [AuditDataId] = 1 AND [AuditEventId] = 0x0607 ELSE INSERT INTO [AuditData] ([AuditDataId], [AuditEventId], [Key], [Value], [IsAlert]) VALUES (1, 0x0607, 'Timeout', 'Timeout', 0)"}]
[null,"Audit","PARTIAL_UPDATE_DB_COUNT","Incremental Database Update Count","xxxx",null,null,"0x0608","xxxx","0 to 750",null,null,null,"IF EXISTS(SELECT TOP 1 * FROM [AuditEvent] WHERE [AuditEventId] = 0x0608) UPDATE [AuditEvent] SET [Key] = 'Incremental Database Update Count', [Value] = 'Incremental Database Update Count', [IsAlert] = 0 WHERE [AuditEventId] = 0x0608 ELSE INSERT INTO [AuditEvent] ([AuditEventId], [Key], [Value], [IsAlert]) VALUES (0x0608, 'Incremental Database Update Count', 'Incremental Database Update Count', 0)","-- no value"]
[null,"Audit","USER_DB_PARTIAL_UPDATE_STATUS","Partial Database Action","User(s) Added",null,null,"0x0609",1,null,null,null,null,{"$f":"IF(LEFT(H149,2)=\"0x\",CONCATENATE(\"IF EXISTS(SELECT TOP 1 * FROM [AuditEvent] WHERE [AuditEventId] = \",H149,\") UPDATE [AuditEvent] SET [Key] = '\",TRIM(D149),\"', [Value] = '\",TRIM(D149),\"', [IsAlert] = \",IF(B149=\"Audit\",0,1),\" WHERE [AuditEventId] = \",H149,\" ELSE INSERT INTO [AuditEvent] ([AuditEventId], [Key], [Value], [IsAlert]) VALUES (\",H149,\", '\",TRIM(D149),\"', '\",TRIM(D149),\"', \",IF(B149=\"Audit\",0,1), \")\"),\"-- no value\")","v":"IF EXISTS(SELECT TOP 1 * FROM [AuditEvent] WHERE [AuditEventId] = 0x0609) UPDATE [AuditEvent] SET [Key] = 'Partial Database Action', [Value] = 'Partial Database Action', [IsAlert] = 0 WHERE [AuditEventId] = 0x0609 ELSE INSERT INTO [AuditEvent] ([AuditEventId], [Key], [Value], [IsAlert]) VALUES (0x0609, 'Partial Database Action', 'Partial Database Action', 0)"},{"$f":"IF(AND(LEFT(H149,2)=\"0x\",ISNUMBER(HEX2DEC(TRIM(I149))*1)),CONCATENATE(\"IF EXISTS(SELECT TOP 1 * FROM [AuditData] WHERE [AuditDataId] = \",HEX2DEC(I149),\" AND [AuditEventId] = \",H149,\") UPDATE [AuditData] SET [Key] = '\",E149,\"', [Value] = '\",E149,\"', [IsAlert] = 0 WHERE [AuditDataId] = \",HEX2DEC(I149),\" AND [AuditEventId] = \",H149,\" ELSE INSERT INTO [AuditData] ([AuditDataId], [AuditEventId], [Key], [Value], [IsAlert]) VALUES (\",HEX2DEC(I149),\", \",H149,\", '\",E149,\"', '\",E149,\"', 0)\"),\"-- no value\")","v":"IF EXISTS(SELECT TOP 1 * FROM [AuditData] WHERE [AuditDataId] = 1 AND [AuditEventId] = 0x0609) UPDATE [AuditData] SET [Key] = 'User(s) Added', [Value] = 'User(s) Added', [IsAlert] = 0 WHERE [AuditDataId] = 1 AND [AuditEventId] = 0x0609 ELSE INSERT INTO [AuditData] ([AuditDataId], [AuditEventId], [Key], [Value], [IsAlert]) VALUES (1, 0x0609, 'User(s) Added', 'User(s) Added', 0)"}]
[null,"Audit","USER_DB_PARTIAL_UPDATE_STATUS","Partial Database Action","User(s) Updated",null,null,"0x0609",2,null,null,null,null,{"$f":"IF(LEFT(H150,2)=\"0x\",CONCATENATE(\"IF EXISTS(SELECT TOP 1 * FROM [AuditEvent] WHERE [AuditEventId] = \",H150,\") UPDATE [AuditEvent] SET [Key] = '\",TRIM(D150),\"', [Value] = '\",TRIM(D150),\"', [IsAlert] = \",IF(B150=\"Audit\",0,1),\" WHERE [AuditEventId] = \",H150,\" ELSE INSERT INTO [AuditEvent] ([AuditEventId], [Key], [Value], [IsAlert]) VALUES (\",H150,\", '\",TRIM(D150),\"', '\",TRIM(D150),\"', \",IF(B150=\"Audit\",0,1), \")\"),\"-- no value\")","v":"IF EXISTS(SELECT TOP 1 * FROM [AuditEvent] WHERE [AuditEventId] = 0x0609) UPDATE [AuditEvent] SET [Key] = 'Partial Database Action', [Value] = 'Partial Database Action', [IsAlert] = 0 WHERE [AuditEventId] = 0x0609 ELSE INSERT INTO [AuditEvent] ([AuditEventId], [Key], [Value], [IsAlert]) VALUES (0x0609, 'Partial Database Action', 'Partial Database Action', 0)"},{"$f":"IF(AND(LEFT(H150,2)=\"0x\",ISNUMBER(HEX2DEC(TRIM(I150))*1)),CONCATENATE(\"IF EXISTS(SELECT TOP 1 * FROM [AuditData] WHERE [AuditDataId] = \",HEX2DEC(I150),\" AND [AuditEventId] = \",H150,\") UPDATE [AuditData] SET [Key] = '\",E150,\"', [Value] = '\",E150,\"', [IsAlert] = 0 WHERE [AuditDataId] = \",HEX2DEC(I150),\" AND [AuditEventId] = \",H150,\" ELSE INSERT INTO [AuditData] ([AuditDataId], [AuditEventId], [Key], [Value], [IsAlert]) VALUES (\",HEX2DEC(I150),\", \",H150,\", '\",E150,\"', '\",E150,\"', 0)\"),\"-- no value\")","v":"IF EXISTS(SELECT TOP 1 * FROM [AuditData] WHERE [AuditDataId] = 2 AND [AuditEventId] = 0x0609) UPDATE [AuditData] SET [Key] = 'User(s) Updated', [Value] = 'User(s) Updated', [IsAlert] = 0 WHERE [AuditDataId] = 2 AND [AuditEventId] = 0x0609 ELSE INSERT INTO [AuditData] ([AuditDataId], [AuditEventId], [Key], [Value], [IsAlert]) VALUES (2, 0x0609, 'User(s) Updated', 'User(s) Updated', 0)"}]
[null,"Audit","USER_DB_PARTIAL_UPDATE_STATUS","Partial Database Action","User(s) Deleted",null,null,"0x0609",3,null,null,null,null,{"$f":"IF(LEFT(H151,2)=\"0x\",CONCATENATE(\"IF EXISTS(SELECT TOP 1 * FROM [AuditEvent] WHERE [AuditEventId] = \",H151,\") UPDATE [AuditEvent] SET [Key] = '\",TRIM(D151),\"', [Value] = '\",TRIM(D151),\"', [IsAlert] = \",IF(B151=\"Audit\",0,1),\" WHERE [AuditEventId] = \",H151,\" ELSE INSERT INTO [AuditEvent] ([AuditEventId], [Key], [Value], [IsAlert]) VALUES (\",H151,\", '\",TRIM(D151),\"', '\",TRIM(D151),\"', \",IF(B151=\"Audit\",0,1), \")\"),\"-- no value\")","v":"IF EXISTS(SELECT TOP 1 * FROM [AuditEvent] WHERE [AuditEventId] = 0x0609) UPDATE [AuditEvent] SET [Key] = 'Partial Database Action', [Value] = 'Partial Database Action', [IsAlert] = 0 WHERE [AuditEventId] = 0x0609 ELSE INSERT INTO [AuditEvent] ([AuditEventId], [Key], [Value], [IsAlert]) VALUES (0x0609, 'Partial Database Action', 'Partial Database Action', 0)"},{"$f":"IF(AND(LEFT(H151,2)=\"0x\",ISNUMBER(HEX2DEC(TRIM(I151))*1)),CONCATENATE(\"IF EXISTS(SELECT TOP 1 * FROM [AuditData] WHERE [AuditDataId] = \",HEX2DEC(I151),\" AND [AuditEventId] = \",H151,\") UPDATE [AuditData] SET [Key] = '\",E151,\"', [Value] = '\",E151,\"', [IsAlert] = 0 WHERE [AuditDataId] = \",HEX2DEC(I151),\" AND [AuditEventId] = \",H151,\" ELSE INSERT INTO [AuditData] ([AuditDataId], [AuditEventId], [Key], [Value], [IsAlert]) VALUES (\",HEX2DEC(I151),\", \",H151,\", '\",E151,\"', '\",E151,\"', 0)\"),\"-- no value\")","v":"IF EXISTS(SELECT TOP 1 * FROM [AuditData] WHERE [AuditDataId] = 3 AND [AuditEventId] = 0x0609) UPDATE [AuditData] SET [Key] = 'User(s) Deleted', [Value] = 'User(s) Deleted', [IsAlert] = 0 WHERE [AuditDataId] = 3 AND [AuditEventId] = 0x0609 ELSE INSERT INTO [AuditData] ([AuditDataId], [AuditEventId], [Key], [Value], [IsAlert]) VALUES (3, 0x0609, 'User(s) Deleted', 'User(s) Deleted', 0)"}]
[null,null,null,null,null,null,0,null,null,null,null,null,null,{"$f":"IF(LEFT(H152,2)=\"0x\",CONCATENATE(\"IF EXISTS(SELECT TOP 1 * FROM [AuditEvent] WHERE [AuditEventId] = \",H152,\") UPDATE [AuditEvent] SET [Key] = '\",TRIM(D152),\"', [Value] = '\",TRIM(D152),\"', [IsAlert] = \",IF(B152=\"Audit\",0,1),\" WHERE [AuditEventId] = \",H152,\" ELSE INSERT INTO [AuditEvent] ([AuditEventId], [Key], [Value], [IsAlert]) VALUES (\",H152,\", '\",TRIM(D152),\"', '\",TRIM(D152),\"', \",IF(B152=\"Audit\",0,1), \")\"),\"-- no value\")","v":"-- no value"},"-- no value"]
["Door Action / Switch Audits",null,null,null,null,null,0,null,null,null,null,null,null,"-- no value","-- no value"]
["Base Value",null,null,null,null,null,0,null,null,null,null,null,null,"-- no value","-- no value"]
["0x0700","Both","FORCED_DOOR                   ","Forced Door Alert",null,{"$f":"LEN(D155)","v":17},0,"0x0700",0,null,null,null,null,"IF EXISTS(SELECT TOP 1 * FROM [AuditEvent] WHERE [AuditEventId] = 0x0700) UPDATE [AuditEvent] SET [Key] = 'Forced Door Alert', [Value] = 'Forced Door Alert', [IsAlert] = 1 WHERE [AuditEventId] = 0x0700 ELSE INSERT INTO [AuditEvent] ([AuditEventId], [Key], [Value], [IsAlert]) VALUES (0x0700, 'Forced Door Alert', 'Forced Door Alert', 1)","IF EXISTS(SELECT TOP 1 * FROM [AuditData] WHERE [AuditDataId] = 0 AND [AuditEventId] = 0x0700) UPDATE [AuditData] SET [Key] = '', [Value] = '', [IsAlert] = 0 WHERE [AuditDataId] = 0 AND [AuditEventId] = 0x0700 ELSE INSERT INTO [AuditData] ([AuditDataId], [AuditEventId], [Key], [Value], [IsAlert]) VALUES (0, 0x0700, '', '', 0)"]
[null,"Audit","PROPPED_DOOR                  ","Propped Door Event  ",null,20,0,"0x0701",0,null,null,null,null,"IF EXISTS(SELECT TOP 1 * FROM [AuditEvent] WHERE [AuditEventId] = 0x0701) UPDATE [AuditEvent] SET [Key] = 'Propped Door Event', [Value] = 'Propped Door Event', [IsAlert] = 0 WHERE [AuditEventId] = 0x0701 ELSE INSERT INTO [AuditEvent] ([AuditEventId], [Key], [Value], [IsAlert]) VALUES (0x0701, 'Propped Door Event', 'Propped Door Event', 0)","IF EXISTS(SELECT TOP 1 * FROM [AuditData] WHERE [AuditDataId] = 0 AND [AuditEventId] = 0x0701) UPDATE [AuditData] SET [Key] = '', [Value] = '', [IsAlert] = 0 WHERE [AuditDataId] = 0 AND [AuditEventId] = 0x0701 ELSE INSERT INTO [AuditData] ([AuditDataId], [AuditEventId], [Key], [Value], [IsAlert]) VALUES (0, 0x0701, '', '', 0)"]
[null,"Both","TAMPER  ","Tamper Alert",null,12,0,"0x0702",0,null,null,null,null,"IF EXISTS(SELECT TOP 1 * FROM [AuditEvent] WHERE [AuditEventId] = 0x0702) UPDATE [AuditEvent] SET [Key] = 'Tamper Alert', [Value] = 'Tamper Alert', [IsAlert] = 1 WHERE [AuditEventId] = 0x0702 ELSE INSERT INTO [AuditEvent] ([AuditEventId], [Key], [Value], [IsAlert]) VALUES (0x0702, 'Tamper Alert', 'Tamper Alert', 1)","IF EXISTS(SELECT TOP 1 * FROM [AuditData] WHERE [AuditDataId] = 0 AND [AuditEventId] = 0x0702) UPDATE [AuditData] SET [Key] = '', [Value] = '', [IsAlert] = 0 WHERE [AuditDataId] = 0 AND [AuditEventId] = 0x0702 ELSE INSERT INTO [AuditData] ([AuditDataId], [AuditEventId], [Key], [Value], [IsAlert]) VALUES (0, 0x0702, '', '', 0)"]
[null,"Both","DPS_TAMPER                    ","Magnetic Tamper Alert",null,21,0,"0x0703",0,null,null,null,null,"IF EXISTS(SELECT TOP 1 * FROM [AuditEvent] WHERE [AuditEventId] = 0x0703) UPDATE [AuditEvent] SET [Key] = 'Magnetic Tamper Alert', [Value] = 'Magnetic Tamper Alert', [IsAlert] = 1 WHERE [AuditEventId] = 0x0703 ELSE INSERT INTO [AuditEvent] ([AuditEventId], [Key], [Value], [IsAlert]) VALUES (0x0703, 'Magnetic Tamper Alert', 'Magnetic Tamper Alert', 1)","IF EXISTS(SELECT TOP 1 * FROM [AuditData] WHERE [AuditDataId] = 0 AND [AuditEventId] = 0x0703) UPDATE [AuditData] SET [Key] = '', [Value] = '', [IsAlert] = 0 WHERE [AuditDataId] = 0 AND [AuditEventId] = 0x0703 ELSE INSERT INTO [AuditData] ([AuditDataId], [AuditEventId], [Key], [Value], [IsAlert]) VALUES (0, 0x0703, '', '', 0)"]
[null,"Audit","REX  ","Request to Exit",null,15,0,"0x0704",0,null,null,null,null,"IF EXISTS(SELECT TOP 1 * FROM [AuditEvent] WHERE [AuditEventId] = 0x0704) UPDATE [AuditEvent] SET [Key] = 'Request to Exit', [Value] = 'Request to Exit', [IsAlert] = 0 WHERE [AuditEventId] = 0x0704 ELSE INSERT INTO [AuditEvent] ([AuditEventId], [Key], [Value], [IsAlert]) VALUES (0x0704, 'Request to Exit', 'Request to Exit', 0)","IF EXISTS(SELECT TOP 1 * FROM [AuditData] WHERE [AuditDataId] = 0 AND [AuditEventId] = 0x0704) UPDATE [AuditData] SET [Key] = '', [Value] = '', [IsAlert] = 0 WHERE [AuditDataId] = 0 AND [AuditEventId] = 0x0704 ELSE INSERT INTO [AuditData] ([AuditDataId], [AuditEventId], [Key], [Value], [IsAlert]) VALUES (0, 0x0704, '', '', 0)"]
[null,"Audit","DPS_COMM_FAILURE","DPS Comm. Failure",null,17,0,"0x0705",0,null,null,null,null,"IF EXISTS(SELECT TOP 1 * FROM [AuditEvent] WHERE [AuditEventId] = 0x0705) UPDATE [AuditEvent] SET [Key] = 'DPS Comm. Failure', [Value] = 'DPS Comm. Failure', [IsAlert] = 0 WHERE [AuditEventId] = 0x0705 ELSE INSERT INTO [AuditEvent] ([AuditEventId], [Key], [Value], [IsAlert]) VALUES (0x0705, 'DPS Comm. Failure', 'DPS Comm. Failure', 0)","IF EXISTS(SELECT TOP 1 * FROM [AuditData] WHERE [AuditDataId] = 0 AND [AuditEventId] = 0x0705) UPDATE [AuditData] SET [Key] = '', [Value] = '', [IsAlert] = 0 WHERE [AuditDataId] = 0 AND [AuditEventId] = 0x0705 ELSE INSERT INTO [AuditData] ([AuditDataId], [AuditEventId], [Key], [Value], [IsAlert]) VALUES (0, 0x0705, '', '', 0)"]
[null,"Audit","STUCK_TAMPER","Stuck Tamper Switch",null,19,0,"0x0706",0,null,null,null,null,"IF EXISTS(SELECT TOP 1 * FROM [AuditEvent] WHERE [AuditEventId] = 0x0706) UPDATE [AuditEvent] SET [Key] = 'Stuck Tamper Switch', [Value] = 'Stuck Tamper Switch', [IsAlert] = 0 WHERE [AuditEventId] = 0x0706 ELSE INSERT INTO [AuditEvent] ([AuditEventId], [Key], [Value], [IsAlert]) VALUES (0x0706, 'Stuck Tamper Switch', 'Stuck Tamper Switch', 0)","IF EXISTS(SELECT TOP 1 * FROM [AuditData] WHERE [AuditDataId] = 0 AND [AuditEventId] = 0x0706) UPDATE [AuditData] SET [Key] = '', [Value] = '', [IsAlert] = 0 WHERE [AuditDataId] = 0 AND [AuditEventId] = 0x0706 ELSE INSERT INTO [AuditData] ([AuditDataId], [AuditEventId], [Key], [Value], [IsAlert]) VALUES (0, 0x0706, '', '', 0)"]
[null,"Audit","DB_EXTENDED","Dead Bolt Extended",null,18,0,"0x0707",0,null,null,null,null,"IF EXISTS(SELECT TOP 1 * FROM [AuditEvent] WHERE [AuditEventId] = 0x0707) UPDATE [AuditEvent] SET [Key] = 'Dead Bolt Extended', [Value] = 'Dead Bolt Extended', [IsAlert] = 0 WHERE [AuditEventId] = 0x0707 ELSE INSERT INTO [AuditEvent] ([AuditEventId], [Key], [Value], [IsAlert]) VALUES (0x0707, 'Dead Bolt Extended', 'Dead Bolt Extended', 0)","IF EXISTS(SELECT TOP 1 * FROM [AuditData] WHERE [AuditDataId] = 0 AND [AuditEventId] = 0x0707) UPDATE [AuditData] SET [Key] = '', [Value] = '', [IsAlert] = 0 WHERE [AuditDataId] = 0 AND [AuditEventId] = 0x0707 ELSE INSERT INTO [AuditData] ([AuditDataId], [AuditEventId], [Key], [Value], [IsAlert]) VALUES (0, 0x0707, '', '', 0)"]
[null,"Audit","DB_RETRACTED","Dead Bolt Retracted",null,19,0,"0x0708",0,null,null,null,null,"IF EXISTS(SELECT TOP 1 * FROM [AuditEvent] WHERE [AuditEventId] = 0x0708) UPDATE [AuditEvent] SET [Key] = 'Dead Bolt Retracted', [Value] = 'Dead Bolt Retracted', [IsAlert] = 0 WHERE [AuditEventId] = 0x0708 ELSE INSERT INTO [AuditEvent] ([AuditEventId], [Key], [Value], [IsAlert]) VALUES (0x0708, 'Dead Bolt Retracted', 'Dead Bolt Retracted', 0)","IF EXISTS(SELECT TOP 1 * FROM [AuditData] WHERE [AuditDataId] = 0 AND [AuditEventId] = 0x0708) UPDATE [AuditData] SET [Key] = '', [Value] = '', [IsAlert] = 0 WHERE [AuditDataId] = 0 AND [AuditEventId] = 0x0708 ELSE INSERT INTO [AuditData] ([AuditDataId], [AuditEventId], [Key], [Value], [IsAlert]) VALUES (0, 0x0708, '', '', 0)"]
[null,"Audit","LBM_EXTENDED","Latch Bolt Extended",null,19,0,"0x0709",0,null,null,null,null,"IF EXISTS(SELECT TOP 1 * FROM [AuditEvent] WHERE [AuditEventId] = 0x0709) UPDATE [AuditEvent] SET [Key] = 'Latch Bolt Extended', [Value] = 'Latch Bolt Extended', [IsAlert] = 0 WHERE [AuditEventId] = 0x0709 ELSE INSERT INTO [AuditEvent] ([AuditEventId], [Key], [Value], [IsAlert]) VALUES (0x0709, 'Latch Bolt Extended', 'Latch Bolt Extended', 0)","IF EXISTS(SELECT TOP 1 * FROM [AuditData] WHERE [AuditDataId] = 0 AND [AuditEventId] = 0x0709) UPDATE [AuditData] SET [Key] = '', [Value] = '', [IsAlert] = 0 WHERE [AuditDataId] = 0 AND [AuditEventId] = 0x0709 ELSE INSERT INTO [AuditData] ([AuditDataId], [AuditEventId], [Key], [Value], [IsAlert]) VALUES (0, 0x0709, '', '', 0)"]
[null,"Audit","LBM_RETRACTED","Latch Bolt Retracted",null,20,0,"0x070A",0,null,null,null,null,"IF EXISTS(SELECT TOP 1 * FROM [AuditEvent] WHERE [AuditEventId] = 0x070A) UPDATE [AuditEvent] SET [Key] = 'Latch Bolt Retracted', [Value] = 'Latch Bolt Retracted', [IsAlert] = 0 WHERE [AuditEventId] = 0x070A ELSE INSERT INTO [AuditEvent] ([AuditEventId], [Key], [Value], [IsAlert]) VALUES (0x070A, 'Latch Bolt Retracted', 'Latch Bolt Retracted', 0)","IF EXISTS(SELECT TOP 1 * FROM [AuditData] WHERE [AuditDataId] = 0 AND [AuditEventId] = 0x070A) UPDATE [AuditData] SET [Key] = '', [Value] = '', [IsAlert] = 0 WHERE [AuditDataId] = 0 AND [AuditEventId] = 0x070A ELSE INSERT INTO [AuditData] ([AuditDataId], [AuditEventId], [Key], [Value], [IsAlert]) VALUES (0, 0x070A, '', '', 0)"]
[null,"Both","IPB","Interior Push Button Activated",null,30,0,"0x070B",0,null,null,null,null,"IF EXISTS(SELECT TOP 1 * FROM [AuditEvent] WHERE [AuditEventId] = 0x070B) UPDATE [AuditEvent] SET [Key] = 'Interior Push Button Activated', [Value] = 'Interior Push Button Activated', [IsAlert] = 1 WHERE [AuditEventId] = 0x070B ELSE INSERT INTO [AuditEvent] ([AuditEventId], [Key], [Value], [IsAlert]) VALUES (0x070B, 'Interior Push Button Activated', 'Interior Push Button Activated', 1)","IF EXISTS(SELECT TOP 1 * FROM [AuditData] WHERE [AuditDataId] = 0 AND [AuditEventId] = 0x070B) UPDATE [AuditData] SET [Key] = '', [Value] = '', [IsAlert] = 0 WHERE [AuditDataId] = 0 AND [AuditEventId] = 0x070B ELSE INSERT INTO [AuditData] ([AuditDataId], [AuditEventId], [Key], [Value], [IsAlert]) VALUES (0, 0x070B, '', '', 0)"]
[null,"Audit","MOTOR_FAILURE","Motor Failure","Failed to Transistion State",null,null,"0x070C",0,null,null,null,null,"IF EXISTS(SELECT TOP 1 * FROM [AuditEvent] WHERE [AuditEventId] = 0x070C) UPDATE [AuditEvent] SET [Key] = 'Motor Failure', [Value] = 'Motor Failure', [IsAlert] = 0 WHERE [AuditEventId] = 0x070C ELSE INSERT INTO [AuditEvent] ([AuditEventId], [Key], [Value], [IsAlert]) VALUES (0x070C, 'Motor Failure', 'Motor Failure', 0)","IF EXISTS(SELECT TOP 1 * FROM [AuditData] WHERE [AuditDataId] = 0 AND [AuditEventId] = 0x070C) UPDATE [AuditData] SET [Key] = 'Failed to Transistion State', [Value] = 'Failed to Transistion State', [IsAlert] = 0 WHERE [AuditDataId] = 0 AND [AuditEventId] = 0x070C ELSE INSERT INTO [AuditData] ([AuditDataId], [AuditEventId], [Key], [Value], [IsAlert]) VALUES (0, 0x070C, 'Failed to Transistion State', 'Failed to Transistion State', 0)"]
[null,"Audit","MOTOR_FAILURE","Motor Failure","State mismatch during Unlock",null,null,"0x070C",1,null,null,null,null,"IF EXISTS(SELECT TOP 1 * FROM [AuditEvent] WHERE [AuditEventId] = 0x070C) UPDATE [AuditEvent] SET [Key] = 'Motor Failure', [Value] = 'Motor Failure', [IsAlert] = 0 WHERE [AuditEventId] = 0x070C ELSE INSERT INTO [AuditEvent] ([AuditEventId], [Key], [Value], [IsAlert]) VALUES (0x070C, 'Motor Failure', 'Motor Failure', 0)","IF EXISTS(SELECT TOP 1 * FROM [AuditData] WHERE [AuditDataId] = 1 AND [AuditEventId] = 0x070C) UPDATE [AuditData] SET [Key] = 'State mismatch during Unlock', [Value] = 'State mismatch during Unlock', [IsAlert] = 0 WHERE [AuditDataId] = 1 AND [AuditEventId] = 0x070C ELSE INSERT INTO [AuditData] ([AuditDataId], [AuditEventId], [Key], [Value], [IsAlert]) VALUES (1, 0x070C, 'State mismatch during Unlock', 'State mismatch during Unlock', 0)"]
[null,"Audit","MOTOR_FAILURE","Motor Failure","State mismatch during Relock",null,null,"0x070C",2,null,null,null,null,"IF EXISTS(SELECT TOP 1 * FROM [AuditEvent] WHERE [AuditEventId] = 0x070C) UPDATE [AuditEvent] SET [Key] = 'Motor Failure', [Value] = 'Motor Failure', [IsAlert] = 0 WHERE [AuditEventId] = 0x070C ELSE INSERT INTO [AuditEvent] ([AuditEventId], [Key], [Value], [IsAlert]) VALUES (0x070C, 'Motor Failure', 'Motor Failure', 0)","IF EXISTS(SELECT TOP 1 * FROM [AuditData] WHERE [AuditDataId] = 2 AND [AuditEventId] = 0x070C) UPDATE [AuditData] SET [Key] = 'State mismatch during Relock', [Value] = 'State mismatch during Relock', [IsAlert] = 0 WHERE [AuditDataId] = 2 AND [AuditEventId] = 0x070C ELSE INSERT INTO [AuditData] ([AuditDataId], [AuditEventId], [Key], [Value], [IsAlert]) VALUES (2, 0x070C, 'State mismatch during Relock', 'State mismatch during Relock', 0)"]
[null,"Audit","DOG_ON_NEXT_EXIT_FAILURE","Dogging Latch Failure","Unexpected Undogging",null,null,"0x070D",0,null,null,null,null,"IF EXISTS(SELECT TOP 1 * FROM [AuditEvent] WHERE [AuditEventId] = 0x070D) UPDATE [AuditEvent] SET [Key] = 'Dogging Latch Failure', [Value] = 'Dogging Latch Failure', [IsAlert] = 0 WHERE [AuditEventId] = 0x070D ELSE INSERT INTO [AuditEvent] ([AuditEventId], [Key], [Value], [IsAlert]) VALUES (0x070D, 'Dogging Latch Failure', 'Dogging Latch Failure', 0)","IF EXISTS(SELECT TOP 1 * FROM [AuditData] WHERE [AuditDataId] = 0 AND [AuditEventId] = 0x070D) UPDATE [AuditData] SET [Key] = 'Unexpected Undogging', [Value] = 'Unexpected Undogging', [IsAlert] = 0 WHERE [AuditDataId] = 0 AND [AuditEventId] = 0x070D ELSE INSERT INTO [AuditData] ([AuditDataId], [AuditEventId], [Key], [Value], [IsAlert]) VALUES (0, 0x070D, 'Unexpected Undogging', 'Unexpected Undogging', 0)"]
[null,"Audit","DPS_NO_LATCH_EXT","Door Closed, Latch Not Extended","Door Closed, Latch Not Extended",null,null,"0x070E",0,null,null,null,null,"IF EXISTS(SELECT TOP 1 * FROM [AuditEvent] WHERE [AuditEventId] = 0x070E) UPDATE [AuditEvent] SET [Key] = 'Door Closed, Latch Not Extended', [Value] = 'Door Closed, Latch Not Extended', [IsAlert] = 0 WHERE [AuditEventId] = 0x070E ELSE INSERT INTO [AuditEvent] ([AuditEventId], [Key], [Value], [IsAlert]) VALUES (0x070E, 'Door Closed, Latch Not Extended', 'Door Closed, Latch Not Extended', 0)","IF EXISTS(SELECT TOP 1 * FROM [AuditData] WHERE [AuditDataId] = 0 AND [AuditEventId] = 0x070E) UPDATE [AuditData] SET [Key] = 'Door Closed, Latch Not Extended', [Value] = 'Door Closed, Latch Not Extended', [IsAlert] = 0 WHERE [AuditDataId] = 0 AND [AuditEventId] = 0x070E ELSE INSERT INTO [AuditData] ([AuditDataId], [AuditEventId], [Key], [Value], [IsAlert]) VALUES (0, 0x070E, 'Door Closed, Latch Not Extended', 'Door Closed, Latch Not Extended', 0)"]
[null,"Audit","TEMP_SENSOR","Temp Sensor Raw Value",null,null,null,"0x070F","xxxx",null,"ADC Counts",null,null,"IF EXISTS(SELECT TOP 1 * FROM [AuditEvent] WHERE [AuditEventId] = 0x070F) UPDATE [AuditEvent] SET [Key] = 'Temp Sensor Raw Value', [Value] = 'Temp Sensor Raw Value', [IsAlert] = 0 WHERE [AuditEventId] = 0x070F ELSE INSERT INTO [AuditEvent] ([AuditEventId], [Key], [Value], [IsAlert]) VALUES (0x070F, 'Temp Sensor Raw Value', 'Temp Sensor Raw Value', 0)","-- no value"]
[null,"Audit","LIGHT_SENSOR","Light Sensor Raw Value",null,null,null,"0x0710","xxxx",null,"ADC Counts",null,null,"IF EXISTS(SELECT TOP 1 * FROM [AuditEvent] WHERE [AuditEventId] = 0x0710) UPDATE [AuditEvent] SET [Key] = 'Light Sensor Raw Value', [Value] = 'Light Sensor Raw Value', [IsAlert] = 0 WHERE [AuditEventId] = 0x0710 ELSE INSERT INTO [AuditEvent] ([AuditEventId], [Key], [Value], [IsAlert]) VALUES (0x0710, 'Light Sensor Raw Value', 'Light Sensor Raw Value', 0)","-- no value"]
[null,"Audit","RX_LX_FAILURE","LX Not Seen During RX Event","LX Not Seen During RX Event",null,null,"0x0711",0,null,null,null,null,"IF EXISTS(SELECT TOP 1 * FROM [AuditEvent] WHERE [AuditEventId] = 0x0711) UPDATE [AuditEvent] SET [Key] = 'LX Not Seen During RX Event', [Value] = 'LX Not Seen During RX Event', [IsAlert] = 0 WHERE [AuditEventId] = 0x0711 ELSE INSERT INTO [AuditEvent] ([AuditEventId], [Key], [Value], [IsAlert]) VALUES (0x0711, 'LX Not Seen During RX Event', 'LX Not Seen During RX Event', 0)","IF EXISTS(SELECT TOP 1 * FROM [AuditData] WHERE [AuditDataId] = 0 AND [AuditEventId] = 0x0711) UPDATE [AuditData] SET [Key] = 'LX Not Seen During RX Event', [Value] = 'LX Not Seen During RX Event', [IsAlert] = 0 WHERE [AuditDataId] = 0 AND [AuditEventId] = 0x0711 ELSE INSERT INTO [AuditData] ([AuditDataId], [AuditEventId], [Key], [Value], [IsAlert]) VALUES (0, 0x0711, 'LX Not Seen During RX Event', 'LX Not Seen During RX Event', 0)"]
[null,"Audit","REL","Remote Release Triggered",null,null,null,"0x0712",0,null,null,null,null,"IF EXISTS(SELECT TOP 1 * FROM [AuditEvent] WHERE [AuditEventId] = 0x0712) UPDATE [AuditEvent] SET [Key] = 'Remote Release Triggered', [Value] = 'Remote Release Triggered', [IsAlert] = 0 WHERE [AuditEventId] = 0x0712 ELSE INSERT INTO [AuditEvent] ([AuditEventId], [Key], [Value], [IsAlert]) VALUES (0x0712, 'Remote Release Triggered', 'Remote Release Triggered', 0)","IF EXISTS(SELECT TOP 1 * FROM [AuditData] WHERE [AuditDataId] = 0 AND [AuditEventId] = 0x0712) UPDATE [AuditData] SET [Key] = '', [Value] = '', [IsAlert] = 0 WHERE [AuditDataId] = 0 AND [AuditEventId] = 0x0712 ELSE INSERT INTO [AuditData] ([AuditDataId], [AuditEventId], [Key], [Value], [IsAlert]) VALUES (0, 0x0712, '', '', 0)"]
[null,"Both","RDR_TAMPER","Reader Tamper Alert",null,null,null,"0x0713",0,null,null,null,null,"IF EXISTS(SELECT TOP 1 * FROM [AuditEvent] WHERE [AuditEventId] = 0x0713) UPDATE [AuditEvent] SET [Key] = 'Reader Tamper Alert', [Value] = 'Reader Tamper Alert', [IsAlert] = 1 WHERE [AuditEventId] = 0x0713 ELSE INSERT INTO [AuditEvent] ([AuditEventId], [Key], [Value], [IsAlert]) VALUES (0x0713, 'Reader Tamper Alert', 'Reader Tamper Alert', 1)","IF EXISTS(SELECT TOP 1 * FROM [AuditData] WHERE [AuditDataId] = 0 AND [AuditEventId] = 0x0713) UPDATE [AuditData] SET [Key] = '', [Value] = '', [IsAlert] = 0 WHERE [AuditDataId] = 0 AND [AuditEventId] = 0x0713 ELSE INSERT INTO [AuditData] ([AuditDataId], [AuditEventId], [Key], [Value], [IsAlert]) VALUES (0, 0x0713, '', '', 0)"]
[null,"Audit","AUX_ENABLED","Auxiliary Enabled",null,null,null,"0x0714",0,null,null,null,null,"IF EXISTS(SELECT TOP 1 * FROM [AuditEvent] WHERE [AuditEventId] = 0x0714) UPDATE [AuditEvent] SET [Key] = 'Auxiliary Enabled', [Value] = 'Auxiliary Enabled', [IsAlert] = 0 WHERE [AuditEventId] = 0x0714 ELSE INSERT INTO [AuditEvent] ([AuditEventId], [Key], [Value], [IsAlert]) VALUES (0x0714, 'Auxiliary Enabled', 'Auxiliary Enabled', 0)","IF EXISTS(SELECT TOP 1 * FROM [AuditData] WHERE [AuditDataId] = 0 AND [AuditEventId] = 0x0714) UPDATE [AuditData] SET [Key] = '', [Value] = '', [IsAlert] = 0 WHERE [AuditDataId] = 0 AND [AuditEventId] = 0x0714 ELSE INSERT INTO [AuditData] ([AuditDataId], [AuditEventId], [Key], [Value], [IsAlert]) VALUES (0, 0x0714, '', '', 0)"]
[null,"Audit","AUX_DISABLED","Auxiliary Disabled",null,null,null,"0x0715",0,null,null,null,null,"IF EXISTS(SELECT TOP 1 * FROM [AuditEvent] WHERE [AuditEventId] = 0x0715) UPDATE [AuditEvent] SET [Key] = 'Auxiliary Disabled', [Value] = 'Auxiliary Disabled', [IsAlert] = 0 WHERE [AuditEventId] = 0x0715 ELSE INSERT INTO [AuditEvent] ([AuditEventId], [Key], [Value], [IsAlert]) VALUES (0x0715, 'Auxiliary Disabled', 'Auxiliary Disabled', 0)","IF EXISTS(SELECT TOP 1 * FROM [AuditData] WHERE [AuditDataId] = 0 AND [AuditEventId] = 0x0715) UPDATE [AuditData] SET [Key] = '', [Value] = '', [IsAlert] = 0 WHERE [AuditDataId] = 0 AND [AuditEventId] = 0x0715 ELSE INSERT INTO [AuditData] ([AuditDataId], [AuditEventId], [Key], [Value], [IsAlert]) VALUES (0, 0x0715, '', '', 0)"]
[null,"Audit","ALARM_ENABLED","Alarm Enabled",null,null,null,"0x0716",0,null,null,null,null,"IF EXISTS(SELECT TOP 1 * FROM [AuditEvent] WHERE [AuditEventId] = 0x0716) UPDATE [AuditEvent] SET [Key] = 'Alarm Enabled', [Value] = 'Alarm Enabled', [IsAlert] = 0 WHERE [AuditEventId] = 0x0716 ELSE INSERT INTO [AuditEvent] ([AuditEventId], [Key], [Value], [IsAlert]) VALUES (0x0716, 'Alarm Enabled', 'Alarm Enabled', 0)","IF EXISTS(SELECT TOP 1 * FROM [AuditData] WHERE [AuditDataId] = 0 AND [AuditEventId] = 0x0716) UPDATE [AuditData] SET [Key] = '', [Value] = '', [IsAlert] = 0 WHERE [AuditDataId] = 0 AND [AuditEventId] = 0x0716 ELSE INSERT INTO [AuditData] ([AuditDataId], [AuditEventId], [Key], [Value], [IsAlert]) VALUES (0, 0x0716, '', '', 0)"]
[null,"Audit","ALARM_DISABLED","Alarm Disabled",null,null,null,"0x0717",0,null,null,null,null,"IF EXISTS(SELECT TOP 1 * FROM [AuditEvent] WHERE [AuditEventId] = 0x0717) UPDATE [AuditEvent] SET [Key] = 'Alarm Disabled', [Value] = 'Alarm Disabled', [IsAlert] = 0 WHERE [AuditEventId] = 0x0717 ELSE INSERT INTO [AuditEvent] ([AuditEventId], [Key], [Value], [IsAlert]) VALUES (0x0717, 'Alarm Disabled', 'Alarm Disabled', 0)","IF EXISTS(SELECT TOP 1 * FROM [AuditData] WHERE [AuditDataId] = 0 AND [AuditEventId] = 0x0717) UPDATE [AuditData] SET [Key] = '', [Value] = '', [IsAlert] = 0 WHERE [AuditDataId] = 0 AND [AuditEventId] = 0x0717 ELSE INSERT INTO [AuditData] ([AuditDataId], [AuditEventId], [Key], [Value], [IsAlert]) VALUES (0, 0x0717, '', '', 0)"]
[null,"Audit","REN","Request to Enter",null,null,null,"0x0718",0,null,null,null,null,"IF EXISTS(SELECT TOP 1 * FROM [AuditEvent] WHERE [AuditEventId] = 0x0718) UPDATE [AuditEvent] SET [Key] = 'Request to Enter', [Value] = 'Request to Enter', [IsAlert] = 0 WHERE [AuditEventId] = 0x0718 ELSE INSERT INTO [AuditEvent] ([AuditEventId], [Key], [Value], [IsAlert]) VALUES (0x0718, 'Request to Enter', 'Request to Enter', 0)","IF EXISTS(SELECT TOP 1 * FROM [AuditData] WHERE [AuditDataId] = 0 AND [AuditEventId] = 0x0718) UPDATE [AuditData] SET [Key] = '', [Value] = '', [IsAlert] = 0 WHERE [AuditDataId] = 0 AND [AuditEventId] = 0x0718 ELSE INSERT INTO [AuditData] ([AuditDataId], [AuditEventId], [Key], [Value], [IsAlert]) VALUES (0, 0x0718, '', '', 0)"]
[null,"Both","IPB_STUCK","IPB Stuck Cleared",null,null,null,"0x0719",0,null,null,null,null,"IF EXISTS(SELECT TOP 1 * FROM [AuditEvent] WHERE [AuditEventId] = 0x0719) UPDATE [AuditEvent] SET [Key] = 'IPB Stuck Cleared', [Value] = 'IPB Stuck Cleared', [IsAlert] = 1 WHERE [AuditEventId] = 0x0719 ELSE INSERT INTO [AuditEvent] ([AuditEventId], [Key], [Value], [IsAlert]) VALUES (0x0719, 'IPB Stuck Cleared', 'IPB Stuck Cleared', 1)","IF EXISTS(SELECT TOP 1 * FROM [AuditData] WHERE [AuditDataId] = 0 AND [AuditEventId] = 0x0719) UPDATE [AuditData] SET [Key] = '', [Value] = '', [IsAlert] = 0 WHERE [AuditDataId] = 0 AND [AuditEventId] = 0x0719 ELSE INSERT INTO [AuditData] ([AuditDataId], [AuditEventId], [Key], [Value], [IsAlert]) VALUES (0, 0x0719, '', '', 0)"]
[null,"Both","IPB_STUCK","IPB Stuck Set",null,null,null,"0x0719",1,null,null,null,null,"IF EXISTS(SELECT TOP 1 * FROM [AuditEvent] WHERE [AuditEventId] = 0x0719) UPDATE [AuditEvent] SET [Key] = 'IPB Stuck Set', [Value] = 'IPB Stuck Set', [IsAlert] = 1 WHERE [AuditEventId] = 0x0719 ELSE INSERT INTO [AuditEvent] ([AuditEventId], [Key], [Value], [IsAlert]) VALUES (0x0719, 'IPB Stuck Set', 'IPB Stuck Set', 1)","IF EXISTS(SELECT TOP 1 * FROM [AuditData] WHERE [AuditDataId] = 1 AND [AuditEventId] = 0x0719) UPDATE [AuditData] SET [Key] = '', [Value] = '', [IsAlert] = 0 WHERE [AuditDataId] = 1 AND [AuditEventId] = 0x0719 ELSE INSERT INTO [AuditData] ([AuditDataId], [AuditEventId], [Key], [Value], [IsAlert]) VALUES (1, 0x0719, '', '', 0)"]
[null,"Audit","AUX_IN","Aux Input Triggered",null,null,null,"0x071A",null,null,null,null,null,"IF EXISTS(SELECT TOP 1 * FROM [AuditEvent] WHERE [AuditEventId] = 0x071A) UPDATE [AuditEvent] SET [Key] = 'Aux Input Triggered', [Value] = 'Aux Input Triggered', [IsAlert] = 0 WHERE [AuditEventId] = 0x071A ELSE INSERT INTO [AuditEvent] ([AuditEventId], [Key], [Value], [IsAlert]) VALUES (0x071A, 'Aux Input Triggered', 'Aux Input Triggered', 0)","IF EXISTS(SELECT TOP 1 * FROM [AuditData] WHERE [AuditDataId] = 0 AND [AuditEventId] = 0x071A) UPDATE [AuditData] SET [Key] = '', [Value] = '', [IsAlert] = 0 WHERE [AuditDataId] = 0 AND [AuditEventId] = 0x071A ELSE INSERT INTO [AuditData] ([AuditDataId], [AuditEventId], [Key], [Value], [IsAlert]) VALUES (0, 0x071A, '', '', 0)"]
[null,"Audit","TAMPER_CLEARED","Tamper Condition Cleared",null,null,null,"0x071B",null,null,null,null,null,"IF EXISTS(SELECT TOP 1 * FROM [AuditEvent] WHERE [AuditEventId] = 0x071B) UPDATE [AuditEvent] SET [Key] = 'Tamper Condition Cleared', [Value] = 'Tamper Condition Cleared', [IsAlert] = 0 WHERE [AuditEventId] = 0x071B ELSE INSERT INTO [AuditEvent] ([AuditEventId], [Key], [Value], [IsAlert]) VALUES (0x071B, 'Tamper Condition Cleared', 'Tamper Condition Cleared', 0)","IF EXISTS(SELECT TOP 1 * FROM [AuditData] WHERE [AuditDataId] = 0 AND [AuditEventId] = 0x071B) UPDATE [AuditData] SET [Key] = '', [Value] = '', [IsAlert] = 0 WHERE [AuditDataId] = 0 AND [AuditEventId] = 0x071B ELSE INSERT INTO [AuditData] ([AuditDataId], [AuditEventId], [Key], [Value], [IsAlert]) VALUES (0, 0x071B, '', '', 0)"]
[null,"Audit","TTL1_ACTIVE","TTL1 Active",null,null,null,"0x071C",null,null,null,null,null,"IF EXISTS(SELECT TOP 1 * FROM [AuditEvent] WHERE [AuditEventId] = 0x071C) UPDATE [AuditEvent] SET [Key] = 'TTL1 Active', [Value] = 'TTL1 Active', [IsAlert] = 0 WHERE [AuditEventId] = 0x071C ELSE INSERT INTO [AuditEvent] ([AuditEventId], [Key], [Value], [IsAlert]) VALUES (0x071C, 'TTL1 Active', 'TTL1 Active', 0)","IF EXISTS(SELECT TOP 1 * FROM [AuditData] WHERE [AuditDataId] = 0 AND [AuditEventId] = 0x071C) UPDATE [AuditData] SET [Key] = '', [Value] = '', [IsAlert] = 0 WHERE [AuditDataId] = 0 AND [AuditEventId] = 0x071C ELSE INSERT INTO [AuditData] ([AuditDataId], [AuditEventId], [Key], [Value], [IsAlert]) VALUES (0, 0x071C, '', '', 0)"]
[null,"Audit","TTL1_INACTIVE","TTL1 Inactive",null,null,null,"0x071D",null,null,null,null,null,"IF EXISTS(SELECT TOP 1 * FROM [AuditEvent] WHERE [AuditEventId] = 0x071D) UPDATE [AuditEvent] SET [Key] = 'TTL1 Inactive', [Value] = 'TTL1 Inactive', [IsAlert] = 0 WHERE [AuditEventId] = 0x071D ELSE INSERT INTO [AuditEvent] ([AuditEventId], [Key], [Value], [IsAlert]) VALUES (0x071D, 'TTL1 Inactive', 'TTL1 Inactive', 0)","IF EXISTS(SELECT TOP 1 * FROM [AuditData] WHERE [AuditDataId] = 0 AND [AuditEventId] = 0x071D) UPDATE [AuditData] SET [Key] = '', [Value] = '', [IsAlert] = 0 WHERE [AuditDataId] = 0 AND [AuditEventId] = 0x071D ELSE INSERT INTO [AuditData] ([AuditDataId], [AuditEventId], [Key], [Value], [IsAlert]) VALUES (0, 0x071D, '', '', 0)"]
[null,"Audit","TTL2_ACTIVE","TTL2 Active",null,null,null,"0x071E",null,null,null,null,null,"IF EXISTS(SELECT TOP 1 * FROM [AuditEvent] WHERE [AuditEventId] = 0x071E) UPDATE [AuditEvent] SET [Key] = 'TTL2 Active', [Value] = 'TTL2 Active', [IsAlert] = 0 WHERE [AuditEventId] = 0x071E ELSE INSERT INTO [AuditEvent] ([AuditEventId], [Key], [Value], [IsAlert]) VALUES (0x071E, 'TTL2 Active', 'TTL2 Active', 0)","IF EXISTS(SELECT TOP 1 * FROM [AuditData] WHERE [AuditDataId] = 0 AND [AuditEventId] = 0x071E) UPDATE [AuditData] SET [Key] = '', [Value] = '', [IsAlert] = 0 WHERE [AuditDataId] = 0 AND [AuditEventId] = 0x071E ELSE INSERT INTO [AuditData] ([AuditDataId], [AuditEventId], [Key], [Value], [IsAlert]) VALUES (0, 0x071E, '', '', 0)"]
[null,"Audit","TTL2_INACTIVE","TTL2 Inactive",null,null,null,"0x071F",null,null,null,null,null,{"$f":"IF(LEFT(H189,2)=\"0x\",CONCATENATE(\"IF EXISTS(SELECT TOP 1 * FROM [AuditEvent] WHERE [AuditEventId] = \",H189,\") UPDATE [AuditEvent] SET [Key] = '\",TRIM(D189),\"', [Value] = '\",TRIM(D189),\"', [IsAlert] = \",IF(B189=\"Audit\",0,1),\" WHERE [AuditEventId] = \",H189,\" ELSE INSERT INTO [AuditEvent] ([AuditEventId], [Key], [Value], [IsAlert]) VALUES (\",H189,\", '\",TRIM(D189),\"', '\",TRIM(D189),\"', \",IF(B189=\"Audit\",0,1), \")\"),\"-- no value\")","v":"IF EXISTS(SELECT TOP 1 * FROM [AuditEvent] WHERE [AuditEventId] = 0x071F) UPDATE [AuditEvent] SET [Key] = 'TTL2 Inactive', [Value] = 'TTL2 Inactive', [IsAlert] = 0 WHERE [AuditEventId] = 0x071F ELSE INSERT INTO [AuditEvent] ([AuditEventId], [Key], [Value], [IsAlert]) VALUES (0x071F, 'TTL2 Inactive', 'TTL2 Inactive', 0)"},{"$f":"IF(AND(LEFT(H189,2)=\"0x\",ISNUMBER(HEX2DEC(TRIM(I189))*1)),CONCATENATE(\"IF EXISTS(SELECT TOP 1 * FROM [AuditData] WHERE [AuditDataId] = \",HEX2DEC(I189),\" AND [AuditEventId] = \",H189,\") UPDATE [AuditData] SET [Key] = '\",E189,\"', [Value] = '\",E189,\"', [IsAlert] = 0 WHERE [AuditDataId] = \",HEX2DEC(I189),\" AND [AuditEventId] = \",H189,\" ELSE INSERT INTO [AuditData] ([AuditDataId], [AuditEventId], [Key], [Value], [IsAlert]) VALUES (\",HEX2DEC(I189),\", \",H189,\", '\",E189,\"', '\",E189,\"', 0)\"),\"-- no value\")","v":"IF EXISTS(SELECT TOP 1 * FROM [AuditData] WHERE [AuditDataId] = 0 AND [AuditEventId] = 0x071F) UPDATE [AuditData] SET [Key] = '', [Value] = '', [IsAlert] = 0 WHERE [AuditDataId] = 0 AND [AuditEventId] = 0x071F ELSE INSERT INTO [AuditData] ([AuditDataId], [AuditEventId], [Key], [Value], [IsAlert]) VALUES (0, 0x071F, '', '', 0)"}]
[null,"Audit","KEYPAD_LOCKOUT","Keypad Lockout","Too many failed attempts",null,null,"0x0720",null,null,null,null,null,"IF EXISTS(SELECT TOP 1 * FROM [AuditEvent] WHERE [AuditEventId] = 0x0720) UPDATE [AuditEvent] SET [Key] = 'Keypad Lockout', [Value] = 'Keypad Lockout', [IsAlert] = 0 WHERE [AuditEventId] = 0x0720 ELSE INSERT INTO [AuditEvent] ([AuditEventId], [Key], [Value], [IsAlert]) VALUES (0x0720, 'Keypad Lockout', 'Keypad Lockout', 0)","IF EXISTS(SELECT TOP 1 * FROM [AuditData] WHERE [AuditDataId] = 0 AND [AuditEventId] = 0x0720) UPDATE [AuditData] SET [Key] = 'Too many failed attempts', [Value] = 'Too many failed attempts', [IsAlert] = 0 WHERE [AuditDataId] = 0 AND [AuditEventId] = 0x0720 ELSE INSERT INTO [AuditData] ([AuditDataId], [AuditEventId], [Key], [Value], [IsAlert]) VALUES (0, 0x0720, 'Too many failed attempts', 'Too many failed attempts', 0)"]
[null,"Audit","DOOR_OPEN","Door Open",null,null,null,"0x0721",null,null,null,null,null,"IF EXISTS(SELECT TOP 1 * FROM [AuditEvent] WHERE [AuditEventId] = 0x0721) UPDATE [AuditEvent] SET [Key] = 'Door Open', [Value] = 'Door Open', [IsAlert] = 0 WHERE [AuditEventId] = 0x0721 ELSE INSERT INTO [AuditEvent] ([AuditEventId], [Key], [Value], [IsAlert]) VALUES (0x0721, 'Door Open', 'Door Open', 0)","IF EXISTS(SELECT TOP 1 * FROM [AuditData] WHERE [AuditDataId] = 0 AND [AuditEventId] = 0x0721) UPDATE [AuditData] SET [Key] = '', [Value] = '', [IsAlert] = 0 WHERE [AuditDataId] = 0 AND [AuditEventId] = 0x0721 ELSE INSERT INTO [AuditData] ([AuditDataId], [AuditEventId], [Key], [Value], [IsAlert]) VALUES (0, 0x0721, '', '', 0)"]
[null,"Audit","DOOR_CLOSED","Door Closed",null,null,null,"0x0722",null,null,null,null,null,"IF EXISTS(SELECT TOP 1 * FROM [AuditEvent] WHERE [AuditEventId] = 0x0722) UPDATE [AuditEvent] SET [Key] = 'Door Closed', [Value] = 'Door Closed', [IsAlert] = 0 WHERE [AuditEventId] = 0x0722 ELSE INSERT INTO [AuditEvent] ([AuditEventId], [Key], [Value], [IsAlert]) VALUES (0x0722, 'Door Closed', 'Door Closed', 0)","IF EXISTS(SELECT TOP 1 * FROM [AuditData] WHERE [AuditDataId] = 0 AND [AuditEventId] = 0x0722) UPDATE [AuditData] SET [Key] = '', [Value] = '', [IsAlert] = 0 WHERE [AuditDataId] = 0 AND [AuditEventId] = 0x0722 ELSE INSERT INTO [AuditData] ([AuditDataId], [AuditEventId], [Key], [Value], [IsAlert]) VALUES (0, 0x0722, '', '', 0)"]
[null,"Audit","MECHANICAL_OVERRIDE","Mechanical Override","Unlock",null,null,"0x0723",1,null,null,null,null,"IF EXISTS(SELECT TOP 1 * FROM [AuditEvent] WHERE [AuditEventId] = 0x0723) UPDATE [AuditEvent] SET [Key] = 'Mechanical Override', [Value] = 'Mechanical Override', [IsAlert] = 0 WHERE [AuditEventId] = 0x0723 ELSE INSERT INTO [AuditEvent] ([AuditEventId], [Key], [Value], [IsAlert]) VALUES (0x0723, 'Mechanical Override', 'Mechanical Override', 0)","IF EXISTS(SELECT TOP 1 * FROM [AuditData] WHERE [AuditDataId] = 1 AND [AuditEventId] = 0x0723) UPDATE [AuditData] SET [Key] = 'Unlock', [Value] = 'Unlock', [IsAlert] = 0 WHERE [AuditDataId] = 1 AND [AuditEventId] = 0x0723 ELSE INSERT INTO [AuditData] ([AuditDataId], [AuditEventId], [Key], [Value], [IsAlert]) VALUES (1, 0x0723, 'Unlock', 'Unlock', 0)"]
[null,"Audit","MECHANICAL_OVERRIDE","Mechanical Override","Lock",null,null,"0x0723",2,null,null,null,null,"IF EXISTS(SELECT TOP 1 * FROM [AuditEvent] WHERE [AuditEventId] = 0x0723) UPDATE [AuditEvent] SET [Key] = 'Mechanical Override', [Value] = 'Mechanical Override', [IsAlert] = 0 WHERE [AuditEventId] = 0x0723 ELSE INSERT INTO [AuditEvent] ([AuditEventId], [Key], [Value], [IsAlert]) VALUES (0x0723, 'Mechanical Override', 'Mechanical Override', 0)","IF EXISTS(SELECT TOP 1 * FROM [AuditData] WHERE [AuditDataId] = 2 AND [AuditEventId] = 0x0723) UPDATE [AuditData] SET [Key] = 'Lock', [Value] = 'Lock', [IsAlert] = 0 WHERE [AuditDataId] = 2 AND [AuditEventId] = 0x0723 ELSE INSERT INTO [AuditData] ([AuditDataId], [AuditEventId], [Key], [Value], [IsAlert]) VALUES (2, 0x0723, 'Lock', 'Lock', 0)"]
["Firmware Update Audits",null,null,null,null,{"$f":"LEN(D195)","v":0},{"$f":"LEN(E195)","v":0},null,null,null,null,null,null,"-- no value","-- no value"]
["Base Value",null,null,null,null,{"$f":"LEN(D196)","v":0},{"$f":"LEN(E196)","v":0},null,null,null,null,null,null,"-- no value","-- no value"]
["0x0800","Audit","LOCK_PROGRAMMED  ","Lock Programmed","Main Application Success",null,null,"0x0800","0100",null,null,null,null,"IF EXISTS(SELECT TOP 1 * FROM [AuditEvent] WHERE [AuditEventId] = 0x0800) UPDATE [AuditEvent] SET [Key] = 'Lock Programmed', [Value] = 'Lock Programmed', [IsAlert] = 0 WHERE [AuditEventId] = 0x0800 ELSE INSERT INTO [AuditEvent] ([AuditEventId], [Key], [Value], [IsAlert]) VALUES (0x0800, 'Lock Programmed', 'Lock Programmed', 0)","IF EXISTS(SELECT TOP 1 * FROM [AuditData] WHERE [AuditDataId] = 256 AND [AuditEventId] = 0x0800) UPDATE [AuditData] SET [Key] = 'Main Application Success', [Value] = 'Main Application Success', [IsAlert] = 0 WHERE [AuditDataId] = 256 AND [AuditEventId] = 0x0800 ELSE INSERT INTO [AuditData] ([AuditDataId], [AuditEventId], [Key], [Value], [IsAlert]) VALUES (256, 0x0800, 'Main Application Success', 'Main Application Success', 0)"]
[null,"Audit","LOCK_PROGRAMMED  ","Lock Programmed","Bluetooth Module Success",null,null,"0x0800","0200",null,null,null,null,"IF EXISTS(SELECT TOP 1 * FROM [AuditEvent] WHERE [AuditEventId] = 0x0800) UPDATE [AuditEvent] SET [Key] = 'Lock Programmed', [Value] = 'Lock Programmed', [IsAlert] = 0 WHERE [AuditEventId] = 0x0800 ELSE INSERT INTO [AuditEvent] ([AuditEventId], [Key], [Value], [IsAlert]) VALUES (0x0800, 'Lock Programmed', 'Lock Programmed', 0)","IF EXISTS(SELECT TOP 1 * FROM [AuditData] WHERE [AuditDataId] = 512 AND [AuditEventId] = 0x0800) UPDATE [AuditData] SET [Key] = 'Bluetooth Module Success', [Value] = 'Bluetooth Module Success', [IsAlert] = 0 WHERE [AuditDataId] = 512 AND [AuditEventId] = 0x0800 ELSE INSERT INTO [AuditData] ([AuditDataId], [AuditEventId], [Key], [Value], [IsAlert]) VALUES (512, 0x0800, 'Bluetooth Module Success', 'Bluetooth Module Success', 0)"]
[null,"Audit","LOCK_PROGRAMMED  ","Lock Programmed","WIFI Module Success",null,null,"0x0800","0300",null,null,null,null,"IF EXISTS(SELECT TOP 1 * FROM [AuditEvent] WHERE [AuditEventId] = 0x0800) UPDATE [AuditEvent] SET [Key] = 'Lock Programmed', [Value] = 'Lock Programmed', [IsAlert] = 0 WHERE [AuditEventId] = 0x0800 ELSE INSERT INTO [AuditEvent] ([AuditEventId], [Key], [Value], [IsAlert]) VALUES (0x0800, 'Lock Programmed', 'Lock Programmed', 0)","IF EXISTS(SELECT TOP 1 * FROM [AuditData] WHERE [AuditDataId] = 768 AND [AuditEventId] = 0x0800) UPDATE [AuditData] SET [Key] = 'WIFI Module Success', [Value] = 'WIFI Module Success', [IsAlert] = 0 WHERE [AuditDataId] = 768 AND [AuditEventId] = 0x0800 ELSE INSERT INTO [AuditData] ([AuditDataId], [AuditEventId], [Key], [Value], [IsAlert]) VALUES (768, 0x0800, 'WIFI Module Success', 'WIFI Module Success', 0)"]
[null,"Audit","LOCK_PROGRAMMED  ","Lock Programmed","Reader Module Success",null,null,"0x0800","0400",null,null,null,null,"IF EXISTS(SELECT TOP 1 * FROM [AuditEvent] WHERE [AuditEventId] = 0x0800) UPDATE [AuditEvent] SET [Key] = 'Lock Programmed', [Value] = 'Lock Programmed', [IsAlert] = 0 WHERE [AuditEventId] = 0x0800 ELSE INSERT INTO [AuditEvent] ([AuditEventId], [Key], [Value], [IsAlert]) VALUES (0x0800, 'Lock Programmed', 'Lock Programmed', 0)","IF EXISTS(SELECT TOP 1 * FROM [AuditData] WHERE [AuditDataId] = 1024 AND [AuditEventId] = 0x0800) UPDATE [AuditData] SET [Key] = 'Reader Module Success', [Value] = 'Reader Module Success', [IsAlert] = 0 WHERE [AuditDataId] = 1024 AND [AuditEventId] = 0x0800 ELSE INSERT INTO [AuditData] ([AuditDataId], [AuditEventId], [Key], [Value], [IsAlert]) VALUES (1024, 0x0800, 'Reader Module Success', 'Reader Module Success', 0)"]
[null,"Audit","LOCK_PROGRAMMED  ","Lock Programmed","Ethernet Module Success",null,null,"0x0800","0500",null,null,null,null,"IF EXISTS(SELECT TOP 1 * FROM [AuditEvent] WHERE [AuditEventId] = 0x0800) UPDATE [AuditEvent] SET [Key] = 'Lock Programmed', [Value] = 'Lock Programmed', [IsAlert] = 0 WHERE [AuditEventId] = 0x0800 ELSE INSERT INTO [AuditEvent] ([AuditEventId], [Key], [Value], [IsAlert]) VALUES (0x0800, 'Lock Programmed', 'Lock Programmed', 0)","IF EXISTS(SELECT TOP 1 * FROM [AuditData] WHERE [AuditDataId] = 1280 AND [AuditEventId] = 0x0800) UPDATE [AuditData] SET [Key] = 'Ethernet Module Success', [Value] = 'Ethernet Module Success', [IsAlert] = 0 WHERE [AuditDataId] = 1280 AND [AuditEventId] = 0x0800 ELSE INSERT INTO [AuditData] ([AuditDataId], [AuditEventId], [Key], [Value], [IsAlert]) VALUES (1280, 0x0800, 'Ethernet Module Success', 'Ethernet Module Success', 0)"]
[null,"Audit","LOCK_PROGRAMMED  ","Lock Programmed","Reader Main Module Success",null,null,"0x0800","0600",null,null,null,null,"IF EXISTS(SELECT TOP 1 * FROM [AuditEvent] WHERE [AuditEventId] = 0x0800) UPDATE [AuditEvent] SET [Key] = 'Lock Programmed', [Value] = 'Lock Programmed', [IsAlert] = 0 WHERE [AuditEventId] = 0x0800 ELSE INSERT INTO [AuditEvent] ([AuditEventId], [Key], [Value], [IsAlert]) VALUES (0x0800, 'Lock Programmed', 'Lock Programmed', 0)","IF EXISTS(SELECT TOP 1 * FROM [AuditData] WHERE [AuditDataId] = 1536 AND [AuditEventId] = 0x0800) UPDATE [AuditData] SET [Key] = 'Reader Main Module Success', [Value] = 'Reader Main Module Success', [IsAlert] = 0 WHERE [AuditDataId] = 1536 AND [AuditEventId] = 0x0800 ELSE INSERT INTO [AuditData] ([AuditDataId], [AuditEventId], [Key], [Value], [IsAlert]) VALUES (1536, 0x0800, 'Reader Main Module Success', 'Reader Main Module Success', 0)"]
[null,"Audit","LOCK_PROGRAMMED  ","Lock Programmed","Main Application Error",null,null,"0x0800","01FF",null,null,null,null,"IF EXISTS(SELECT TOP 1 * FROM [AuditEvent] WHERE [AuditEventId] = 0x0800) UPDATE [AuditEvent] SET [Key] = 'Lock Programmed', [Value] = 'Lock Programmed', [IsAlert] = 0 WHERE [AuditEventId] = 0x0800 ELSE INSERT INTO [AuditEvent] ([AuditEventId], [Key], [Value], [IsAlert]) VALUES (0x0800, 'Lock Programmed', 'Lock Programmed', 0)","IF EXISTS(SELECT TOP 1 * FROM [AuditData] WHERE [AuditDataId] = 511 AND [AuditEventId] = 0x0800) UPDATE [AuditData] SET [Key] = 'Main Application Error', [Value] = 'Main Application Error', [IsAlert] = 0 WHERE [AuditDataId] = 511 AND [AuditEventId] = 0x0800 ELSE INSERT INTO [AuditData] ([AuditDataId], [AuditEventId], [Key], [Value], [IsAlert]) VALUES (511, 0x0800, 'Main Application Error', 'Main Application Error', 0)"]
[null,"Audit","LOCK_PROGRAMMED  ","Lock Programmed","Bluetooth Module Error",null,null,"0x0800","02FF",null,null,null,null,"IF EXISTS(SELECT TOP 1 * FROM [AuditEvent] WHERE [AuditEventId] = 0x0800) UPDATE [AuditEvent] SET [Key] = 'Lock Programmed', [Value] = 'Lock Programmed', [IsAlert] = 0 WHERE [AuditEventId] = 0x0800 ELSE INSERT INTO [AuditEvent] ([AuditEventId], [Key], [Value], [IsAlert]) VALUES (0x0800, 'Lock Programmed', 'Lock Programmed', 0)","IF EXISTS(SELECT TOP 1 * FROM [AuditData] WHERE [AuditDataId] = 767 AND [AuditEventId] = 0x0800) UPDATE [AuditData] SET [Key] = 'Bluetooth Module Error', [Value] = 'Bluetooth Module Error', [IsAlert] = 0 WHERE [AuditDataId] = 767 AND [AuditEventId] = 0x0800 ELSE INSERT INTO [AuditData] ([AuditDataId], [AuditEventId], [Key], [Value], [IsAlert]) VALUES (767, 0x0800, 'Bluetooth Module Error', 'Bluetooth Module Error', 0)"]
[null,"Audit","LOCK_PROGRAMMED  ","Lock Programmed","WIFI Module Error",{"$f":"LEN(D205)","v":15},{"$f":"LEN(E205)","v":17},"0x0800","03FF",null,null,null,null,"IF EXISTS(SELECT TOP 1 * FROM [AuditEvent] WHERE [AuditEventId] = 0x0800) UPDATE [AuditEvent] SET [Key] = 'Lock Programmed', [Value] = 'Lock Programmed', [IsAlert] = 0 WHERE [AuditEventId] = 0x0800 ELSE INSERT INTO [AuditEvent] ([AuditEventId], [Key], [Value], [IsAlert]) VALUES (0x0800, 'Lock Programmed', 'Lock Programmed', 0)","IF EXISTS(SELECT TOP 1 * FROM [AuditData] WHERE [AuditDataId] = 1023 AND [AuditEventId] = 0x0800) UPDATE [AuditData] SET [Key] = 'WIFI Module Error', [Value] = 'WIFI Module Error', [IsAlert] = 0 WHERE [AuditDataId] = 1023 AND [AuditEventId] = 0x0800 ELSE INSERT INTO [AuditData] ([AuditDataId], [AuditEventId], [Key], [Value], [IsAlert]) VALUES (1023, 0x0800, 'WIFI Module Error', 'WIFI Module Error', 0)"]
[null,"Audit","LOCK_PROGRAMMED  ","Lock Programmed","Reader Module Error",null,null,"0x0800","04FF",null,null,null,null,"IF EXISTS(SELECT TOP 1 * FROM [AuditEvent] WHERE [AuditEventId] = 0x0800) UPDATE [AuditEvent] SET [Key] = 'Lock Programmed', [Value] = 'Lock Programmed', [IsAlert] = 0 WHERE [AuditEventId] = 0x0800 ELSE INSERT INTO [AuditEvent] ([AuditEventId], [Key], [Value], [IsAlert]) VALUES (0x0800, 'Lock Programmed', 'Lock Programmed', 0)","IF EXISTS(SELECT TOP 1 * FROM [AuditData] WHERE [AuditDataId] = 1279 AND [AuditEventId] = 0x0800) UPDATE [AuditData] SET [Key] = 'Reader Module Error', [Value] = 'Reader Module Error', [IsAlert] = 0 WHERE [AuditDataId] = 1279 AND [AuditEventId] = 0x0800 ELSE INSERT INTO [AuditData] ([AuditDataId], [AuditEventId], [Key], [Value], [IsAlert]) VALUES (1279, 0x0800, 'Reader Module Error', 'Reader Module Error', 0)"]
[null,"Audit","LOCK_PROGRAMMED  ","Lock Programmed","Ethernet Module Error",null,null,"0x0800","05FF",null,null,null,null,"IF EXISTS(SELECT TOP 1 * FROM [AuditEvent] WHERE [AuditEventId] = 0x0800) UPDATE [AuditEvent] SET [Key] = 'Lock Programmed', [Value] = 'Lock Programmed', [IsAlert] = 0 WHERE [AuditEventId] = 0x0800 ELSE INSERT INTO [AuditEvent] ([AuditEventId], [Key], [Value], [IsAlert]) VALUES (0x0800, 'Lock Programmed', 'Lock Programmed', 0)","IF EXISTS(SELECT TOP 1 * FROM [AuditData] WHERE [AuditDataId] = 1535 AND [AuditEventId] = 0x0800) UPDATE [AuditData] SET [Key] = 'Ethernet Module Error', [Value] = 'Ethernet Module Error', [IsAlert] = 0 WHERE [AuditDataId] = 1535 AND [AuditEventId] = 0x0800 ELSE INSERT INTO [AuditData] ([AuditDataId], [AuditEventId], [Key], [Value], [IsAlert]) VALUES (1535, 0x0800, 'Ethernet Module Error', 'Ethernet Module Error', 0)"]
[null,"Audit","LOCK_PROGRAMMED  ","Lock Programmed","Reader Main Module Error",null,null,"0x0800","06FF",null,null,null,null,"IF EXISTS(SELECT TOP 1 * FROM [AuditEvent] WHERE [AuditEventId] = 0x0800) UPDATE [AuditEvent] SET [Key] = 'Lock Programmed', [Value] = 'Lock Programmed', [IsAlert] = 0 WHERE [AuditEventId] = 0x0800 ELSE INSERT INTO [AuditEvent] ([AuditEventId], [Key], [Value], [IsAlert]) VALUES (0x0800, 'Lock Programmed', 'Lock Programmed', 0)","IF EXISTS(SELECT TOP 1 * FROM [AuditData] WHERE [AuditDataId] = 1791 AND [AuditEventId] = 0x0800) UPDATE [AuditData] SET [Key] = 'Reader Main Module Error', [Value] = 'Reader Main Module Error', [IsAlert] = 0 WHERE [AuditDataId] = 1791 AND [AuditEventId] = 0x0800 ELSE INSERT INTO [AuditData] ([AuditDataId], [AuditEventId], [Key], [Value], [IsAlert]) VALUES (1791, 0x0800, 'Reader Main Module Error', 'Reader Main Module Error', 0)"]
[null,"Audit","LOCK_FFR","FW Reset to Factory Vers",null,{"$f":"LEN(D209)","v":24},{"$f":"LEN(E209)","v":0},"0x0801",0,null,null,null,null,"IF EXISTS(SELECT TOP 1 * FROM [AuditEvent] WHERE [AuditEventId] = 0x0801) UPDATE [AuditEvent] SET [Key] = 'FW Reset to Factory Vers', [Value] = 'FW Reset to Factory Vers', [IsAlert] = 0 WHERE [AuditEventId] = 0x0801 ELSE INSERT INTO [AuditEvent] ([AuditEventId], [Key], [Value], [IsAlert]) VALUES (0x0801, 'FW Reset to Factory Vers', 'FW Reset to Factory Vers', 0)","IF EXISTS(SELECT TOP 1 * FROM [AuditData] WHERE [AuditDataId] = 0 AND [AuditEventId] = 0x0801) UPDATE [AuditData] SET [Key] = '', [Value] = '', [IsAlert] = 0 WHERE [AuditDataId] = 0 AND [AuditEventId] = 0x0801 ELSE INSERT INTO [AuditData] ([AuditDataId], [AuditEventId], [Key], [Value], [IsAlert]) VALUES (0, 0x0801, '', '', 0)"]
[null,"Audit","LOCK_UPDATE","Firmware Updated",null,{"$f":"LEN(D210)","v":16},{"$f":"LEN(E210)","v":0},"0x0802",0,null,null,null,null,"IF EXISTS(SELECT TOP 1 * FROM [AuditEvent] WHERE [AuditEventId] = 0x0802) UPDATE [AuditEvent] SET [Key] = 'Firmware Updated', [Value] = 'Firmware Updated', [IsAlert] = 0 WHERE [AuditEventId] = 0x0802 ELSE INSERT INTO [AuditEvent] ([AuditEventId], [Key], [Value], [IsAlert]) VALUES (0x0802, 'Firmware Updated', 'Firmware Updated', 0)","IF EXISTS(SELECT TOP 1 * FROM [AuditData] WHERE [AuditDataId] = 0 AND [AuditEventId] = 0x0802) UPDATE [AuditData] SET [Key] = '', [Value] = '', [IsAlert] = 0 WHERE [AuditDataId] = 0 AND [AuditEventId] = 0x0802 ELSE INSERT INTO [AuditData] ([AuditDataId], [AuditEventId], [Key], [Value], [IsAlert]) VALUES (0, 0x0802, '', '', 0)"]
[null,"Audit","LOCK_IMAGE_INVALID","Invalid Firmware Image",null,null,null,"0x0803",0,null,null,null,null,"IF EXISTS(SELECT TOP 1 * FROM [AuditEvent] WHERE [AuditEventId] = 0x0803) UPDATE [AuditEvent] SET [Key] = 'Invalid Firmware Image', [Value] = 'Invalid Firmware Image', [IsAlert] = 0 WHERE [AuditEventId] = 0x0803 ELSE INSERT INTO [AuditEvent] ([AuditEventId], [Key], [Value], [IsAlert]) VALUES (0x0803, 'Invalid Firmware Image', 'Invalid Firmware Image', 0)","IF EXISTS(SELECT TOP 1 * FROM [AuditData] WHERE [AuditDataId] = 0 AND [AuditEventId] = 0x0803) UPDATE [AuditData] SET [Key] = '', [Value] = '', [IsAlert] = 0 WHERE [AuditDataId] = 0 AND [AuditEventId] = 0x0803 ELSE INSERT INTO [AuditData] ([AuditDataId], [AuditEventId], [Key], [Value], [IsAlert]) VALUES (0, 0x0803, '', '', 0)"]
[null,"Audit","LOCK_IMAGE_INCOMPATIBLE","Incompatible Firmware Image",null,null,null,"0x0804",0,null,null,null,null,{"$f":"IF(LEFT(H212,2)=\"0x\",CONCATENATE(\"IF EXISTS(SELECT TOP 1 * FROM [AuditEvent] WHERE [AuditEventId] = \",H212,\") UPDATE [AuditEvent] SET [Key] = '\",TRIM(D212),\"', [Value] = '\",TRIM(D212),\"', [IsAlert] = \",IF(B212=\"Audit\",0,1),\" WHERE [AuditEventId] = \",H212,\" ELSE INSERT INTO [AuditEvent] ([AuditEventId], [Key], [Value], [IsAlert]) VALUES (\",H212,\", '\",TRIM(D212),\"', '\",TRIM(D212),\"', \",IF(B212=\"Audit\",0,1), \")\"),\"-- no value\")","v":"IF EXISTS(SELECT TOP 1 * FROM [AuditEvent] WHERE [AuditEventId] = 0x0804) UPDATE [AuditEvent] SET [Key] = 'Incompatible Firmware Image', [Value] = 'Incompatible Firmware Image', [IsAlert] = 0 WHERE [AuditEventId] = 0x0804 ELSE INSERT INTO [AuditEvent] ([AuditEventId], [Key], [Value], [IsAlert]) VALUES (0x0804, 'Incompatible Firmware Image', 'Incompatible Firmware Image', 0)"},"IF EXISTS(SELECT TOP 1 * FROM [AuditData] WHERE [AuditDataId] = 0 AND [AuditEventId] = 0x0804) UPDATE [AuditData] SET [Key] = '', [Value] = '', [IsAlert] = 0 WHERE [AuditDataId] = 0 AND [AuditEventId] = 0x0804 ELSE INSERT INTO [AuditData] ([AuditDataId], [AuditEventId], [Key], [Value], [IsAlert]) VALUES (0, 0x0804, '', '', 0)"]
["JSON Audits",null,null,null,null,null,null,null,null,null,null,null,null,"-- no value","-- no value"]
["Base Value",null,null,null,null,null,null,null,null,null,null,null,null,"-- no value","-- no value"]
["0x0900","Audit","PARSE_ERROR     ","Data Integrity","Data Framing Error",null,null,"0x0900",0,null,null,null,null,"IF EXISTS(SELECT TOP 1 * FROM [AuditEvent] WHERE [AuditEventId] = 0x0900) UPDATE [AuditEvent] SET [Key] = 'Data Integrity', [Value] = 'Data Integrity', [IsAlert] = 0 WHERE [AuditEventId] = 0x0900 ELSE INSERT INTO [AuditEvent] ([AuditEventId], [Key], [Value], [IsAlert]) VALUES (0x0900, 'Data Integrity', 'Data Integrity', 0)","IF EXISTS(SELECT TOP 1 * FROM [AuditData] WHERE [AuditDataId] = 0 AND [AuditEventId] = 0x0900) UPDATE [AuditData] SET [Key] = 'Data Framing Error', [Value] = 'Data Framing Error', [IsAlert] = 0 WHERE [AuditDataId] = 0 AND [AuditEventId] = 0x0900 ELSE INSERT INTO [AuditData] ([AuditDataId], [AuditEventId], [Key], [Value], [IsAlert]) VALUES (0, 0x0900, 'Data Framing Error', 'Data Framing Error', 0)"]
[null,"Audit","PARSE_ERROR     ","Data Integrity","Unknown Data Error",{"$f":"LEN(D216)","v":14},{"$f":"LEN(E216)","v":18},"0x0900","0001",null,null,null,null,"IF EXISTS(SELECT TOP 1 * FROM [AuditEvent] WHERE [AuditEventId] = 0x0900) UPDATE [AuditEvent] SET [Key] = 'Data Integrity', [Value] = 'Data Integrity', [IsAlert] = 0 WHERE [AuditEventId] = 0x0900 ELSE INSERT INTO [AuditEvent] ([AuditEventId], [Key], [Value], [IsAlert]) VALUES (0x0900, 'Data Integrity', 'Data Integrity', 0)","IF EXISTS(SELECT TOP 1 * FROM [AuditData] WHERE [AuditDataId] = 1 AND [AuditEventId] = 0x0900) UPDATE [AuditData] SET [Key] = 'Unknown Data Error', [Value] = 'Unknown Data Error', [IsAlert] = 0 WHERE [AuditDataId] = 1 AND [AuditEventId] = 0x0900 ELSE INSERT INTO [AuditData] ([AuditDataId], [AuditEventId], [Key], [Value], [IsAlert]) VALUES (1, 0x0900, 'Unknown Data Error', 'Unknown Data Error', 0)"]
[null,"Audit","PARSE_ERROR     ","Data Integrity","Data Framing Error",14,18,"0x0900","0002",null,null,null,null,"IF EXISTS(SELECT TOP 1 * FROM [AuditEvent] WHERE [AuditEventId] = 0x0900) UPDATE [AuditEvent] SET [Key] = 'Data Integrity', [Value] = 'Data Integrity', [IsAlert] = 0 WHERE [AuditEventId] = 0x0900 ELSE INSERT INTO [AuditEvent] ([AuditEventId], [Key], [Value], [IsAlert]) VALUES (0x0900, 'Data Integrity', 'Data Integrity', 0)","IF EXISTS(SELECT TOP 1 * FROM [AuditData] WHERE [AuditDataId] = 2 AND [AuditEventId] = 0x0900) UPDATE [AuditData] SET [Key] = 'Data Framing Error', [Value] = 'Data Framing Error', [IsAlert] = 0 WHERE [AuditDataId] = 2 AND [AuditEventId] = 0x0900 ELSE INSERT INTO [AuditData] ([AuditDataId], [AuditEventId], [Key], [Value], [IsAlert]) VALUES (2, 0x0900, 'Data Framing Error', 'Data Framing Error', 0)"]
[null,"Audit","PARSE_ERROR     ","Data Integrity","Invalid Data Error",14,18,"0x0900","0003",null,null,null,null,"IF EXISTS(SELECT TOP 1 * FROM [AuditEvent] WHERE [AuditEventId] = 0x0900) UPDATE [AuditEvent] SET [Key] = 'Data Integrity', [Value] = 'Data Integrity', [IsAlert] = 0 WHERE [AuditEventId] = 0x0900 ELSE INSERT INTO [AuditEvent] ([AuditEventId], [Key], [Value], [IsAlert]) VALUES (0x0900, 'Data Integrity', 'Data Integrity', 0)","IF EXISTS(SELECT TOP 1 * FROM [AuditData] WHERE [AuditDataId] = 3 AND [AuditEventId] = 0x0900) UPDATE [AuditData] SET [Key] = 'Invalid Data Error', [Value] = 'Invalid Data Error', [IsAlert] = 0 WHERE [AuditDataId] = 3 AND [AuditEventId] = 0x0900 ELSE INSERT INTO [AuditData] ([AuditDataId], [AuditEventId], [Key], [Value], [IsAlert]) VALUES (3, 0x0900, 'Invalid Data Error', 'Invalid Data Error', 0)"]
[null,"Audit","PARSE_ERROR     ","Data Integrity","Invalid Buffer Error",14,20,"0x0900","0004",null,null,null,null,"IF EXISTS(SELECT TOP 1 * FROM [AuditEvent] WHERE [AuditEventId] = 0x0900) UPDATE [AuditEvent] SET [Key] = 'Data Integrity', [Value] = 'Data Integrity', [IsAlert] = 0 WHERE [AuditEventId] = 0x0900 ELSE INSERT INTO [AuditEvent] ([AuditEventId], [Key], [Value], [IsAlert]) VALUES (0x0900, 'Data Integrity', 'Data Integrity', 0)","IF EXISTS(SELECT TOP 1 * FROM [AuditData] WHERE [AuditDataId] = 4 AND [AuditEventId] = 0x0900) UPDATE [AuditData] SET [Key] = 'Invalid Buffer Error', [Value] = 'Invalid Buffer Error', [IsAlert] = 0 WHERE [AuditDataId] = 4 AND [AuditEventId] = 0x0900 ELSE INSERT INTO [AuditData] ([AuditDataId], [AuditEventId], [Key], [Value], [IsAlert]) VALUES (4, 0x0900, 'Invalid Buffer Error', 'Invalid Buffer Error', 0)"]
[null,"Audit","PARSE_ERROR     ","Data Integrity","Partial Data Error",14,18,"0x0900","0005",null,null,null,null,"IF EXISTS(SELECT TOP 1 * FROM [AuditEvent] WHERE [AuditEventId] = 0x0900) UPDATE [AuditEvent] SET [Key] = 'Data Integrity', [Value] = 'Data Integrity', [IsAlert] = 0 WHERE [AuditEventId] = 0x0900 ELSE INSERT INTO [AuditEvent] ([AuditEventId], [Key], [Value], [IsAlert]) VALUES (0x0900, 'Data Integrity', 'Data Integrity', 0)","IF EXISTS(SELECT TOP 1 * FROM [AuditData] WHERE [AuditDataId] = 5 AND [AuditEventId] = 0x0900) UPDATE [AuditData] SET [Key] = 'Partial Data Error', [Value] = 'Partial Data Error', [IsAlert] = 0 WHERE [AuditDataId] = 5 AND [AuditEventId] = 0x0900 ELSE INSERT INTO [AuditData] ([AuditDataId], [AuditEventId], [Key], [Value], [IsAlert]) VALUES (5, 0x0900, 'Partial Data Error', 'Partial Data Error', 0)"]
[null,"Audit","PARSE_ERROR     ","Data Integrity","Database Record Error",14,21,"0x0900","0006",null,null,null,null,"IF EXISTS(SELECT TOP 1 * FROM [AuditEvent] WHERE [AuditEventId] = 0x0900) UPDATE [AuditEvent] SET [Key] = 'Data Integrity', [Value] = 'Data Integrity', [IsAlert] = 0 WHERE [AuditEventId] = 0x0900 ELSE INSERT INTO [AuditEvent] ([AuditEventId], [Key], [Value], [IsAlert]) VALUES (0x0900, 'Data Integrity', 'Data Integrity', 0)",{"$f":"IF(AND(LEFT(H221,2)=\"0x\",ISNUMBER(HEX2DEC(TRIM(I221))*1)),CONCATENATE(\"IF EXISTS(SELECT TOP 1 * FROM [AuditData] WHERE [AuditDataId] = \",HEX2DEC(I221),\" AND [AuditEventId] = \",H221,\") UPDATE [AuditData] SET [Key] = '\",E221,\"', [Value] = '\",E221,\"', [IsAlert] = 0 WHERE [AuditDataId] = \",HEX2DEC(I221),\" AND [AuditEventId] = \",H221,\" ELSE INSERT INTO [AuditData] ([AuditDataId], [AuditEventId], [Key], [Value], [IsAlert]) VALUES (\",HEX2DEC(I221),\", \",H221,\", '\",E221,\"', '\",E221,\"', 0)\"),\"-- no value\")","v":"IF EXISTS(SELECT TOP 1 * FROM [AuditData] WHERE [AuditDataId] = 6 AND [AuditEventId] = 0x0900) UPDATE [AuditData] SET [Key] = 'Database Record Error', [Value] = 'Database Record Error', [IsAlert] = 0 WHERE [AuditDataId] = 6 AND [AuditEventId] = 0x0900 ELSE INSERT INTO [AuditData] ([AuditDataId], [AuditEventId], [Key], [Value], [IsAlert]) VALUES (6, 0x0900, 'Database Record Error', 'Database Record Error', 0)"}]
[null,"Audit","PARSE_ERROR     ","Data Integrity","Database Delete Error",14,21,"0x0900","0007",null,null,null,null,"IF EXISTS(SELECT TOP 1 * FROM [AuditEvent] WHERE [AuditEventId] = 0x0900) UPDATE [AuditEvent] SET [Key] = 'Data Integrity', [Value] = 'Data Integrity', [IsAlert] = 0 WHERE [AuditEventId] = 0x0900 ELSE INSERT INTO [AuditEvent] ([AuditEventId], [Key], [Value], [IsAlert]) VALUES (0x0900, 'Data Integrity', 'Data Integrity', 0)","IF EXISTS(SELECT TOP 1 * FROM [AuditData] WHERE [AuditDataId] = 7 AND [AuditEventId] = 0x0900) UPDATE [AuditData] SET [Key] = 'Database Delete Error', [Value] = 'Database Delete Error', [IsAlert] = 0 WHERE [AuditDataId] = 7 AND [AuditEventId] = 0x0900 ELSE INSERT INTO [AuditData] ([AuditDataId], [AuditEventId], [Key], [Value], [IsAlert]) VALUES (7, 0x0900, 'Database Delete Error', 'Database Delete Error', 0)"]
[null,"Audit","PARSE_ERROR     ","Data Integrity","Database Schedule Error",14,23,"0x0900","0008",null,null,null,null,"IF EXISTS(SELECT TOP 1 * FROM [AuditEvent] WHERE [AuditEventId] = 0x0900) UPDATE [AuditEvent] SET [Key] = 'Data Integrity', [Value] = 'Data Integrity', [IsAlert] = 0 WHERE [AuditEventId] = 0x0900 ELSE INSERT INTO [AuditEvent] ([AuditEventId], [Key], [Value], [IsAlert]) VALUES (0x0900, 'Data Integrity', 'Data Integrity', 0)","IF EXISTS(SELECT TOP 1 * FROM [AuditData] WHERE [AuditDataId] = 8 AND [AuditEventId] = 0x0900) UPDATE [AuditData] SET [Key] = 'Database Schedule Error', [Value] = 'Database Schedule Error', [IsAlert] = 0 WHERE [AuditDataId] = 8 AND [AuditEventId] = 0x0900 ELSE INSERT INTO [AuditData] ([AuditDataId], [AuditEventId], [Key], [Value], [IsAlert]) VALUES (8, 0x0900, 'Database Schedule Error', 'Database Schedule Error', 0)"]
[null,"Audit","PARSE_ERROR     ","Data Integrity","Database Holiday Error",14,22,"0x0900","0009",null,null,null,null,{"$f":"IF(LEFT(H224,2)=\"0x\",CONCATENATE(\"IF EXISTS(SELECT TOP 1 * FROM [AuditEvent] WHERE [AuditEventId] = \",H224,\") UPDATE [AuditEvent] SET [Key] = '\",TRIM(D224),\"', [Value] = '\",TRIM(D224),\"', [IsAlert] = \",IF(B224=\"Audit\",0,1),\" WHERE [AuditEventId] = \",H224,\" ELSE INSERT INTO [AuditEvent] ([AuditEventId], [Key], [Value], [IsAlert]) VALUES (\",H224,\", '\",TRIM(D224),\"', '\",TRIM(D224),\"', \",IF(B224=\"Audit\",0,1), \")\"),\"-- no value\")","v":"IF EXISTS(SELECT TOP 1 * FROM [AuditEvent] WHERE [AuditEventId] = 0x0900) UPDATE [AuditEvent] SET [Key] = 'Data Integrity', [Value] = 'Data Integrity', [IsAlert] = 0 WHERE [AuditEventId] = 0x0900 ELSE INSERT INTO [AuditEvent] ([AuditEventId], [Key], [Value], [IsAlert]) VALUES (0x0900, 'Data Integrity', 'Data Integrity', 0)"},"IF EXISTS(SELECT TOP 1 * FROM [AuditData] WHERE [AuditDataId] = 9 AND [AuditEventId] = 0x0900) UPDATE [AuditData] SET [Key] = 'Database Holiday Error', [Value] = 'Database Holiday Error', [IsAlert] = 0 WHERE [AuditDataId] = 9 AND [AuditEventId] = 0x0900 ELSE INSERT INTO [AuditData] ([AuditDataId], [AuditEventId], [Key], [Value], [IsAlert]) VALUES (9, 0x0900, 'Database Holiday Error', 'Database Holiday Error', 0)"]
[null,"Audit","PARSE_ERROR     ","Data Integrity","Database Auto Unlock Error",14,26,"0x0900","000A",null,null,null,null,"IF EXISTS(SELECT TOP 1 * FROM [AuditEvent] WHERE [AuditEventId] = 0x0900) UPDATE [AuditEvent] SET [Key] = 'Data Integrity', [Value] = 'Data Integrity', [IsAlert] = 0 WHERE [AuditEventId] = 0x0900 ELSE INSERT INTO [AuditEvent] ([AuditEventId], [Key], [Value], [IsAlert]) VALUES (0x0900, 'Data Integrity', 'Data Integrity', 0)","IF EXISTS(SELECT TOP 1 * FROM [AuditData] WHERE [AuditDataId] = 10 AND [AuditEventId] = 0x0900) UPDATE [AuditData] SET [Key] = 'Database Auto Unlock Error', [Value] = 'Database Auto Unlock Error', [IsAlert] = 0 WHERE [AuditDataId] = 10 AND [AuditEventId] = 0x0900 ELSE INSERT INTO [AuditData] ([AuditDataId], [AuditEventId], [Key], [Value], [IsAlert]) VALUES (10, 0x0900, 'Database Auto Unlock Error', 'Database Auto Unlock Error', 0)"]
[null,"Audit","PARSE_ERROR     ","Data Integrity","Lock Configuration Error",14,24,"0x0900","000B",null,null,null,null,"IF EXISTS(SELECT TOP 1 * FROM [AuditEvent] WHERE [AuditEventId] = 0x0900) UPDATE [AuditEvent] SET [Key] = 'Data Integrity', [Value] = 'Data Integrity', [IsAlert] = 0 WHERE [AuditEventId] = 0x0900 ELSE INSERT INTO [AuditEvent] ([AuditEventId], [Key], [Value], [IsAlert]) VALUES (0x0900, 'Data Integrity', 'Data Integrity', 0)","IF EXISTS(SELECT TOP 1 * FROM [AuditData] WHERE [AuditDataId] = 11 AND [AuditEventId] = 0x0900) UPDATE [AuditData] SET [Key] = 'Lock Configuration Error', [Value] = 'Lock Configuration Error', [IsAlert] = 0 WHERE [AuditDataId] = 11 AND [AuditEventId] = 0x0900 ELSE INSERT INTO [AuditData] ([AuditDataId], [AuditEventId], [Key], [Value], [IsAlert]) VALUES (11, 0x0900, 'Lock Configuration Error', 'Lock Configuration Error', 0)"]
[null,"Audit","PARSE_ERROR     ","Data Integrity","Wi-Fi Configuration Error",14,25,"0x0900","000C",null,null,null,null,"IF EXISTS(SELECT TOP 1 * FROM [AuditEvent] WHERE [AuditEventId] = 0x0900) UPDATE [AuditEvent] SET [Key] = 'Data Integrity', [Value] = 'Data Integrity', [IsAlert] = 0 WHERE [AuditEventId] = 0x0900 ELSE INSERT INTO [AuditEvent] ([AuditEventId], [Key], [Value], [IsAlert]) VALUES (0x0900, 'Data Integrity', 'Data Integrity', 0)","IF EXISTS(SELECT TOP 1 * FROM [AuditData] WHERE [AuditDataId] = 12 AND [AuditEventId] = 0x0900) UPDATE [AuditData] SET [Key] = 'Wi-Fi Configuration Error', [Value] = 'Wi-Fi Configuration Error', [IsAlert] = 0 WHERE [AuditDataId] = 12 AND [AuditEventId] = 0x0900 ELSE INSERT INTO [AuditData] ([AuditDataId], [AuditEventId], [Key], [Value], [IsAlert]) VALUES (12, 0x0900, 'Wi-Fi Configuration Error', 'Wi-Fi Configuration Error', 0)"]
[null,"Audit","PARSE_ERROR     ","Data Integrity","Memory Write Error",14,18,"0x0900","000D",null,null,null,null,"IF EXISTS(SELECT TOP 1 * FROM [AuditEvent] WHERE [AuditEventId] = 0x0900) UPDATE [AuditEvent] SET [Key] = 'Data Integrity', [Value] = 'Data Integrity', [IsAlert] = 0 WHERE [AuditEventId] = 0x0900 ELSE INSERT INTO [AuditEvent] ([AuditEventId], [Key], [Value], [IsAlert]) VALUES (0x0900, 'Data Integrity', 'Data Integrity', 0)","IF EXISTS(SELECT TOP 1 * FROM [AuditData] WHERE [AuditDataId] = 13 AND [AuditEventId] = 0x0900) UPDATE [AuditData] SET [Key] = 'Memory Write Error', [Value] = 'Memory Write Error', [IsAlert] = 0 WHERE [AuditDataId] = 13 AND [AuditEventId] = 0x0900 ELSE INSERT INTO [AuditData] ([AuditDataId], [AuditEventId], [Key], [Value], [IsAlert]) VALUES (13, 0x0900, 'Memory Write Error', 'Memory Write Error', 0)"]
[null,"Audit","PARSE_ERROR     ","Data Integrity","Database Sequence Error",14,23,"0x0900","000E",null,null,null,null,"IF EXISTS(SELECT TOP 1 * FROM [AuditEvent] WHERE [AuditEventId] = 0x0900) UPDATE [AuditEvent] SET [Key] = 'Data Integrity', [Value] = 'Data Integrity', [IsAlert] = 0 WHERE [AuditEventId] = 0x0900 ELSE INSERT INTO [AuditEvent] ([AuditEventId], [Key], [Value], [IsAlert]) VALUES (0x0900, 'Data Integrity', 'Data Integrity', 0)","IF EXISTS(SELECT TOP 1 * FROM [AuditData] WHERE [AuditDataId] = 14 AND [AuditEventId] = 0x0900) UPDATE [AuditData] SET [Key] = 'Database Sequence Error', [Value] = 'Database Sequence Error', [IsAlert] = 0 WHERE [AuditDataId] = 14 AND [AuditEventId] = 0x0900 ELSE INSERT INTO [AuditData] ([AuditDataId], [AuditEventId], [Key], [Value], [IsAlert]) VALUES (14, 0x0900, 'Database Sequence Error', 'Database Sequence Error', 0)"]
[null,"Audit","PARSE_ERROR     ","Data Integrity","Data Too Large Error",14,20,"0x0900","000F",null,null,null,null,"IF EXISTS(SELECT TOP 1 * FROM [AuditEvent] WHERE [AuditEventId] = 0x0900) UPDATE [AuditEvent] SET [Key] = 'Data Integrity', [Value] = 'Data Integrity', [IsAlert] = 0 WHERE [AuditEventId] = 0x0900 ELSE INSERT INTO [AuditEvent] ([AuditEventId], [Key], [Value], [IsAlert]) VALUES (0x0900, 'Data Integrity', 'Data Integrity', 0)","IF EXISTS(SELECT TOP 1 * FROM [AuditData] WHERE [AuditDataId] = 15 AND [AuditEventId] = 0x0900) UPDATE [AuditData] SET [Key] = 'Data Too Large Error', [Value] = 'Data Too Large Error', [IsAlert] = 0 WHERE [AuditDataId] = 15 AND [AuditEventId] = 0x0900 ELSE INSERT INTO [AuditData] ([AuditDataId], [AuditEventId], [Key], [Value], [IsAlert]) VALUES (15, 0x0900, 'Data Too Large Error', 'Data Too Large Error', 0)"]
[null,"Audit","PARSE_ERROR     ","Data Integrity","Null Buffer Error",14,17,"0x0900","0010",null,null,null,null,"IF EXISTS(SELECT TOP 1 * FROM [AuditEvent] WHERE [AuditEventId] = 0x0900) UPDATE [AuditEvent] SET [Key] = 'Data Integrity', [Value] = 'Data Integrity', [IsAlert] = 0 WHERE [AuditEventId] = 0x0900 ELSE INSERT INTO [AuditEvent] ([AuditEventId], [Key], [Value], [IsAlert]) VALUES (0x0900, 'Data Integrity', 'Data Integrity', 0)","IF EXISTS(SELECT TOP 1 * FROM [AuditData] WHERE [AuditDataId] = 16 AND [AuditEventId] = 0x0900) UPDATE [AuditData] SET [Key] = 'Null Buffer Error', [Value] = 'Null Buffer Error', [IsAlert] = 0 WHERE [AuditDataId] = 16 AND [AuditEventId] = 0x0900 ELSE INSERT INTO [AuditData] ([AuditDataId], [AuditEventId], [Key], [Value], [IsAlert]) VALUES (16, 0x0900, 'Null Buffer Error', 'Null Buffer Error', 0)"]
[null,"Audit","PARSE_ERROR     ","Data Integrity","Database Load Success",14,21,"0x0900","0011",null,null,null,null,"IF EXISTS(SELECT TOP 1 * FROM [AuditEvent] WHERE [AuditEventId] = 0x0900) UPDATE [AuditEvent] SET [Key] = 'Data Integrity', [Value] = 'Data Integrity', [IsAlert] = 0 WHERE [AuditEventId] = 0x0900 ELSE INSERT INTO [AuditEvent] ([AuditEventId], [Key], [Value], [IsAlert]) VALUES (0x0900, 'Data Integrity', 'Data Integrity', 0)","IF EXISTS(SELECT TOP 1 * FROM [AuditData] WHERE [AuditDataId] = 17 AND [AuditEventId] = 0x0900) UPDATE [AuditData] SET [Key] = 'Database Load Success', [Value] = 'Database Load Success', [IsAlert] = 0 WHERE [AuditDataId] = 17 AND [AuditEventId] = 0x0900 ELSE INSERT INTO [AuditData] ([AuditDataId], [AuditEventId], [Key], [Value], [IsAlert]) VALUES (17, 0x0900, 'Database Load Success', 'Database Load Success', 0)"]
[null,"Audit","PARSE_ERROR     ","Data Integrity","Parse Multistep Sequence Error",14,30,"0x0900","001A",null,null,null,null,"IF EXISTS(SELECT TOP 1 * FROM [AuditEvent] WHERE [AuditEventId] = 0x0900) UPDATE [AuditEvent] SET [Key] = 'Data Integrity', [Value] = 'Data Integrity', [IsAlert] = 0 WHERE [AuditEventId] = 0x0900 ELSE INSERT INTO [AuditEvent] ([AuditEventId], [Key], [Value], [IsAlert]) VALUES (0x0900, 'Data Integrity', 'Data Integrity', 0)","IF EXISTS(SELECT TOP 1 * FROM [AuditData] WHERE [AuditDataId] = 26 AND [AuditEventId] = 0x0900) UPDATE [AuditData] SET [Key] = 'Parse Multistep Sequence Error', [Value] = 'Parse Multistep Sequence Error', [IsAlert] = 0 WHERE [AuditDataId] = 26 AND [AuditEventId] = 0x0900 ELSE INSERT INTO [AuditData] ([AuditDataId], [AuditEventId], [Key], [Value], [IsAlert]) VALUES (26, 0x0900, 'Parse Multistep Sequence Error', 'Parse Multistep Sequence Error', 0)"]
[null,"Audit","PARSE_ERROR     ","Data Integrity","Data Error - Extended Credential Schedule",{"$f":"LEN(D234)","v":14},{"$f":"LEN(E234)","v":41},"0x0900","001B",null,null,null,null,{"$f":"IF(LEFT(H234,2)=\"0x\",CONCATENATE(\"IF EXISTS(SELECT TOP 1 * FROM [AuditEvent] WHERE [AuditEventId] = \",H234,\") UPDATE [AuditEvent] SET [Key] = '\",TRIM(D234),\"', [Value] = '\",TRIM(D234),\"', [IsAlert] = \",IF(B234=\"Audit\",0,1),\" WHERE [AuditEventId] = \",H234,\" ELSE INSERT INTO [AuditEvent] ([AuditEventId], [Key], [Value], [IsAlert]) VALUES (\",H234,\", '\",TRIM(D234),\"', '\",TRIM(D234),\"', \",IF(B234=\"Audit\",0,1), \")\"),\"-- no value\")","v":"IF EXISTS(SELECT TOP 1 * FROM [AuditEvent] WHERE [AuditEventId] = 0x0900) UPDATE [AuditEvent] SET [Key] = 'Data Integrity', [Value] = 'Data Integrity', [IsAlert] = 0 WHERE [AuditEventId] = 0x0900 ELSE INSERT INTO [AuditEvent] ([AuditEventId], [Key], [Value], [IsAlert]) VALUES (0x0900, 'Data Integrity', 'Data Integrity', 0)"},{"$f":"IF(AND(LEFT(H234,2)=\"0x\",ISNUMBER(HEX2DEC(TRIM(I234))*1)),CONCATENATE(\"IF EXISTS(SELECT TOP 1 * FROM [AuditData] WHERE [AuditDataId] = \",HEX2DEC(I234),\" AND [AuditEventId] = \",H234,\") UPDATE [AuditData] SET [Key] = '\",E234,\"', [Value] = '\",E234,\"', [IsAlert] = 0 WHERE [AuditDataId] = \",HEX2DEC(I234),\" AND [AuditEventId] = \",H234,\" ELSE INSERT INTO [AuditData] ([AuditDataId], [AuditEventId], [Key], [Value], [IsAlert]) VALUES (\",HEX2DEC(I234),\", \",H234,\", '\",E234,\"', '\",E234,\"', 0)\"),\"-- no value\")","v":"IF EXISTS(SELECT TOP 1 * FROM [AuditData] WHERE [AuditDataId] = 27 AND [AuditEventId] = 0x0900) UPDATE [AuditData] SET [Key] = 'Data Error - Extended Credential Schedule', [Value] = 'Data Error - Extended Credential Schedule', [IsAlert] = 0 WHERE [AuditDataId] = 27 AND [AuditEventId] = 0x0900 ELSE INSERT INTO [AuditData] ([AuditDataId], [AuditEventId], [Key], [Value], [IsAlert]) VALUES (27, 0x0900, 'Data Error - Extended Credential Schedule', 'Data Error - Extended Credential Schedule', 0)"}]
[null,"Audit","PARSE_IGNORED_DATA","Parser Ignored Data",null,19,null,"0x0901",0,null,null,null,null,"IF EXISTS(SELECT TOP 1 * FROM [AuditEvent] WHERE [AuditEventId] = 0x0901) UPDATE [AuditEvent] SET [Key] = 'Parser Ignored Data', [Value] = 'Parser Ignored Data', [IsAlert] = 0 WHERE [AuditEventId] = 0x0901 ELSE INSERT INTO [AuditEvent] ([AuditEventId], [Key], [Value], [IsAlert]) VALUES (0x0901, 'Parser Ignored Data', 'Parser Ignored Data', 0)","IF EXISTS(SELECT TOP 1 * FROM [AuditData] WHERE [AuditDataId] = 0 AND [AuditEventId] = 0x0901) UPDATE [AuditData] SET [Key] = '', [Value] = '', [IsAlert] = 0 WHERE [AuditDataId] = 0 AND [AuditEventId] = 0x0901 ELSE INSERT INTO [AuditData] ([AuditDataId], [AuditEventId], [Key], [Value], [IsAlert]) VALUES (0, 0x0901, '', '', 0)"]
[null,null,null,null,null,null,null,null,null,null,null,null,null,"-- no value","-- no value"]
["RTCC Audits",null,null,null,null,null,null,null,null,null,null,null,null,"-- no value","-- no value"]
["Base Value",null,null,null,null,null,null,null,null,null,null,null,null,"-- no value","-- no value"]
["0x0A00","Audit","DST_CHANGED_TIME  ","DST Change ","Time adjusted backward (-1 hour)",{"$f":"LEN(D239)","v":11},32,"0x0A00","0001",null,null,null,null,"IF EXISTS(SELECT TOP 1 * FROM [AuditEvent] WHERE [AuditEventId] = 0x0A00) UPDATE [AuditEvent] SET [Key] = 'DST Change', [Value] = 'DST Change', [IsAlert] = 0 WHERE [AuditEventId] = 0x0A00 ELSE INSERT INTO [AuditEvent] ([AuditEventId], [Key], [Value], [IsAlert]) VALUES (0x0A00, 'DST Change', 'DST Change', 0)","IF EXISTS(SELECT TOP 1 * FROM [AuditData] WHERE [AuditDataId] = 1 AND [AuditEventId] = 0x0A00) UPDATE [AuditData] SET [Key] = 'Time adjusted backward (-1 hour)', [Value] = 'Time adjusted backward (-1 hour)', [IsAlert] = 0 WHERE [AuditDataId] = 1 AND [AuditEventId] = 0x0A00 ELSE INSERT INTO [AuditData] ([AuditDataId], [AuditEventId], [Key], [Value], [IsAlert]) VALUES (1, 0x0A00, 'Time adjusted backward (-1 hour)', 'Time adjusted backward (-1 hour)', 0)"]
[null,"Audit","DST_CHANGED_TIME  ","DST Change ","Time adjusted forward  (+1 hour)",11,32,"0x0A00","0002",null,null,null,null,"IF EXISTS(SELECT TOP 1 * FROM [AuditEvent] WHERE [AuditEventId] = 0x0A00) UPDATE [AuditEvent] SET [Key] = 'DST Change', [Value] = 'DST Change', [IsAlert] = 0 WHERE [AuditEventId] = 0x0A00 ELSE INSERT INTO [AuditEvent] ([AuditEventId], [Key], [Value], [IsAlert]) VALUES (0x0A00, 'DST Change', 'DST Change', 0)","IF EXISTS(SELECT TOP 1 * FROM [AuditData] WHERE [AuditDataId] = 2 AND [AuditEventId] = 0x0A00) UPDATE [AuditData] SET [Key] = 'Time adjusted forward  (+1 hour)', [Value] = 'Time adjusted forward  (+1 hour)', [IsAlert] = 0 WHERE [AuditDataId] = 2 AND [AuditEventId] = 0x0A00 ELSE INSERT INTO [AuditData] ([AuditDataId], [AuditEventId], [Key], [Value], [IsAlert]) VALUES (2, 0x0A00, 'Time adjusted forward  (+1 hour)', 'Time adjusted forward  (+1 hour)', 0)"]
[null,"Audit","RTCC_ERROR ","Real Time Clock Error","Invalid clock time",21,18,"0x0A01","0001",null,null,null,null,"IF EXISTS(SELECT TOP 1 * FROM [AuditEvent] WHERE [AuditEventId] = 0x0A01) UPDATE [AuditEvent] SET [Key] = 'Real Time Clock Error', [Value] = 'Real Time Clock Error', [IsAlert] = 0 WHERE [AuditEventId] = 0x0A01 ELSE INSERT INTO [AuditEvent] ([AuditEventId], [Key], [Value], [IsAlert]) VALUES (0x0A01, 'Real Time Clock Error', 'Real Time Clock Error', 0)","IF EXISTS(SELECT TOP 1 * FROM [AuditData] WHERE [AuditDataId] = 1 AND [AuditEventId] = 0x0A01) UPDATE [AuditData] SET [Key] = 'Invalid clock time', [Value] = 'Invalid clock time', [IsAlert] = 0 WHERE [AuditDataId] = 1 AND [AuditEventId] = 0x0A01 ELSE INSERT INTO [AuditData] ([AuditDataId], [AuditEventId], [Key], [Value], [IsAlert]) VALUES (1, 0x0A01, 'Invalid clock time', 'Invalid clock time', 0)"]
[null,"Audit","RTCC_ERROR ","Real Time Clock Error","Invalid clock increment",21,23,"0x0A01","0002",null,null,null,null,"IF EXISTS(SELECT TOP 1 * FROM [AuditEvent] WHERE [AuditEventId] = 0x0A01) UPDATE [AuditEvent] SET [Key] = 'Real Time Clock Error', [Value] = 'Real Time Clock Error', [IsAlert] = 0 WHERE [AuditEventId] = 0x0A01 ELSE INSERT INTO [AuditEvent] ([AuditEventId], [Key], [Value], [IsAlert]) VALUES (0x0A01, 'Real Time Clock Error', 'Real Time Clock Error', 0)","IF EXISTS(SELECT TOP 1 * FROM [AuditData] WHERE [AuditDataId] = 2 AND [AuditEventId] = 0x0A01) UPDATE [AuditData] SET [Key] = 'Invalid clock increment', [Value] = 'Invalid clock increment', [IsAlert] = 0 WHERE [AuditDataId] = 2 AND [AuditEventId] = 0x0A01 ELSE INSERT INTO [AuditData] ([AuditDataId], [AuditEventId], [Key], [Value], [IsAlert]) VALUES (2, 0x0A01, 'Invalid clock increment', 'Invalid clock increment', 0)"]
[null,"Audit","RTCC_ERROR ","Real Time Clock Error","External RTCC/Clock Error",null,null,"0x0A01","0003",null,null,null,null,"IF EXISTS(SELECT TOP 1 * FROM [AuditEvent] WHERE [AuditEventId] = 0x0A01) UPDATE [AuditEvent] SET [Key] = 'Real Time Clock Error', [Value] = 'Real Time Clock Error', [IsAlert] = 0 WHERE [AuditEventId] = 0x0A01 ELSE INSERT INTO [AuditEvent] ([AuditEventId], [Key], [Value], [IsAlert]) VALUES (0x0A01, 'Real Time Clock Error', 'Real Time Clock Error', 0)","IF EXISTS(SELECT TOP 1 * FROM [AuditData] WHERE [AuditDataId] = 3 AND [AuditEventId] = 0x0A01) UPDATE [AuditData] SET [Key] = 'External RTCC/Clock Error', [Value] = 'External RTCC/Clock Error', [IsAlert] = 0 WHERE [AuditDataId] = 3 AND [AuditEventId] = 0x0A01 ELSE INSERT INTO [AuditData] ([AuditDataId], [AuditEventId], [Key], [Value], [IsAlert]) VALUES (3, 0x0A01, 'External RTCC/Clock Error', 'External RTCC/Clock Error', 0)"]
[null,"Audit","TIME_CHANGE","Real Time Clock Status","Clock time changed",22,18,"0x0A02","xxxx","0000 to FFFF",null,"Data representes the timedifference LSB in seconds (defaulted to 0x0000, when no data or not applicable)",null,"IF EXISTS(SELECT TOP 1 * FROM [AuditEvent] WHERE [AuditEventId] = 0x0A02) UPDATE [AuditEvent] SET [Key] = 'Real Time Clock Status', [Value] = 'Real Time Clock Status', [IsAlert] = 0 WHERE [AuditEventId] = 0x0A02 ELSE INSERT INTO [AuditEvent] ([AuditEventId], [Key], [Value], [IsAlert]) VALUES (0x0A02, 'Real Time Clock Status', 'Real Time Clock Status', 0)","-- no value"]
[null,"Audit","TIME_CHANGE (MSB)","Real Time Clock Status & Difference Value","Clock time changed (MSB)",{"$f":"LEN(D245)","v":41},{"$f":"LEN(E245)","v":24},"0x0A03","xxxx","0000 to FFFF",null,"Data representes the timedifference LSB in seconds (defaulted to 0x0000, when no data)",null,{"$f":"IF(LEFT(H245,2)=\"0x\",CONCATENATE(\"IF EXISTS(SELECT TOP 1 * FROM [AuditEvent] WHERE [AuditEventId] = \",H245,\") UPDATE [AuditEvent] SET [Key] = '\",TRIM(D245),\"', [Value] = '\",TRIM(D245),\"', [IsAlert] = \",IF(B245=\"Audit\",0,1),\" WHERE [AuditEventId] = \",H245,\" ELSE INSERT INTO [AuditEvent] ([AuditEventId], [Key], [Value], [IsAlert]) VALUES (\",H245,\", '\",TRIM(D245),\"', '\",TRIM(D245),\"', \",IF(B245=\"Audit\",0,1), \")\"),\"-- no value\")","v":"IF EXISTS(SELECT TOP 1 * FROM [AuditEvent] WHERE [AuditEventId] = 0x0A03) UPDATE [AuditEvent] SET [Key] = 'Real Time Clock Status & Difference Value', [Value] = 'Real Time Clock Status & Difference Value', [IsAlert] = 0 WHERE [AuditEventId] = 0x0A03 ELSE INSERT INTO [AuditEvent] ([AuditEventId], [Key], [Value], [IsAlert]) VALUES (0x0A03, 'Real Time Clock Status & Difference Value', 'Real Time Clock Status & Difference Value', 0)"},"-- no value"]
[null,null,null,null,null,null,null,null,null,null,null,null,null,"-- no value","-- no value"]
["WIFI Audits",null,null,null,null,null,null,null,null,null,null,null,null,"-- no value","-- no value"]
["Base Value",null,null,null,null,null,null,null,null,null,null,null,null,"-- no value","-- no value"]
["0x0B00","Audit","WIFI_ON_OFF               ","Wi-Fi Power","Power off",{"$f":"LEN(D249)","v":11},{"$f":"LEN(E249)","v":9},"0x0B00","0000",null,null,null,null,"IF EXISTS(SELECT TOP 1 * FROM [AuditEvent] WHERE [AuditEventId] = 0x0B00) UPDATE [AuditEvent] SET [Key] = 'Wi-Fi Power', [Value] = 'Wi-Fi Power', [IsAlert] = 0 WHERE [AuditEventId] = 0x0B00 ELSE INSERT INTO [AuditEvent] ([AuditEventId], [Key], [Value], [IsAlert]) VALUES (0x0B00, 'Wi-Fi Power', 'Wi-Fi Power', 0)","IF EXISTS(SELECT TOP 1 * FROM [AuditData] WHERE [AuditDataId] = 0 AND [AuditEventId] = 0x0B00) UPDATE [AuditData] SET [Key] = 'Power off', [Value] = 'Power off', [IsAlert] = 0 WHERE [AuditDataId] = 0 AND [AuditEventId] = 0x0B00 ELSE INSERT INTO [AuditData] ([AuditDataId], [AuditEventId], [Key], [Value], [IsAlert]) VALUES (0, 0x0B00, 'Power off', 'Power off', 0)"]
[null,"Audit","WIFI_ON_OFF               ","Wi-Fi Power","Power on",11,8,"0x0B00","0001",null,null,null,null,"IF EXISTS(SELECT TOP 1 * FROM [AuditEvent] WHERE [AuditEventId] = 0x0B00) UPDATE [AuditEvent] SET [Key] = 'Wi-Fi Power', [Value] = 'Wi-Fi Power', [IsAlert] = 0 WHERE [AuditEventId] = 0x0B00 ELSE INSERT INTO [AuditEvent] ([AuditEventId], [Key], [Value], [IsAlert]) VALUES (0x0B00, 'Wi-Fi Power', 'Wi-Fi Power', 0)","IF EXISTS(SELECT TOP 1 * FROM [AuditData] WHERE [AuditDataId] = 1 AND [AuditEventId] = 0x0B00) UPDATE [AuditData] SET [Key] = 'Power on', [Value] = 'Power on', [IsAlert] = 0 WHERE [AuditDataId] = 1 AND [AuditEventId] = 0x0B00 ELSE INSERT INTO [AuditData] ([AuditDataId], [AuditEventId], [Key], [Value], [IsAlert]) VALUES (1, 0x0B00, 'Power on', 'Power on', 0)"]
[null,"Audit","WIFI_AP_ASSOC_DISASSOC   ","Wi-Fi Association Status","Disassociated from network AP",24,29,"0x0B01","0000",null,null,null,null,"IF EXISTS(SELECT TOP 1 * FROM [AuditEvent] WHERE [AuditEventId] = 0x0B01) UPDATE [AuditEvent] SET [Key] = 'Wi-Fi Association Status', [Value] = 'Wi-Fi Association Status', [IsAlert] = 0 WHERE [AuditEventId] = 0x0B01 ELSE INSERT INTO [AuditEvent] ([AuditEventId], [Key], [Value], [IsAlert]) VALUES (0x0B01, 'Wi-Fi Association Status', 'Wi-Fi Association Status', 0)","IF EXISTS(SELECT TOP 1 * FROM [AuditData] WHERE [AuditDataId] = 0 AND [AuditEventId] = 0x0B01) UPDATE [AuditData] SET [Key] = 'Disassociated from network AP', [Value] = 'Disassociated from network AP', [IsAlert] = 0 WHERE [AuditDataId] = 0 AND [AuditEventId] = 0x0B01 ELSE INSERT INTO [AuditData] ([AuditDataId], [AuditEventId], [Key], [Value], [IsAlert]) VALUES (0, 0x0B01, 'Disassociated from network AP', 'Disassociated from network AP', 0)"]
[null,"Audit","WIFI_AP_ASSOC_DISASSOC   ","Wi-Fi Association Status","Associated with network AP",24,26,"0x0B01","0001",null,null,null,null,"IF EXISTS(SELECT TOP 1 * FROM [AuditEvent] WHERE [AuditEventId] = 0x0B01) UPDATE [AuditEvent] SET [Key] = 'Wi-Fi Association Status', [Value] = 'Wi-Fi Association Status', [IsAlert] = 0 WHERE [AuditEventId] = 0x0B01 ELSE INSERT INTO [AuditEvent] ([AuditEventId], [Key], [Value], [IsAlert]) VALUES (0x0B01, 'Wi-Fi Association Status', 'Wi-Fi Association Status', 0)","IF EXISTS(SELECT TOP 1 * FROM [AuditData] WHERE [AuditDataId] = 1 AND [AuditEventId] = 0x0B01) UPDATE [AuditData] SET [Key] = 'Associated with network AP', [Value] = 'Associated with network AP', [IsAlert] = 0 WHERE [AuditDataId] = 1 AND [AuditEventId] = 0x0B01 ELSE INSERT INTO [AuditData] ([AuditDataId], [AuditEventId], [Key], [Value], [IsAlert]) VALUES (1, 0x0B01, 'Associated with network AP', 'Associated with network AP', 0)"]
[null,"Audit","WIFI_AP_ASSOC_FAIL        ","Wi-Fi Event","Failed to associate with network AP ",11,36,"0x0B02","0000",null,null,null,null,"IF EXISTS(SELECT TOP 1 * FROM [AuditEvent] WHERE [AuditEventId] = 0x0B02) UPDATE [AuditEvent] SET [Key] = 'Wi-Fi Event', [Value] = 'Wi-Fi Event', [IsAlert] = 0 WHERE [AuditEventId] = 0x0B02 ELSE INSERT INTO [AuditEvent] ([AuditEventId], [Key], [Value], [IsAlert]) VALUES (0x0B02, 'Wi-Fi Event', 'Wi-Fi Event', 0)","IF EXISTS(SELECT TOP 1 * FROM [AuditData] WHERE [AuditDataId] = 0 AND [AuditEventId] = 0x0B02) UPDATE [AuditData] SET [Key] = 'Failed to associate with network AP ', [Value] = 'Failed to associate with network AP ', [IsAlert] = 0 WHERE [AuditDataId] = 0 AND [AuditEventId] = 0x0B02 ELSE INSERT INTO [AuditData] ([AuditDataId], [AuditEventId], [Key], [Value], [IsAlert]) VALUES (0, 0x0B02, 'Failed to associate with network AP ', 'Failed to associate with network AP ', 0)"]
[null,"Audit","WIFI_AP_ASSOC_FAIL        ","Wi-Fi Event","Wi-Fi not initialized",11,21,"0x0B02","0001",null,null,null,null,"IF EXISTS(SELECT TOP 1 * FROM [AuditEvent] WHERE [AuditEventId] = 0x0B02) UPDATE [AuditEvent] SET [Key] = 'Wi-Fi Event', [Value] = 'Wi-Fi Event', [IsAlert] = 0 WHERE [AuditEventId] = 0x0B02 ELSE INSERT INTO [AuditEvent] ([AuditEventId], [Key], [Value], [IsAlert]) VALUES (0x0B02, 'Wi-Fi Event', 'Wi-Fi Event', 0)","IF EXISTS(SELECT TOP 1 * FROM [AuditData] WHERE [AuditDataId] = 1 AND [AuditEventId] = 0x0B02) UPDATE [AuditData] SET [Key] = 'Wi-Fi not initialized', [Value] = 'Wi-Fi not initialized', [IsAlert] = 0 WHERE [AuditDataId] = 1 AND [AuditEventId] = 0x0B02 ELSE INSERT INTO [AuditData] ([AuditDataId], [AuditEventId], [Key], [Value], [IsAlert]) VALUES (1, 0x0B02, 'Wi-Fi not initialized', 'Wi-Fi not initialized', 0)"]
[null,"Audit","WIFI_AP_ASSOC_FAIL        ","Wi-Fi Event","Self-test failed",11,16,"0x0B02","0002",null,null,null,null,"IF EXISTS(SELECT TOP 1 * FROM [AuditEvent] WHERE [AuditEventId] = 0x0B02) UPDATE [AuditEvent] SET [Key] = 'Wi-Fi Event', [Value] = 'Wi-Fi Event', [IsAlert] = 0 WHERE [AuditEventId] = 0x0B02 ELSE INSERT INTO [AuditEvent] ([AuditEventId], [Key], [Value], [IsAlert]) VALUES (0x0B02, 'Wi-Fi Event', 'Wi-Fi Event', 0)","IF EXISTS(SELECT TOP 1 * FROM [AuditData] WHERE [AuditDataId] = 2 AND [AuditEventId] = 0x0B02) UPDATE [AuditData] SET [Key] = 'Self-test failed', [Value] = 'Self-test failed', [IsAlert] = 0 WHERE [AuditDataId] = 2 AND [AuditEventId] = 0x0B02 ELSE INSERT INTO [AuditData] ([AuditDataId], [AuditEventId], [Key], [Value], [IsAlert]) VALUES (2, 0x0B02, 'Self-test failed', 'Self-test failed', 0)"]
[null,"Audit","WIFI_AP_ASSOC_FAIL        ","Wi-Fi Event","Wi-Fi lockup: in data mode",11,26,"0x0B02","0003",null,null,null,null,"IF EXISTS(SELECT TOP 1 * FROM [AuditEvent] WHERE [AuditEventId] = 0x0B02) UPDATE [AuditEvent] SET [Key] = 'Wi-Fi Event', [Value] = 'Wi-Fi Event', [IsAlert] = 0 WHERE [AuditEventId] = 0x0B02 ELSE INSERT INTO [AuditEvent] ([AuditEventId], [Key], [Value], [IsAlert]) VALUES (0x0B02, 'Wi-Fi Event', 'Wi-Fi Event', 0)","IF EXISTS(SELECT TOP 1 * FROM [AuditData] WHERE [AuditDataId] = 3 AND [AuditEventId] = 0x0B02) UPDATE [AuditData] SET [Key] = 'Wi-Fi lockup: in data mode', [Value] = 'Wi-Fi lockup: in data mode', [IsAlert] = 0 WHERE [AuditDataId] = 3 AND [AuditEventId] = 0x0B02 ELSE INSERT INTO [AuditData] ([AuditDataId], [AuditEventId], [Key], [Value], [IsAlert]) VALUES (3, 0x0B02, 'Wi-Fi lockup: in data mode', 'Wi-Fi lockup: in data mode', 0)"]
[null,"Audit","WIFI_AP_ASSOC_FAIL        ","Wi-Fi Event","Power-on test failed",11,20,"0x0B02","0004",null,null,null,null,"IF EXISTS(SELECT TOP 1 * FROM [AuditEvent] WHERE [AuditEventId] = 0x0B02) UPDATE [AuditEvent] SET [Key] = 'Wi-Fi Event', [Value] = 'Wi-Fi Event', [IsAlert] = 0 WHERE [AuditEventId] = 0x0B02 ELSE INSERT INTO [AuditEvent] ([AuditEventId], [Key], [Value], [IsAlert]) VALUES (0x0B02, 'Wi-Fi Event', 'Wi-Fi Event', 0)","IF EXISTS(SELECT TOP 1 * FROM [AuditData] WHERE [AuditDataId] = 4 AND [AuditEventId] = 0x0B02) UPDATE [AuditData] SET [Key] = 'Power-on test failed', [Value] = 'Power-on test failed', [IsAlert] = 0 WHERE [AuditDataId] = 4 AND [AuditEventId] = 0x0B02 ELSE INSERT INTO [AuditData] ([AuditDataId], [AuditEventId], [Key], [Value], [IsAlert]) VALUES (4, 0x0B02, 'Power-on test failed', 'Power-on test failed', 0)"]
[null,"Audit","WIFI_AP_ASSOC_FAIL        ","Wi-Fi Event","Invalid configuration ",11,22,"0x0B02","0005",null,null,null,null,"IF EXISTS(SELECT TOP 1 * FROM [AuditEvent] WHERE [AuditEventId] = 0x0B02) UPDATE [AuditEvent] SET [Key] = 'Wi-Fi Event', [Value] = 'Wi-Fi Event', [IsAlert] = 0 WHERE [AuditEventId] = 0x0B02 ELSE INSERT INTO [AuditEvent] ([AuditEventId], [Key], [Value], [IsAlert]) VALUES (0x0B02, 'Wi-Fi Event', 'Wi-Fi Event', 0)","IF EXISTS(SELECT TOP 1 * FROM [AuditData] WHERE [AuditDataId] = 5 AND [AuditEventId] = 0x0B02) UPDATE [AuditData] SET [Key] = 'Invalid configuration ', [Value] = 'Invalid configuration ', [IsAlert] = 0 WHERE [AuditDataId] = 5 AND [AuditEventId] = 0x0B02 ELSE INSERT INTO [AuditData] ([AuditDataId], [AuditEventId], [Key], [Value], [IsAlert]) VALUES (5, 0x0B02, 'Invalid configuration ', 'Invalid configuration ', 0)"]
[null,"Audit","WIFI_AP_ASSOC_FAIL        ","Wi-Fi Event","Configuration failed",11,20,"0x0B02","0006",null,null,null,null,"IF EXISTS(SELECT TOP 1 * FROM [AuditEvent] WHERE [AuditEventId] = 0x0B02) UPDATE [AuditEvent] SET [Key] = 'Wi-Fi Event', [Value] = 'Wi-Fi Event', [IsAlert] = 0 WHERE [AuditEventId] = 0x0B02 ELSE INSERT INTO [AuditEvent] ([AuditEventId], [Key], [Value], [IsAlert]) VALUES (0x0B02, 'Wi-Fi Event', 'Wi-Fi Event', 0)","IF EXISTS(SELECT TOP 1 * FROM [AuditData] WHERE [AuditDataId] = 6 AND [AuditEventId] = 0x0B02) UPDATE [AuditData] SET [Key] = 'Configuration failed', [Value] = 'Configuration failed', [IsAlert] = 0 WHERE [AuditDataId] = 6 AND [AuditEventId] = 0x0B02 ELSE INSERT INTO [AuditData] ([AuditDataId], [AuditEventId], [Key], [Value], [IsAlert]) VALUES (6, 0x0B02, 'Configuration failed', 'Configuration failed', 0)"]
[null,"Audit","WIFI_AP_ASSOC_FAIL        ","Wi-Fi Event","Network AP association failed",11,29,"0x0B02","0007",null,null,null,null,"IF EXISTS(SELECT TOP 1 * FROM [AuditEvent] WHERE [AuditEventId] = 0x0B02) UPDATE [AuditEvent] SET [Key] = 'Wi-Fi Event', [Value] = 'Wi-Fi Event', [IsAlert] = 0 WHERE [AuditEventId] = 0x0B02 ELSE INSERT INTO [AuditEvent] ([AuditEventId], [Key], [Value], [IsAlert]) VALUES (0x0B02, 'Wi-Fi Event', 'Wi-Fi Event', 0)","IF EXISTS(SELECT TOP 1 * FROM [AuditData] WHERE [AuditDataId] = 7 AND [AuditEventId] = 0x0B02) UPDATE [AuditData] SET [Key] = 'Network AP association failed', [Value] = 'Network AP association failed', [IsAlert] = 0 WHERE [AuditDataId] = 7 AND [AuditEventId] = 0x0B02 ELSE INSERT INTO [AuditData] ([AuditDataId], [AuditEventId], [Key], [Value], [IsAlert]) VALUES (7, 0x0B02, 'Network AP association failed', 'Network AP association failed', 0)"]
[null,"Audit","WIFI_AP_ASSOC_FAIL        ","Wi-Fi Event","Network AP disassociation failed",11,32,"0x0B02","0008",null,null,null,null,"IF EXISTS(SELECT TOP 1 * FROM [AuditEvent] WHERE [AuditEventId] = 0x0B02) UPDATE [AuditEvent] SET [Key] = 'Wi-Fi Event', [Value] = 'Wi-Fi Event', [IsAlert] = 0 WHERE [AuditEventId] = 0x0B02 ELSE INSERT INTO [AuditEvent] ([AuditEventId], [Key], [Value], [IsAlert]) VALUES (0x0B02, 'Wi-Fi Event', 'Wi-Fi Event', 0)","IF EXISTS(SELECT TOP 1 * FROM [AuditData] WHERE [AuditDataId] = 8 AND [AuditEventId] = 0x0B02) UPDATE [AuditData] SET [Key] = 'Network AP disassociation failed', [Value] = 'Network AP disassociation failed', [IsAlert] = 0 WHERE [AuditDataId] = 8 AND [AuditEventId] = 0x0B02 ELSE INSERT INTO [AuditData] ([AuditDataId], [AuditEventId], [Key], [Value], [IsAlert]) VALUES (8, 0x0B02, 'Network AP disassociation failed', 'Network AP disassociation failed', 0)"]
[null,"Audit","WIFI_AP_ASSOC_FAIL        ","Wi-Fi Event","Failed to obtain IP address",11,27,"0x0B02","0009",null,null,null,null,"IF EXISTS(SELECT TOP 1 * FROM [AuditEvent] WHERE [AuditEventId] = 0x0B02) UPDATE [AuditEvent] SET [Key] = 'Wi-Fi Event', [Value] = 'Wi-Fi Event', [IsAlert] = 0 WHERE [AuditEventId] = 0x0B02 ELSE INSERT INTO [AuditEvent] ([AuditEventId], [Key], [Value], [IsAlert]) VALUES (0x0B02, 'Wi-Fi Event', 'Wi-Fi Event', 0)","IF EXISTS(SELECT TOP 1 * FROM [AuditData] WHERE [AuditDataId] = 9 AND [AuditEventId] = 0x0B02) UPDATE [AuditData] SET [Key] = 'Failed to obtain IP address', [Value] = 'Failed to obtain IP address', [IsAlert] = 0 WHERE [AuditDataId] = 9 AND [AuditEventId] = 0x0B02 ELSE INSERT INTO [AuditData] ([AuditDataId], [AuditEventId], [Key], [Value], [IsAlert]) VALUES (9, 0x0B02, 'Failed to obtain IP address', 'Failed to obtain IP address', 0)"]
[null,"Audit","WIFI_AP_ASSOC_FAIL        ","Wi-Fi Event","Cannot connect to host",11,22,"0x0B02","000A",null,null,null,null,"IF EXISTS(SELECT TOP 1 * FROM [AuditEvent] WHERE [AuditEventId] = 0x0B02) UPDATE [AuditEvent] SET [Key] = 'Wi-Fi Event', [Value] = 'Wi-Fi Event', [IsAlert] = 0 WHERE [AuditEventId] = 0x0B02 ELSE INSERT INTO [AuditEvent] ([AuditEventId], [Key], [Value], [IsAlert]) VALUES (0x0B02, 'Wi-Fi Event', 'Wi-Fi Event', 0)","IF EXISTS(SELECT TOP 1 * FROM [AuditData] WHERE [AuditDataId] = 10 AND [AuditEventId] = 0x0B02) UPDATE [AuditData] SET [Key] = 'Cannot connect to host', [Value] = 'Cannot connect to host', [IsAlert] = 0 WHERE [AuditDataId] = 10 AND [AuditEventId] = 0x0B02 ELSE INSERT INTO [AuditData] ([AuditDataId], [AuditEventId], [Key], [Value], [IsAlert]) VALUES (10, 0x0B02, 'Cannot connect to host', 'Cannot connect to host', 0)"]
[null,"Audit","WIFI_AP_ASSOC_FAIL        ","Wi-Fi Event","DNS Failed",11,10,"0x0B02","000B",null,null,null,null,"IF EXISTS(SELECT TOP 1 * FROM [AuditEvent] WHERE [AuditEventId] = 0x0B02) UPDATE [AuditEvent] SET [Key] = 'Wi-Fi Event', [Value] = 'Wi-Fi Event', [IsAlert] = 0 WHERE [AuditEventId] = 0x0B02 ELSE INSERT INTO [AuditEvent] ([AuditEventId], [Key], [Value], [IsAlert]) VALUES (0x0B02, 'Wi-Fi Event', 'Wi-Fi Event', 0)","IF EXISTS(SELECT TOP 1 * FROM [AuditData] WHERE [AuditDataId] = 11 AND [AuditEventId] = 0x0B02) UPDATE [AuditData] SET [Key] = 'DNS Failed', [Value] = 'DNS Failed', [IsAlert] = 0 WHERE [AuditDataId] = 11 AND [AuditEventId] = 0x0B02 ELSE INSERT INTO [AuditData] ([AuditDataId], [AuditEventId], [Key], [Value], [IsAlert]) VALUES (11, 0x0B02, 'DNS Failed', 'DNS Failed', 0)"]
[null,"Audit","WIFI_AP_ASSOC_FAIL        ","Wi-Fi Event","Wi-Fi configurations not set",11,28,"0x0B02","000C",null,null,null,null,"IF EXISTS(SELECT TOP 1 * FROM [AuditEvent] WHERE [AuditEventId] = 0x0B02) UPDATE [AuditEvent] SET [Key] = 'Wi-Fi Event', [Value] = 'Wi-Fi Event', [IsAlert] = 0 WHERE [AuditEventId] = 0x0B02 ELSE INSERT INTO [AuditEvent] ([AuditEventId], [Key], [Value], [IsAlert]) VALUES (0x0B02, 'Wi-Fi Event', 'Wi-Fi Event', 0)","IF EXISTS(SELECT TOP 1 * FROM [AuditData] WHERE [AuditDataId] = 12 AND [AuditEventId] = 0x0B02) UPDATE [AuditData] SET [Key] = 'Wi-Fi configurations not set', [Value] = 'Wi-Fi configurations not set', [IsAlert] = 0 WHERE [AuditDataId] = 12 AND [AuditEventId] = 0x0B02 ELSE INSERT INTO [AuditData] ([AuditDataId], [AuditEventId], [Key], [Value], [IsAlert]) VALUES (12, 0x0B02, 'Wi-Fi configurations not set', 'Wi-Fi configurations not set', 0)"]
[null,"Audit","WIFI_AP_ASSOC_FAIL        ","Wi-Fi Event","Communication failure",11,21,"0x0B02","000D",null,null,null,null,"IF EXISTS(SELECT TOP 1 * FROM [AuditEvent] WHERE [AuditEventId] = 0x0B02) UPDATE [AuditEvent] SET [Key] = 'Wi-Fi Event', [Value] = 'Wi-Fi Event', [IsAlert] = 0 WHERE [AuditEventId] = 0x0B02 ELSE INSERT INTO [AuditEvent] ([AuditEventId], [Key], [Value], [IsAlert]) VALUES (0x0B02, 'Wi-Fi Event', 'Wi-Fi Event', 0)","IF EXISTS(SELECT TOP 1 * FROM [AuditData] WHERE [AuditDataId] = 13 AND [AuditEventId] = 0x0B02) UPDATE [AuditData] SET [Key] = 'Communication failure', [Value] = 'Communication failure', [IsAlert] = 0 WHERE [AuditDataId] = 13 AND [AuditEventId] = 0x0B02 ELSE INSERT INTO [AuditData] ([AuditDataId], [AuditEventId], [Key], [Value], [IsAlert]) VALUES (13, 0x0B02, 'Communication failure', 'Communication failure', 0)"]
[null,"Audit","WIFI_AP_ASSOC_FAIL        ","Wi-Fi Event","Write config to memory fail",11,27,"0x0B02","000E",null,null,null,null,"IF EXISTS(SELECT TOP 1 * FROM [AuditEvent] WHERE [AuditEventId] = 0x0B02) UPDATE [AuditEvent] SET [Key] = 'Wi-Fi Event', [Value] = 'Wi-Fi Event', [IsAlert] = 0 WHERE [AuditEventId] = 0x0B02 ELSE INSERT INTO [AuditEvent] ([AuditEventId], [Key], [Value], [IsAlert]) VALUES (0x0B02, 'Wi-Fi Event', 'Wi-Fi Event', 0)","IF EXISTS(SELECT TOP 1 * FROM [AuditData] WHERE [AuditDataId] = 14 AND [AuditEventId] = 0x0B02) UPDATE [AuditData] SET [Key] = 'Write config to memory fail', [Value] = 'Write config to memory fail', [IsAlert] = 0 WHERE [AuditDataId] = 14 AND [AuditEventId] = 0x0B02 ELSE INSERT INTO [AuditData] ([AuditDataId], [AuditEventId], [Key], [Value], [IsAlert]) VALUES (14, 0x0B02, 'Write config to memory fail', 'Write config to memory fail', 0)"]
[null,"Audit","WIFI_AP_ASSOC_FAIL        ","Wi-Fi Event","Error getting data from host",11,28,"0x0B02","000F",null,null,null,null,"IF EXISTS(SELECT TOP 1 * FROM [AuditEvent] WHERE [AuditEventId] = 0x0B02) UPDATE [AuditEvent] SET [Key] = 'Wi-Fi Event', [Value] = 'Wi-Fi Event', [IsAlert] = 0 WHERE [AuditEventId] = 0x0B02 ELSE INSERT INTO [AuditEvent] ([AuditEventId], [Key], [Value], [IsAlert]) VALUES (0x0B02, 'Wi-Fi Event', 'Wi-Fi Event', 0)","IF EXISTS(SELECT TOP 1 * FROM [AuditData] WHERE [AuditDataId] = 15 AND [AuditEventId] = 0x0B02) UPDATE [AuditData] SET [Key] = 'Error getting data from host', [Value] = 'Error getting data from host', [IsAlert] = 0 WHERE [AuditDataId] = 15 AND [AuditEventId] = 0x0B02 ELSE INSERT INTO [AuditData] ([AuditDataId], [AuditEventId], [Key], [Value], [IsAlert]) VALUES (15, 0x0B02, 'Error getting data from host', 'Error getting data from host', 0)"]
[null,"Audit","WIFI_AP_ASSOC_FAIL        ","Wi-Fi Event","Error sending data to host",11,26,"0x0B02","0010",null,null,null,null,"IF EXISTS(SELECT TOP 1 * FROM [AuditEvent] WHERE [AuditEventId] = 0x0B02) UPDATE [AuditEvent] SET [Key] = 'Wi-Fi Event', [Value] = 'Wi-Fi Event', [IsAlert] = 0 WHERE [AuditEventId] = 0x0B02 ELSE INSERT INTO [AuditEvent] ([AuditEventId], [Key], [Value], [IsAlert]) VALUES (0x0B02, 'Wi-Fi Event', 'Wi-Fi Event', 0)","IF EXISTS(SELECT TOP 1 * FROM [AuditData] WHERE [AuditDataId] = 16 AND [AuditEventId] = 0x0B02) UPDATE [AuditData] SET [Key] = 'Error sending data to host', [Value] = 'Error sending data to host', [IsAlert] = 0 WHERE [AuditDataId] = 16 AND [AuditEventId] = 0x0B02 ELSE INSERT INTO [AuditData] ([AuditDataId], [AuditEventId], [Key], [Value], [IsAlert]) VALUES (16, 0x0B02, 'Error sending data to host', 'Error sending data to host', 0)"]
[null,"Audit","WIFI_AP_ASSOC_FAIL        ","Wi-Fi Event","Unsupported feature",11,19,"0x0B02","0011",null,null,null,null,"IF EXISTS(SELECT TOP 1 * FROM [AuditEvent] WHERE [AuditEventId] = 0x0B02) UPDATE [AuditEvent] SET [Key] = 'Wi-Fi Event', [Value] = 'Wi-Fi Event', [IsAlert] = 0 WHERE [AuditEventId] = 0x0B02 ELSE INSERT INTO [AuditEvent] ([AuditEventId], [Key], [Value], [IsAlert]) VALUES (0x0B02, 'Wi-Fi Event', 'Wi-Fi Event', 0)","IF EXISTS(SELECT TOP 1 * FROM [AuditData] WHERE [AuditDataId] = 17 AND [AuditEventId] = 0x0B02) UPDATE [AuditData] SET [Key] = 'Unsupported feature', [Value] = 'Unsupported feature', [IsAlert] = 0 WHERE [AuditDataId] = 17 AND [AuditEventId] = 0x0B02 ELSE INSERT INTO [AuditData] ([AuditDataId], [AuditEventId], [Key], [Value], [IsAlert]) VALUES (17, 0x0B02, 'Unsupported feature', 'Unsupported feature', 0)"]
[null,"Audit","WIFI_AP_ASSOC_FAIL        ","Wi-Fi Event","HTTP error received from host",11,29,"0x0B02","0012",null,null,null,null,"IF EXISTS(SELECT TOP 1 * FROM [AuditEvent] WHERE [AuditEventId] = 0x0B02) UPDATE [AuditEvent] SET [Key] = 'Wi-Fi Event', [Value] = 'Wi-Fi Event', [IsAlert] = 0 WHERE [AuditEventId] = 0x0B02 ELSE INSERT INTO [AuditEvent] ([AuditEventId], [Key], [Value], [IsAlert]) VALUES (0x0B02, 'Wi-Fi Event', 'Wi-Fi Event', 0)","IF EXISTS(SELECT TOP 1 * FROM [AuditData] WHERE [AuditDataId] = 18 AND [AuditEventId] = 0x0B02) UPDATE [AuditData] SET [Key] = 'HTTP error received from host', [Value] = 'HTTP error received from host', [IsAlert] = 0 WHERE [AuditDataId] = 18 AND [AuditEventId] = 0x0B02 ELSE INSERT INTO [AuditData] ([AuditDataId], [AuditEventId], [Key], [Value], [IsAlert]) VALUES (18, 0x0B02, 'HTTP error received from host', 'HTTP error received from host', 0)"]
[null,"Audit","WIFI_AP_ASSOC_FAIL        ","Wi-Fi Event","Unknown lock name in URL",11,24,"0x0B02","0013",null,null,null,null,"IF EXISTS(SELECT TOP 1 * FROM [AuditEvent] WHERE [AuditEventId] = 0x0B02) UPDATE [AuditEvent] SET [Key] = 'Wi-Fi Event', [Value] = 'Wi-Fi Event', [IsAlert] = 0 WHERE [AuditEventId] = 0x0B02 ELSE INSERT INTO [AuditEvent] ([AuditEventId], [Key], [Value], [IsAlert]) VALUES (0x0B02, 'Wi-Fi Event', 'Wi-Fi Event', 0)","IF EXISTS(SELECT TOP 1 * FROM [AuditData] WHERE [AuditDataId] = 19 AND [AuditEventId] = 0x0B02) UPDATE [AuditData] SET [Key] = 'Unknown lock name in URL', [Value] = 'Unknown lock name in URL', [IsAlert] = 0 WHERE [AuditDataId] = 19 AND [AuditEventId] = 0x0B02 ELSE INSERT INTO [AuditData] ([AuditDataId], [AuditEventId], [Key], [Value], [IsAlert]) VALUES (19, 0x0B02, 'Unknown lock name in URL', 'Unknown lock name in URL', 0)"]
[null,"Audit","WIFI_AP_ASSOC_FAIL        ","Wi-Fi Event","FTP config error",11,16,"0x0B02","0014",null,null,null,null,"IF EXISTS(SELECT TOP 1 * FROM [AuditEvent] WHERE [AuditEventId] = 0x0B02) UPDATE [AuditEvent] SET [Key] = 'Wi-Fi Event', [Value] = 'Wi-Fi Event', [IsAlert] = 0 WHERE [AuditEventId] = 0x0B02 ELSE INSERT INTO [AuditEvent] ([AuditEventId], [Key], [Value], [IsAlert]) VALUES (0x0B02, 'Wi-Fi Event', 'Wi-Fi Event', 0)","IF EXISTS(SELECT TOP 1 * FROM [AuditData] WHERE [AuditDataId] = 20 AND [AuditEventId] = 0x0B02) UPDATE [AuditData] SET [Key] = 'FTP config error', [Value] = 'FTP config error', [IsAlert] = 0 WHERE [AuditDataId] = 20 AND [AuditEventId] = 0x0B02 ELSE INSERT INTO [AuditData] ([AuditDataId], [AuditEventId], [Key], [Value], [IsAlert]) VALUES (20, 0x0B02, 'FTP config error', 'FTP config error', 0)"]
[null,"Audit","WIFI_AP_ASSOC_FAIL        ","Wi-Fi Event","Cannot reconnect to network",11,27,"0x0B02","0015",null,null,null,null,"IF EXISTS(SELECT TOP 1 * FROM [AuditEvent] WHERE [AuditEventId] = 0x0B02) UPDATE [AuditEvent] SET [Key] = 'Wi-Fi Event', [Value] = 'Wi-Fi Event', [IsAlert] = 0 WHERE [AuditEventId] = 0x0B02 ELSE INSERT INTO [AuditEvent] ([AuditEventId], [Key], [Value], [IsAlert]) VALUES (0x0B02, 'Wi-Fi Event', 'Wi-Fi Event', 0)","IF EXISTS(SELECT TOP 1 * FROM [AuditData] WHERE [AuditDataId] = 21 AND [AuditEventId] = 0x0B02) UPDATE [AuditData] SET [Key] = 'Cannot reconnect to network', [Value] = 'Cannot reconnect to network', [IsAlert] = 0 WHERE [AuditDataId] = 21 AND [AuditEventId] = 0x0B02 ELSE INSERT INTO [AuditData] ([AuditDataId], [AuditEventId], [Key], [Value], [IsAlert]) VALUES (21, 0x0B02, 'Cannot reconnect to network', 'Cannot reconnect to network', 0)"]
[null,"Audit","WIFI_AP_ASSOC_FAIL        ","Wi-Fi Event","Data size too large",11,19,"0x0B02","0016",null,null,null,null,"IF EXISTS(SELECT TOP 1 * FROM [AuditEvent] WHERE [AuditEventId] = 0x0B02) UPDATE [AuditEvent] SET [Key] = 'Wi-Fi Event', [Value] = 'Wi-Fi Event', [IsAlert] = 0 WHERE [AuditEventId] = 0x0B02 ELSE INSERT INTO [AuditEvent] ([AuditEventId], [Key], [Value], [IsAlert]) VALUES (0x0B02, 'Wi-Fi Event', 'Wi-Fi Event', 0)","IF EXISTS(SELECT TOP 1 * FROM [AuditData] WHERE [AuditDataId] = 22 AND [AuditEventId] = 0x0B02) UPDATE [AuditData] SET [Key] = 'Data size too large', [Value] = 'Data size too large', [IsAlert] = 0 WHERE [AuditDataId] = 22 AND [AuditEventId] = 0x0B02 ELSE INSERT INTO [AuditData] ([AuditDataId], [AuditEventId], [Key], [Value], [IsAlert]) VALUES (22, 0x0B02, 'Data size too large', 'Data size too large', 0)"]
[null,"Audit","WIFI_AP_ASSOC_FAIL        ","Wi-Fi Event","No buffer during download",11,25,"0x0B02","0017",null,null,null,null,"IF EXISTS(SELECT TOP 1 * FROM [AuditEvent] WHERE [AuditEventId] = 0x0B02) UPDATE [AuditEvent] SET [Key] = 'Wi-Fi Event', [Value] = 'Wi-Fi Event', [IsAlert] = 0 WHERE [AuditEventId] = 0x0B02 ELSE INSERT INTO [AuditEvent] ([AuditEventId], [Key], [Value], [IsAlert]) VALUES (0x0B02, 'Wi-Fi Event', 'Wi-Fi Event', 0)","IF EXISTS(SELECT TOP 1 * FROM [AuditData] WHERE [AuditDataId] = 23 AND [AuditEventId] = 0x0B02) UPDATE [AuditData] SET [Key] = 'No buffer during download', [Value] = 'No buffer during download', [IsAlert] = 0 WHERE [AuditDataId] = 23 AND [AuditEventId] = 0x0B02 ELSE INSERT INTO [AuditData] ([AuditDataId], [AuditEventId], [Key], [Value], [IsAlert]) VALUES (23, 0x0B02, 'No buffer during download', 'No buffer during download', 0)"]
[null,"Audit","WIFI_AP_ASSOC_FAIL        ","Wi-Fi Event","UART read failed",11,16,"0x0B02","0018",null,null,null,null,"IF EXISTS(SELECT TOP 1 * FROM [AuditEvent] WHERE [AuditEventId] = 0x0B02) UPDATE [AuditEvent] SET [Key] = 'Wi-Fi Event', [Value] = 'Wi-Fi Event', [IsAlert] = 0 WHERE [AuditEventId] = 0x0B02 ELSE INSERT INTO [AuditEvent] ([AuditEventId], [Key], [Value], [IsAlert]) VALUES (0x0B02, 'Wi-Fi Event', 'Wi-Fi Event', 0)","IF EXISTS(SELECT TOP 1 * FROM [AuditData] WHERE [AuditDataId] = 24 AND [AuditEventId] = 0x0B02) UPDATE [AuditData] SET [Key] = 'UART read failed', [Value] = 'UART read failed', [IsAlert] = 0 WHERE [AuditDataId] = 24 AND [AuditEventId] = 0x0B02 ELSE INSERT INTO [AuditData] ([AuditDataId], [AuditEventId], [Key], [Value], [IsAlert]) VALUES (24, 0x0B02, 'UART read failed', 'UART read failed', 0)"]
[null,"Audit","WIFI_AP_ASSOC_FAIL        ","Wi-Fi Event","UART write failed",11,17,"0x0B02","0019",null,null,null,null,"IF EXISTS(SELECT TOP 1 * FROM [AuditEvent] WHERE [AuditEventId] = 0x0B02) UPDATE [AuditEvent] SET [Key] = 'Wi-Fi Event', [Value] = 'Wi-Fi Event', [IsAlert] = 0 WHERE [AuditEventId] = 0x0B02 ELSE INSERT INTO [AuditEvent] ([AuditEventId], [Key], [Value], [IsAlert]) VALUES (0x0B02, 'Wi-Fi Event', 'Wi-Fi Event', 0)","IF EXISTS(SELECT TOP 1 * FROM [AuditData] WHERE [AuditDataId] = 25 AND [AuditEventId] = 0x0B02) UPDATE [AuditData] SET [Key] = 'UART write failed', [Value] = 'UART write failed', [IsAlert] = 0 WHERE [AuditDataId] = 25 AND [AuditEventId] = 0x0B02 ELSE INSERT INTO [AuditData] ([AuditDataId], [AuditEventId], [Key], [Value], [IsAlert]) VALUES (25, 0x0B02, 'UART write failed', 'UART write failed', 0)"]
[null,"Audit","WIFI_AP_ASSOC_FAIL        ","Wi-Fi Event","Error writing to memory",11,23,"0x0B02","001A",null,null,null,null,"IF EXISTS(SELECT TOP 1 * FROM [AuditEvent] WHERE [AuditEventId] = 0x0B02) UPDATE [AuditEvent] SET [Key] = 'Wi-Fi Event', [Value] = 'Wi-Fi Event', [IsAlert] = 0 WHERE [AuditEventId] = 0x0B02 ELSE INSERT INTO [AuditEvent] ([AuditEventId], [Key], [Value], [IsAlert]) VALUES (0x0B02, 'Wi-Fi Event', 'Wi-Fi Event', 0)","IF EXISTS(SELECT TOP 1 * FROM [AuditData] WHERE [AuditDataId] = 26 AND [AuditEventId] = 0x0B02) UPDATE [AuditData] SET [Key] = 'Error writing to memory', [Value] = 'Error writing to memory', [IsAlert] = 0 WHERE [AuditDataId] = 26 AND [AuditEventId] = 0x0B02 ELSE INSERT INTO [AuditData] ([AuditDataId], [AuditEventId], [Key], [Value], [IsAlert]) VALUES (26, 0x0B02, 'Error writing to memory', 'Error writing to memory', 0)"]
[null,"Audit","WIFI_AP_ASSOC_FAIL        ","Wi-Fi Event","Error erasing memory",11,20,"0x0B02","001B",null,null,null,null,"IF EXISTS(SELECT TOP 1 * FROM [AuditEvent] WHERE [AuditEventId] = 0x0B02) UPDATE [AuditEvent] SET [Key] = 'Wi-Fi Event', [Value] = 'Wi-Fi Event', [IsAlert] = 0 WHERE [AuditEventId] = 0x0B02 ELSE INSERT INTO [AuditEvent] ([AuditEventId], [Key], [Value], [IsAlert]) VALUES (0x0B02, 'Wi-Fi Event', 'Wi-Fi Event', 0)","IF EXISTS(SELECT TOP 1 * FROM [AuditData] WHERE [AuditDataId] = 27 AND [AuditEventId] = 0x0B02) UPDATE [AuditData] SET [Key] = 'Error erasing memory', [Value] = 'Error erasing memory', [IsAlert] = 0 WHERE [AuditDataId] = 27 AND [AuditEventId] = 0x0B02 ELSE INSERT INTO [AuditData] ([AuditDataId], [AuditEventId], [Key], [Value], [IsAlert]) VALUES (27, 0x0B02, 'Error erasing memory', 'Error erasing memory', 0)"]
[null,"Audit","WIFI_AP_ASSOC_FAIL        ","Wi-Fi Event","Failed CRC check",{"$f":"LEN(D281)","v":11},{"$f":"LEN(E281)","v":16},"0x0B02","001C",null,null,null,null,"IF EXISTS(SELECT TOP 1 * FROM [AuditEvent] WHERE [AuditEventId] = 0x0B02) UPDATE [AuditEvent] SET [Key] = 'Wi-Fi Event', [Value] = 'Wi-Fi Event', [IsAlert] = 0 WHERE [AuditEventId] = 0x0B02 ELSE INSERT INTO [AuditEvent] ([AuditEventId], [Key], [Value], [IsAlert]) VALUES (0x0B02, 'Wi-Fi Event', 'Wi-Fi Event', 0)","IF EXISTS(SELECT TOP 1 * FROM [AuditData] WHERE [AuditDataId] = 28 AND [AuditEventId] = 0x0B02) UPDATE [AuditData] SET [Key] = 'Failed CRC check', [Value] = 'Failed CRC check', [IsAlert] = 0 WHERE [AuditDataId] = 28 AND [AuditEventId] = 0x0B02 ELSE INSERT INTO [AuditData] ([AuditDataId], [AuditEventId], [Key], [Value], [IsAlert]) VALUES (28, 0x0B02, 'Failed CRC check', 'Failed CRC check', 0)"]
[null,"Audit","WIFI_AP_ASSOC_FAIL        ","Wi-Fi Event","Value not received",11,18,"0x0B02","001D",null,null,null,null,"IF EXISTS(SELECT TOP 1 * FROM [AuditEvent] WHERE [AuditEventId] = 0x0B02) UPDATE [AuditEvent] SET [Key] = 'Wi-Fi Event', [Value] = 'Wi-Fi Event', [IsAlert] = 0 WHERE [AuditEventId] = 0x0B02 ELSE INSERT INTO [AuditEvent] ([AuditEventId], [Key], [Value], [IsAlert]) VALUES (0x0B02, 'Wi-Fi Event', 'Wi-Fi Event', 0)","IF EXISTS(SELECT TOP 1 * FROM [AuditData] WHERE [AuditDataId] = 29 AND [AuditEventId] = 0x0B02) UPDATE [AuditData] SET [Key] = 'Value not received', [Value] = 'Value not received', [IsAlert] = 0 WHERE [AuditDataId] = 29 AND [AuditEventId] = 0x0B02 ELSE INSERT INTO [AuditData] ([AuditDataId], [AuditEventId], [Key], [Value], [IsAlert]) VALUES (29, 0x0B02, 'Value not received', 'Value not received', 0)"]
[null,"Audit","WIFI_AP_ASSOC_FAIL        ","Wi-Fi Event","Invalid values received",11,23,"0x0B02","001E",null,null,null,null,"IF EXISTS(SELECT TOP 1 * FROM [AuditEvent] WHERE [AuditEventId] = 0x0B02) UPDATE [AuditEvent] SET [Key] = 'Wi-Fi Event', [Value] = 'Wi-Fi Event', [IsAlert] = 0 WHERE [AuditEventId] = 0x0B02 ELSE INSERT INTO [AuditEvent] ([AuditEventId], [Key], [Value], [IsAlert]) VALUES (0x0B02, 'Wi-Fi Event', 'Wi-Fi Event', 0)","IF EXISTS(SELECT TOP 1 * FROM [AuditData] WHERE [AuditDataId] = 30 AND [AuditEventId] = 0x0B02) UPDATE [AuditData] SET [Key] = 'Invalid values received', [Value] = 'Invalid values received', [IsAlert] = 0 WHERE [AuditDataId] = 30 AND [AuditEventId] = 0x0B02 ELSE INSERT INTO [AuditData] ([AuditDataId], [AuditEventId], [Key], [Value], [IsAlert]) VALUES (30, 0x0B02, 'Invalid values received', 'Invalid values received', 0)"]
[null,"Audit","WIFI_AP_ASSOC_FAIL        ","Wi-Fi Event","Transfer to module failed",11,25,"0x0B02","001F",null,null,null,null,"IF EXISTS(SELECT TOP 1 * FROM [AuditEvent] WHERE [AuditEventId] = 0x0B02) UPDATE [AuditEvent] SET [Key] = 'Wi-Fi Event', [Value] = 'Wi-Fi Event', [IsAlert] = 0 WHERE [AuditEventId] = 0x0B02 ELSE INSERT INTO [AuditEvent] ([AuditEventId], [Key], [Value], [IsAlert]) VALUES (0x0B02, 'Wi-Fi Event', 'Wi-Fi Event', 0)","IF EXISTS(SELECT TOP 1 * FROM [AuditData] WHERE [AuditDataId] = 31 AND [AuditEventId] = 0x0B02) UPDATE [AuditData] SET [Key] = 'Transfer to module failed', [Value] = 'Transfer to module failed', [IsAlert] = 0 WHERE [AuditDataId] = 31 AND [AuditEventId] = 0x0B02 ELSE INSERT INTO [AuditData] ([AuditDataId], [AuditEventId], [Key], [Value], [IsAlert]) VALUES (31, 0x0B02, 'Transfer to module failed', 'Transfer to module failed', 0)"]
[null,"Audit","WIFI_AP_ASSOC_FAIL        ","Wi-Fi Event","Installation failed",11,19,"0x0B02","0020",null,null,null,null,"IF EXISTS(SELECT TOP 1 * FROM [AuditEvent] WHERE [AuditEventId] = 0x0B02) UPDATE [AuditEvent] SET [Key] = 'Wi-Fi Event', [Value] = 'Wi-Fi Event', [IsAlert] = 0 WHERE [AuditEventId] = 0x0B02 ELSE INSERT INTO [AuditEvent] ([AuditEventId], [Key], [Value], [IsAlert]) VALUES (0x0B02, 'Wi-Fi Event', 'Wi-Fi Event', 0)","IF EXISTS(SELECT TOP 1 * FROM [AuditData] WHERE [AuditDataId] = 32 AND [AuditEventId] = 0x0B02) UPDATE [AuditData] SET [Key] = 'Installation failed', [Value] = 'Installation failed', [IsAlert] = 0 WHERE [AuditDataId] = 32 AND [AuditEventId] = 0x0B02 ELSE INSERT INTO [AuditData] ([AuditDataId], [AuditEventId], [Key], [Value], [IsAlert]) VALUES (32, 0x0B02, 'Installation failed', 'Installation failed', 0)"]
[null,"Audit","WIFI_AP_ASSOC_FAIL        ","Wi-Fi Event","Interrupted by FDR",11,18,"0x0B02","0021",null,null,null,null,"IF EXISTS(SELECT TOP 1 * FROM [AuditEvent] WHERE [AuditEventId] = 0x0B02) UPDATE [AuditEvent] SET [Key] = 'Wi-Fi Event', [Value] = 'Wi-Fi Event', [IsAlert] = 0 WHERE [AuditEventId] = 0x0B02 ELSE INSERT INTO [AuditEvent] ([AuditEventId], [Key], [Value], [IsAlert]) VALUES (0x0B02, 'Wi-Fi Event', 'Wi-Fi Event', 0)","IF EXISTS(SELECT TOP 1 * FROM [AuditData] WHERE [AuditDataId] = 33 AND [AuditEventId] = 0x0B02) UPDATE [AuditData] SET [Key] = 'Interrupted by FDR', [Value] = 'Interrupted by FDR', [IsAlert] = 0 WHERE [AuditDataId] = 33 AND [AuditEventId] = 0x0B02 ELSE INSERT INTO [AuditData] ([AuditDataId], [AuditEventId], [Key], [Value], [IsAlert]) VALUES (33, 0x0B02, 'Interrupted by FDR', 'Interrupted by FDR', 0)"]
[null,"Audit","WIFI_AP_ASSOC_FAIL        ","Wi-Fi Event","Interrupted by Power Manager",11,28,"0x0B02","0022",null,null,null,null,"IF EXISTS(SELECT TOP 1 * FROM [AuditEvent] WHERE [AuditEventId] = 0x0B02) UPDATE [AuditEvent] SET [Key] = 'Wi-Fi Event', [Value] = 'Wi-Fi Event', [IsAlert] = 0 WHERE [AuditEventId] = 0x0B02 ELSE INSERT INTO [AuditEvent] ([AuditEventId], [Key], [Value], [IsAlert]) VALUES (0x0B02, 'Wi-Fi Event', 'Wi-Fi Event', 0)","IF EXISTS(SELECT TOP 1 * FROM [AuditData] WHERE [AuditDataId] = 34 AND [AuditEventId] = 0x0B02) UPDATE [AuditData] SET [Key] = 'Interrupted by Power Manager', [Value] = 'Interrupted by Power Manager', [IsAlert] = 0 WHERE [AuditDataId] = 34 AND [AuditEventId] = 0x0B02 ELSE INSERT INTO [AuditData] ([AuditDataId], [AuditEventId], [Key], [Value], [IsAlert]) VALUES (34, 0x0B02, 'Interrupted by Power Manager', 'Interrupted by Power Manager', 0)"]
[null,"Audit","WIFI_AP_ASSOC_FAIL        ","Wi-Fi Event","Host disconnected",11,17,"0x0B02","0023",null,null,null,null,"IF EXISTS(SELECT TOP 1 * FROM [AuditEvent] WHERE [AuditEventId] = 0x0B02) UPDATE [AuditEvent] SET [Key] = 'Wi-Fi Event', [Value] = 'Wi-Fi Event', [IsAlert] = 0 WHERE [AuditEventId] = 0x0B02 ELSE INSERT INTO [AuditEvent] ([AuditEventId], [Key], [Value], [IsAlert]) VALUES (0x0B02, 'Wi-Fi Event', 'Wi-Fi Event', 0)","IF EXISTS(SELECT TOP 1 * FROM [AuditData] WHERE [AuditDataId] = 35 AND [AuditEventId] = 0x0B02) UPDATE [AuditData] SET [Key] = 'Host disconnected', [Value] = 'Host disconnected', [IsAlert] = 0 WHERE [AuditDataId] = 35 AND [AuditEventId] = 0x0B02 ELSE INSERT INTO [AuditData] ([AuditDataId], [AuditEventId], [Key], [Value], [IsAlert]) VALUES (35, 0x0B02, 'Host disconnected', 'Host disconnected', 0)"]
[null,"Audit","WIFI_AP_ASSOC_FAIL        ","Wi-Fi Event","Disconnected from Access Point",11,30,"0x0B02","0024",null,null,null,null,"IF EXISTS(SELECT TOP 1 * FROM [AuditEvent] WHERE [AuditEventId] = 0x0B02) UPDATE [AuditEvent] SET [Key] = 'Wi-Fi Event', [Value] = 'Wi-Fi Event', [IsAlert] = 0 WHERE [AuditEventId] = 0x0B02 ELSE INSERT INTO [AuditEvent] ([AuditEventId], [Key], [Value], [IsAlert]) VALUES (0x0B02, 'Wi-Fi Event', 'Wi-Fi Event', 0)",{"$f":"IF(AND(LEFT(H289,2)=\"0x\",ISNUMBER(HEX2DEC(TRIM(I289))*1)),CONCATENATE(\"IF EXISTS(SELECT TOP 1 * FROM [AuditData] WHERE [AuditDataId] = \",HEX2DEC(I289),\" AND [AuditEventId] = \",H289,\") UPDATE [AuditData] SET [Key] = '\",E289,\"', [Value] = '\",E289,\"', [IsAlert] = 0 WHERE [AuditDataId] = \",HEX2DEC(I289),\" AND [AuditEventId] = \",H289,\" ELSE INSERT INTO [AuditData] ([AuditDataId], [AuditEventId], [Key], [Value], [IsAlert]) VALUES (\",HEX2DEC(I289),\", \",H289,\", '\",E289,\"', '\",E289,\"', 0)\"),\"-- no value\")","v":"IF EXISTS(SELECT TOP 1 * FROM [AuditData] WHERE [AuditDataId] = 36 AND [AuditEventId] = 0x0B02) UPDATE [AuditData] SET [Key] = 'Disconnected from Access Point', [Value] = 'Disconnected from Access Point', [IsAlert] = 0 WHERE [AuditDataId] = 36 AND [AuditEventId] = 0x0B02 ELSE INSERT INTO [AuditData] ([AuditDataId], [AuditEventId], [Key], [Value], [IsAlert]) VALUES (36, 0x0B02, 'Disconnected from Access Point', 'Disconnected from Access Point', 0)"}]
[null,"Audit","WIFI_AP_ASSOC_FAIL        ","Wi-Fi Event","Download timeout",11,16,"0x0B02","0025",null,null,null,null,"IF EXISTS(SELECT TOP 1 * FROM [AuditEvent] WHERE [AuditEventId] = 0x0B02) UPDATE [AuditEvent] SET [Key] = 'Wi-Fi Event', [Value] = 'Wi-Fi Event', [IsAlert] = 0 WHERE [AuditEventId] = 0x0B02 ELSE INSERT INTO [AuditEvent] ([AuditEventId], [Key], [Value], [IsAlert]) VALUES (0x0B02, 'Wi-Fi Event', 'Wi-Fi Event', 0)","IF EXISTS(SELECT TOP 1 * FROM [AuditData] WHERE [AuditDataId] = 37 AND [AuditEventId] = 0x0B02) UPDATE [AuditData] SET [Key] = 'Download timeout', [Value] = 'Download timeout', [IsAlert] = 0 WHERE [AuditDataId] = 37 AND [AuditEventId] = 0x0B02 ELSE INSERT INTO [AuditData] ([AuditDataId], [AuditEventId], [Key], [Value], [IsAlert]) VALUES (37, 0x0B02, 'Download timeout', 'Download timeout', 0)"]
[null,"Audit","WIFI_AP_ASSOC_FAIL        ","Wi-Fi Event","JSON audit framing error",11,24,"0x0B02","0026",null,null,null,null,"IF EXISTS(SELECT TOP 1 * FROM [AuditEvent] WHERE [AuditEventId] = 0x0B02) UPDATE [AuditEvent] SET [Key] = 'Wi-Fi Event', [Value] = 'Wi-Fi Event', [IsAlert] = 0 WHERE [AuditEventId] = 0x0B02 ELSE INSERT INTO [AuditEvent] ([AuditEventId], [Key], [Value], [IsAlert]) VALUES (0x0B02, 'Wi-Fi Event', 'Wi-Fi Event', 0)","IF EXISTS(SELECT TOP 1 * FROM [AuditData] WHERE [AuditDataId] = 38 AND [AuditEventId] = 0x0B02) UPDATE [AuditData] SET [Key] = 'JSON audit framing error', [Value] = 'JSON audit framing error', [IsAlert] = 0 WHERE [AuditDataId] = 38 AND [AuditEventId] = 0x0B02 ELSE INSERT INTO [AuditData] ([AuditDataId], [AuditEventId], [Key], [Value], [IsAlert]) VALUES (38, 0x0B02, 'JSON audit framing error', 'JSON audit framing error', 0)"]
[null,"Audit","WIFI_AP_ASSOC_FAIL        ","Wi-Fi Event","Failed to create HTTP header",11,28,"0x0B02","0027",null,null,null,null,{"$f":"IF(LEFT(H292,2)=\"0x\",CONCATENATE(\"IF EXISTS(SELECT TOP 1 * FROM [AuditEvent] WHERE [AuditEventId] = \",H292,\") UPDATE [AuditEvent] SET [Key] = '\",TRIM(D292),\"', [Value] = '\",TRIM(D292),\"', [IsAlert] = \",IF(B292=\"Audit\",0,1),\" WHERE [AuditEventId] = \",H292,\" ELSE INSERT INTO [AuditEvent] ([AuditEventId], [Key], [Value], [IsAlert]) VALUES (\",H292,\", '\",TRIM(D292),\"', '\",TRIM(D292),\"', \",IF(B292=\"Audit\",0,1), \")\"),\"-- no value\")","v":"IF EXISTS(SELECT TOP 1 * FROM [AuditEvent] WHERE [AuditEventId] = 0x0B02) UPDATE [AuditEvent] SET [Key] = 'Wi-Fi Event', [Value] = 'Wi-Fi Event', [IsAlert] = 0 WHERE [AuditEventId] = 0x0B02 ELSE INSERT INTO [AuditEvent] ([AuditEventId], [Key], [Value], [IsAlert]) VALUES (0x0B02, 'Wi-Fi Event', 'Wi-Fi Event', 0)"},"IF EXISTS(SELECT TOP 1 * FROM [AuditData] WHERE [AuditDataId] = 39 AND [AuditEventId] = 0x0B02) UPDATE [AuditData] SET [Key] = 'Failed to create HTTP header', [Value] = 'Failed to create HTTP header', [IsAlert] = 0 WHERE [AuditDataId] = 39 AND [AuditEventId] = 0x0B02 ELSE INSERT INTO [AuditData] ([AuditDataId], [AuditEventId], [Key], [Value], [IsAlert]) VALUES (39, 0x0B02, 'Failed to create HTTP header', 'Failed to create HTTP header', 0)"]
[null,"Audit","WIFI_AP_ASSOC_FAIL        ","Wi-Fi Event","Host did not respond",11,20,"0x0B02","0028",null,null,null,null,"IF EXISTS(SELECT TOP 1 * FROM [AuditEvent] WHERE [AuditEventId] = 0x0B02) UPDATE [AuditEvent] SET [Key] = 'Wi-Fi Event', [Value] = 'Wi-Fi Event', [IsAlert] = 0 WHERE [AuditEventId] = 0x0B02 ELSE INSERT INTO [AuditEvent] ([AuditEventId], [Key], [Value], [IsAlert]) VALUES (0x0B02, 'Wi-Fi Event', 'Wi-Fi Event', 0)","IF EXISTS(SELECT TOP 1 * FROM [AuditData] WHERE [AuditDataId] = 40 AND [AuditEventId] = 0x0B02) UPDATE [AuditData] SET [Key] = 'Host did not respond', [Value] = 'Host did not respond', [IsAlert] = 0 WHERE [AuditDataId] = 40 AND [AuditEventId] = 0x0B02 ELSE INSERT INTO [AuditData] ([AuditDataId], [AuditEventId], [Key], [Value], [IsAlert]) VALUES (40, 0x0B02, 'Host did not respond', 'Host did not respond', 0)"]
[null,"Audit","WIFI_AP_ASSOC_FAIL        ","Wi-Fi Event","Download interrupted by alert",11,29,"0x0B02","0029",null,null,null,null,"IF EXISTS(SELECT TOP 1 * FROM [AuditEvent] WHERE [AuditEventId] = 0x0B02) UPDATE [AuditEvent] SET [Key] = 'Wi-Fi Event', [Value] = 'Wi-Fi Event', [IsAlert] = 0 WHERE [AuditEventId] = 0x0B02 ELSE INSERT INTO [AuditEvent] ([AuditEventId], [Key], [Value], [IsAlert]) VALUES (0x0B02, 'Wi-Fi Event', 'Wi-Fi Event', 0)","IF EXISTS(SELECT TOP 1 * FROM [AuditData] WHERE [AuditDataId] = 41 AND [AuditEventId] = 0x0B02) UPDATE [AuditData] SET [Key] = 'Download interrupted by alert', [Value] = 'Download interrupted by alert', [IsAlert] = 0 WHERE [AuditDataId] = 41 AND [AuditEventId] = 0x0B02 ELSE INSERT INTO [AuditData] ([AuditDataId], [AuditEventId], [Key], [Value], [IsAlert]) VALUES (41, 0x0B02, 'Download interrupted by alert', 'Download interrupted by alert', 0)"]
[null,"Audit","WIFI_AP_ASSOC_FAIL        ","Wi-Fi Event","Active tamper stopped download",11,30,"0x0B02","002A",null,null,null,null,"IF EXISTS(SELECT TOP 1 * FROM [AuditEvent] WHERE [AuditEventId] = 0x0B02) UPDATE [AuditEvent] SET [Key] = 'Wi-Fi Event', [Value] = 'Wi-Fi Event', [IsAlert] = 0 WHERE [AuditEventId] = 0x0B02 ELSE INSERT INTO [AuditEvent] ([AuditEventId], [Key], [Value], [IsAlert]) VALUES (0x0B02, 'Wi-Fi Event', 'Wi-Fi Event', 0)","IF EXISTS(SELECT TOP 1 * FROM [AuditData] WHERE [AuditDataId] = 42 AND [AuditEventId] = 0x0B02) UPDATE [AuditData] SET [Key] = 'Active tamper stopped download', [Value] = 'Active tamper stopped download', [IsAlert] = 0 WHERE [AuditDataId] = 42 AND [AuditEventId] = 0x0B02 ELSE INSERT INTO [AuditData] ([AuditDataId], [AuditEventId], [Key], [Value], [IsAlert]) VALUES (42, 0x0B02, 'Active tamper stopped download', 'Active tamper stopped download', 0)"]
[" ","Audit","WIFI_AP_ASSOC_FAIL        ","Wi-Fi Event","No HTTP content received",11,24,"0x0B02","002B",null,null,null,null,"IF EXISTS(SELECT TOP 1 * FROM [AuditEvent] WHERE [AuditEventId] = 0x0B02) UPDATE [AuditEvent] SET [Key] = 'Wi-Fi Event', [Value] = 'Wi-Fi Event', [IsAlert] = 0 WHERE [AuditEventId] = 0x0B02 ELSE INSERT INTO [AuditEvent] ([AuditEventId], [Key], [Value], [IsAlert]) VALUES (0x0B02, 'Wi-Fi Event', 'Wi-Fi Event', 0)","IF EXISTS(SELECT TOP 1 * FROM [AuditData] WHERE [AuditDataId] = 43 AND [AuditEventId] = 0x0B02) UPDATE [AuditData] SET [Key] = 'No HTTP content received', [Value] = 'No HTTP content received', [IsAlert] = 0 WHERE [AuditDataId] = 43 AND [AuditEventId] = 0x0B02 ELSE INSERT INTO [AuditData] ([AuditDataId], [AuditEventId], [Key], [Value], [IsAlert]) VALUES (43, 0x0B02, 'No HTTP content received', 'No HTTP content received', 0)"]
[null,"Audit","WIFI_AP_ASSOC_FAIL        ","Wi-Fi Event","Failed to start AP mode",11,23,"0x0B02","002C",null,null,null,null,"IF EXISTS(SELECT TOP 1 * FROM [AuditEvent] WHERE [AuditEventId] = 0x0B02) UPDATE [AuditEvent] SET [Key] = 'Wi-Fi Event', [Value] = 'Wi-Fi Event', [IsAlert] = 0 WHERE [AuditEventId] = 0x0B02 ELSE INSERT INTO [AuditEvent] ([AuditEventId], [Key], [Value], [IsAlert]) VALUES (0x0B02, 'Wi-Fi Event', 'Wi-Fi Event', 0)","IF EXISTS(SELECT TOP 1 * FROM [AuditData] WHERE [AuditDataId] = 44 AND [AuditEventId] = 0x0B02) UPDATE [AuditData] SET [Key] = 'Failed to start AP mode', [Value] = 'Failed to start AP mode', [IsAlert] = 0 WHERE [AuditDataId] = 44 AND [AuditEventId] = 0x0B02 ELSE INSERT INTO [AuditData] ([AuditDataId], [AuditEventId], [Key], [Value], [IsAlert]) VALUES (44, 0x0B02, 'Failed to start AP mode', 'Failed to start AP mode', 0)"]
[null,"Audit","WIFI_AP_ASSOC_FAIL        ","Wi-Fi Event","Client mode failed",11,18,"0x0B02","002D",null,null,null,null,"IF EXISTS(SELECT TOP 1 * FROM [AuditEvent] WHERE [AuditEventId] = 0x0B02) UPDATE [AuditEvent] SET [Key] = 'Wi-Fi Event', [Value] = 'Wi-Fi Event', [IsAlert] = 0 WHERE [AuditEventId] = 0x0B02 ELSE INSERT INTO [AuditEvent] ([AuditEventId], [Key], [Value], [IsAlert]) VALUES (0x0B02, 'Wi-Fi Event', 'Wi-Fi Event', 0)","IF EXISTS(SELECT TOP 1 * FROM [AuditData] WHERE [AuditDataId] = 45 AND [AuditEventId] = 0x0B02) UPDATE [AuditData] SET [Key] = 'Client mode failed', [Value] = 'Client mode failed', [IsAlert] = 0 WHERE [AuditDataId] = 45 AND [AuditEventId] = 0x0B02 ELSE INSERT INTO [AuditData] ([AuditDataId], [AuditEventId], [Key], [Value], [IsAlert]) VALUES (45, 0x0B02, 'Client mode failed', 'Client mode failed', 0)"]
[null,"Audit","WIFI_AP_ASSOC_FAIL        ","Wi-Fi Event","AP mode active",11,14,"0x0B02","002E",null,null,null,null,"IF EXISTS(SELECT TOP 1 * FROM [AuditEvent] WHERE [AuditEventId] = 0x0B02) UPDATE [AuditEvent] SET [Key] = 'Wi-Fi Event', [Value] = 'Wi-Fi Event', [IsAlert] = 0 WHERE [AuditEventId] = 0x0B02 ELSE INSERT INTO [AuditEvent] ([AuditEventId], [Key], [Value], [IsAlert]) VALUES (0x0B02, 'Wi-Fi Event', 'Wi-Fi Event', 0)","IF EXISTS(SELECT TOP 1 * FROM [AuditData] WHERE [AuditDataId] = 46 AND [AuditEventId] = 0x0B02) UPDATE [AuditData] SET [Key] = 'AP mode active', [Value] = 'AP mode active', [IsAlert] = 0 WHERE [AuditDataId] = 46 AND [AuditEventId] = 0x0B02 ELSE INSERT INTO [AuditData] ([AuditDataId], [AuditEventId], [Key], [Value], [IsAlert]) VALUES (46, 0x0B02, 'AP mode active', 'AP mode active', 0)"]
[null,"Audit","WIFI_AP_ASSOC_FAIL        ","Wi-Fi Event","AP mode off",11,11,"0x0B02","002F",null,null,null,null,"IF EXISTS(SELECT TOP 1 * FROM [AuditEvent] WHERE [AuditEventId] = 0x0B02) UPDATE [AuditEvent] SET [Key] = 'Wi-Fi Event', [Value] = 'Wi-Fi Event', [IsAlert] = 0 WHERE [AuditEventId] = 0x0B02 ELSE INSERT INTO [AuditEvent] ([AuditEventId], [Key], [Value], [IsAlert]) VALUES (0x0B02, 'Wi-Fi Event', 'Wi-Fi Event', 0)","IF EXISTS(SELECT TOP 1 * FROM [AuditData] WHERE [AuditDataId] = 47 AND [AuditEventId] = 0x0B02) UPDATE [AuditData] SET [Key] = 'AP mode off', [Value] = 'AP mode off', [IsAlert] = 0 WHERE [AuditDataId] = 47 AND [AuditEventId] = 0x0B02 ELSE INSERT INTO [AuditData] ([AuditDataId], [AuditEventId], [Key], [Value], [IsAlert]) VALUES (47, 0x0B02, 'AP mode off', 'AP mode off', 0)"]
[null,"Audit","WIFI_AP_ASSOC_FAIL        ","Wi-Fi Event","Server auth failed",11,18,"0x0B02","0030",null,null,null,null,"IF EXISTS(SELECT TOP 1 * FROM [AuditEvent] WHERE [AuditEventId] = 0x0B02) UPDATE [AuditEvent] SET [Key] = 'Wi-Fi Event', [Value] = 'Wi-Fi Event', [IsAlert] = 0 WHERE [AuditEventId] = 0x0B02 ELSE INSERT INTO [AuditEvent] ([AuditEventId], [Key], [Value], [IsAlert]) VALUES (0x0B02, 'Wi-Fi Event', 'Wi-Fi Event', 0)","IF EXISTS(SELECT TOP 1 * FROM [AuditData] WHERE [AuditDataId] = 48 AND [AuditEventId] = 0x0B02) UPDATE [AuditData] SET [Key] = 'Server auth failed', [Value] = 'Server auth failed', [IsAlert] = 0 WHERE [AuditDataId] = 48 AND [AuditEventId] = 0x0B02 ELSE INSERT INTO [AuditData] ([AuditDataId], [AuditEventId], [Key], [Value], [IsAlert]) VALUES (48, 0x0B02, 'Server auth failed', 'Server auth failed', 0)"]
[null,"Audit","WIFI_AP_ASSOC_FAIL        ","Wi-Fi Event","Missing Site Key",null,null,"0x0B02","0031",null,null,null,null,"IF EXISTS(SELECT TOP 1 * FROM [AuditEvent] WHERE [AuditEventId] = 0x0B02) UPDATE [AuditEvent] SET [Key] = 'Wi-Fi Event', [Value] = 'Wi-Fi Event', [IsAlert] = 0 WHERE [AuditEventId] = 0x0B02 ELSE INSERT INTO [AuditEvent] ([AuditEventId], [Key], [Value], [IsAlert]) VALUES (0x0B02, 'Wi-Fi Event', 'Wi-Fi Event', 0)","IF EXISTS(SELECT TOP 1 * FROM [AuditData] WHERE [AuditDataId] = 49 AND [AuditEventId] = 0x0B02) UPDATE [AuditData] SET [Key] = 'Missing Site Key', [Value] = 'Missing Site Key', [IsAlert] = 0 WHERE [AuditDataId] = 49 AND [AuditEventId] = 0x0B02 ELSE INSERT INTO [AuditData] ([AuditDataId], [AuditEventId], [Key], [Value], [IsAlert]) VALUES (49, 0x0B02, 'Missing Site Key', 'Missing Site Key', 0)"]
[null,"Audit","WIFI_AP_ASSOC_FAIL        ","Wi-Fi Event","Download Retry",null,null,"0x0B02","0032",null,null,null,null,"IF EXISTS(SELECT TOP 1 * FROM [AuditEvent] WHERE [AuditEventId] = 0x0B02) UPDATE [AuditEvent] SET [Key] = 'Wi-Fi Event', [Value] = 'Wi-Fi Event', [IsAlert] = 0 WHERE [AuditEventId] = 0x0B02 ELSE INSERT INTO [AuditEvent] ([AuditEventId], [Key], [Value], [IsAlert]) VALUES (0x0B02, 'Wi-Fi Event', 'Wi-Fi Event', 0)","IF EXISTS(SELECT TOP 1 * FROM [AuditData] WHERE [AuditDataId] = 50 AND [AuditEventId] = 0x0B02) UPDATE [AuditData] SET [Key] = 'Download Retry', [Value] = 'Download Retry', [IsAlert] = 0 WHERE [AuditDataId] = 50 AND [AuditEventId] = 0x0B02 ELSE INSERT INTO [AuditData] ([AuditDataId], [AuditEventId], [Key], [Value], [IsAlert]) VALUES (50, 0x0B02, 'Download Retry', 'Download Retry', 0)"]
[null,"Audit","WIFI_AP_ASSOC_FAIL        ","Wi-Fi Event","AP Mode timeout Error",null,null,"0x0B02","0033",null,null,null,null,"IF EXISTS(SELECT TOP 1 * FROM [AuditEvent] WHERE [AuditEventId] = 0x0B02) UPDATE [AuditEvent] SET [Key] = 'Wi-Fi Event', [Value] = 'Wi-Fi Event', [IsAlert] = 0 WHERE [AuditEventId] = 0x0B02 ELSE INSERT INTO [AuditEvent] ([AuditEventId], [Key], [Value], [IsAlert]) VALUES (0x0B02, 'Wi-Fi Event', 'Wi-Fi Event', 0)","IF EXISTS(SELECT TOP 1 * FROM [AuditData] WHERE [AuditDataId] = 51 AND [AuditEventId] = 0x0B02) UPDATE [AuditData] SET [Key] = 'AP Mode timeout Error', [Value] = 'AP Mode timeout Error', [IsAlert] = 0 WHERE [AuditDataId] = 51 AND [AuditEventId] = 0x0B02 ELSE INSERT INTO [AuditData] ([AuditDataId], [AuditEventId], [Key], [Value], [IsAlert]) VALUES (51, 0x0B02, 'AP Mode timeout Error', 'AP Mode timeout Error', 0)"]
[null,"Audit","WIFI_AP_ASSOC_FAIL        ","Wi-Fi Event","Incorrect SSID or Password",null,null,"0x0B02","0035",null,null,null,null,"IF EXISTS(SELECT TOP 1 * FROM [AuditEvent] WHERE [AuditEventId] = 0x0B02) UPDATE [AuditEvent] SET [Key] = 'Wi-Fi Event', [Value] = 'Wi-Fi Event', [IsAlert] = 0 WHERE [AuditEventId] = 0x0B02 ELSE INSERT INTO [AuditEvent] ([AuditEventId], [Key], [Value], [IsAlert]) VALUES (0x0B02, 'Wi-Fi Event', 'Wi-Fi Event', 0)","IF EXISTS(SELECT TOP 1 * FROM [AuditData] WHERE [AuditDataId] = 53 AND [AuditEventId] = 0x0B02) UPDATE [AuditData] SET [Key] = 'Incorrect SSID or Password', [Value] = 'Incorrect SSID or Password', [IsAlert] = 0 WHERE [AuditDataId] = 53 AND [AuditEventId] = 0x0B02 ELSE INSERT INTO [AuditData] ([AuditDataId], [AuditEventId], [Key], [Value], [IsAlert]) VALUES (53, 0x0B02, 'Incorrect SSID or Password', 'Incorrect SSID or Password', 0)"]
[null,"Audit","WIFI_AP_ASSOC_FAIL        ","Wi-Fi Event","Incorrect SSID or Poor Signal",null,null,"0x0B02","0036",null,null,null,null,"IF EXISTS(SELECT TOP 1 * FROM [AuditEvent] WHERE [AuditEventId] = 0x0B02) UPDATE [AuditEvent] SET [Key] = 'Wi-Fi Event', [Value] = 'Wi-Fi Event', [IsAlert] = 0 WHERE [AuditEventId] = 0x0B02 ELSE INSERT INTO [AuditEvent] ([AuditEventId], [Key], [Value], [IsAlert]) VALUES (0x0B02, 'Wi-Fi Event', 'Wi-Fi Event', 0)","IF EXISTS(SELECT TOP 1 * FROM [AuditData] WHERE [AuditDataId] = 54 AND [AuditEventId] = 0x0B02) UPDATE [AuditData] SET [Key] = 'Incorrect SSID or Poor Signal', [Value] = 'Incorrect SSID or Poor Signal', [IsAlert] = 0 WHERE [AuditDataId] = 54 AND [AuditEventId] = 0x0B02 ELSE INSERT INTO [AuditData] ([AuditDataId], [AuditEventId], [Key], [Value], [IsAlert]) VALUES (54, 0x0B02, 'Incorrect SSID or Poor Signal', 'Incorrect SSID or Poor Signal', 0)"]
[null,"Audit","WIFI_AP_ASSOC_FAIL        ","Wi-Fi Event","Incorrect User-ID or Password",null,null,"0x0B02","0037",null,null,null,null,"IF EXISTS(SELECT TOP 1 * FROM [AuditEvent] WHERE [AuditEventId] = 0x0B02) UPDATE [AuditEvent] SET [Key] = 'Wi-Fi Event', [Value] = 'Wi-Fi Event', [IsAlert] = 0 WHERE [AuditEventId] = 0x0B02 ELSE INSERT INTO [AuditEvent] ([AuditEventId], [Key], [Value], [IsAlert]) VALUES (0x0B02, 'Wi-Fi Event', 'Wi-Fi Event', 0)","IF EXISTS(SELECT TOP 1 * FROM [AuditData] WHERE [AuditDataId] = 55 AND [AuditEventId] = 0x0B02) UPDATE [AuditData] SET [Key] = 'Incorrect User-ID or Password', [Value] = 'Incorrect User-ID or Password', [IsAlert] = 0 WHERE [AuditDataId] = 55 AND [AuditEventId] = 0x0B02 ELSE INSERT INTO [AuditData] ([AuditDataId], [AuditEventId], [Key], [Value], [IsAlert]) VALUES (55, 0x0B02, 'Incorrect User-ID or Password', 'Incorrect User-ID or Password', 0)"]
[null,"Audit","WIFI_AP_ASSOC_FAIL        ","Wi-Fi Event","TLS Certificate Validation Issue",null,null,"0x0B02","0038",null,null,null,null,"IF EXISTS(SELECT TOP 1 * FROM [AuditEvent] WHERE [AuditEventId] = 0x0B02) UPDATE [AuditEvent] SET [Key] = 'Wi-Fi Event', [Value] = 'Wi-Fi Event', [IsAlert] = 0 WHERE [AuditEventId] = 0x0B02 ELSE INSERT INTO [AuditEvent] ([AuditEventId], [Key], [Value], [IsAlert]) VALUES (0x0B02, 'Wi-Fi Event', 'Wi-Fi Event', 0)","IF EXISTS(SELECT TOP 1 * FROM [AuditData] WHERE [AuditDataId] = 56 AND [AuditEventId] = 0x0B02) UPDATE [AuditData] SET [Key] = 'TLS Certificate Validation Issue', [Value] = 'TLS Certificate Validation Issue', [IsAlert] = 0 WHERE [AuditDataId] = 56 AND [AuditEventId] = 0x0B02 ELSE INSERT INTO [AuditData] ([AuditDataId], [AuditEventId], [Key], [Value], [IsAlert]) VALUES (56, 0x0B02, 'TLS Certificate Validation Issue', 'TLS Certificate Validation Issue', 0)"]
[null,"Audit","WIFI_RSSI      ","Wi-Fi RSSI Value (-dBm)","xxxx",{"$f":"LEN(D309)","v":23},{"$f":"LEN(E309)","v":4},"0x0B03","00XX","0 to 127","dBm","Wi-Fi RSSI Value (in -dBm) ","100 dBm","IF EXISTS(SELECT TOP 1 * FROM [AuditEvent] WHERE [AuditEventId] = 0x0B03) UPDATE [AuditEvent] SET [Key] = 'Wi-Fi RSSI Value (-dBm)', [Value] = 'Wi-Fi RSSI Value (-dBm)', [IsAlert] = 0 WHERE [AuditEventId] = 0x0B03 ELSE INSERT INTO [AuditEvent] ([AuditEventId], [Key], [Value], [IsAlert]) VALUES (0x0B03, 'Wi-Fi RSSI Value (-dBm)', 'Wi-Fi RSSI Value (-dBm)', 0)","-- no value"]
[null,"Audit","WIFI_HOST_CONNECT_DISCONNECT ","Wi-Fi Host Connection","Disconnected from host",21,22,"0x0B04","0000",null,null,null,null,"IF EXISTS(SELECT TOP 1 * FROM [AuditEvent] WHERE [AuditEventId] = 0x0B04) UPDATE [AuditEvent] SET [Key] = 'Wi-Fi Host Connection', [Value] = 'Wi-Fi Host Connection', [IsAlert] = 0 WHERE [AuditEventId] = 0x0B04 ELSE INSERT INTO [AuditEvent] ([AuditEventId], [Key], [Value], [IsAlert]) VALUES (0x0B04, 'Wi-Fi Host Connection', 'Wi-Fi Host Connection', 0)","IF EXISTS(SELECT TOP 1 * FROM [AuditData] WHERE [AuditDataId] = 0 AND [AuditEventId] = 0x0B04) UPDATE [AuditData] SET [Key] = 'Disconnected from host', [Value] = 'Disconnected from host', [IsAlert] = 0 WHERE [AuditDataId] = 0 AND [AuditEventId] = 0x0B04 ELSE INSERT INTO [AuditData] ([AuditDataId], [AuditEventId], [Key], [Value], [IsAlert]) VALUES (0, 0x0B04, 'Disconnected from host', 'Disconnected from host', 0)"]
[null,"Audit","WIFI_HOST_CONNECT_DISCONNECT ","Wi-Fi Host Connection","Connected to host",21,17,"0x0B04","0001",null,null,null,null,"IF EXISTS(SELECT TOP 1 * FROM [AuditEvent] WHERE [AuditEventId] = 0x0B04) UPDATE [AuditEvent] SET [Key] = 'Wi-Fi Host Connection', [Value] = 'Wi-Fi Host Connection', [IsAlert] = 0 WHERE [AuditEventId] = 0x0B04 ELSE INSERT INTO [AuditEvent] ([AuditEventId], [Key], [Value], [IsAlert]) VALUES (0x0B04, 'Wi-Fi Host Connection', 'Wi-Fi Host Connection', 0)","IF EXISTS(SELECT TOP 1 * FROM [AuditData] WHERE [AuditDataId] = 1 AND [AuditEventId] = 0x0B04) UPDATE [AuditData] SET [Key] = 'Connected to host', [Value] = 'Connected to host', [IsAlert] = 0 WHERE [AuditDataId] = 1 AND [AuditEventId] = 0x0B04 ELSE INSERT INTO [AuditData] ([AuditDataId], [AuditEventId], [Key], [Value], [IsAlert]) VALUES (1, 0x0B04, 'Connected to host', 'Connected to host', 0)"]
[null,"Audit","WIFI_HOST_CONN_FAIL    ","Wi-Fi Host Connect Event","Failed to connect to host",24,25,"0x0B05","0000",null,null,null,null,"IF EXISTS(SELECT TOP 1 * FROM [AuditEvent] WHERE [AuditEventId] = 0x0B05) UPDATE [AuditEvent] SET [Key] = 'Wi-Fi Host Connect Event', [Value] = 'Wi-Fi Host Connect Event', [IsAlert] = 0 WHERE [AuditEventId] = 0x0B05 ELSE INSERT INTO [AuditEvent] ([AuditEventId], [Key], [Value], [IsAlert]) VALUES (0x0B05, 'Wi-Fi Host Connect Event', 'Wi-Fi Host Connect Event', 0)","IF EXISTS(SELECT TOP 1 * FROM [AuditData] WHERE [AuditDataId] = 0 AND [AuditEventId] = 0x0B05) UPDATE [AuditData] SET [Key] = 'Failed to connect to host', [Value] = 'Failed to connect to host', [IsAlert] = 0 WHERE [AuditDataId] = 0 AND [AuditEventId] = 0x0B05 ELSE INSERT INTO [AuditData] ([AuditDataId], [AuditEventId], [Key], [Value], [IsAlert]) VALUES (0, 0x0B05, 'Failed to connect to host', 'Failed to connect to host', 0)"]
[null,"Audit","WIFI_HOST_CONN_FAIL    ","Wi-Fi Host Connect Event","Not initialized",24,15,"0x0B05","0001",null,null,null,null,"IF EXISTS(SELECT TOP 1 * FROM [AuditEvent] WHERE [AuditEventId] = 0x0B05) UPDATE [AuditEvent] SET [Key] = 'Wi-Fi Host Connect Event', [Value] = 'Wi-Fi Host Connect Event', [IsAlert] = 0 WHERE [AuditEventId] = 0x0B05 ELSE INSERT INTO [AuditEvent] ([AuditEventId], [Key], [Value], [IsAlert]) VALUES (0x0B05, 'Wi-Fi Host Connect Event', 'Wi-Fi Host Connect Event', 0)","IF EXISTS(SELECT TOP 1 * FROM [AuditData] WHERE [AuditDataId] = 1 AND [AuditEventId] = 0x0B05) UPDATE [AuditData] SET [Key] = 'Not initialized', [Value] = 'Not initialized', [IsAlert] = 0 WHERE [AuditDataId] = 1 AND [AuditEventId] = 0x0B05 ELSE INSERT INTO [AuditData] ([AuditDataId], [AuditEventId], [Key], [Value], [IsAlert]) VALUES (1, 0x0B05, 'Not initialized', 'Not initialized', 0)"]
[null,"Audit","WIFI_HOST_CONN_FAIL    ","Wi-Fi Host Connect Event","Host self-test failed",24,21,"0x0B05","0002",null,null,null,null,"IF EXISTS(SELECT TOP 1 * FROM [AuditEvent] WHERE [AuditEventId] = 0x0B05) UPDATE [AuditEvent] SET [Key] = 'Wi-Fi Host Connect Event', [Value] = 'Wi-Fi Host Connect Event', [IsAlert] = 0 WHERE [AuditEventId] = 0x0B05 ELSE INSERT INTO [AuditEvent] ([AuditEventId], [Key], [Value], [IsAlert]) VALUES (0x0B05, 'Wi-Fi Host Connect Event', 'Wi-Fi Host Connect Event', 0)","IF EXISTS(SELECT TOP 1 * FROM [AuditData] WHERE [AuditDataId] = 2 AND [AuditEventId] = 0x0B05) UPDATE [AuditData] SET [Key] = 'Host self-test failed', [Value] = 'Host self-test failed', [IsAlert] = 0 WHERE [AuditDataId] = 2 AND [AuditEventId] = 0x0B05 ELSE INSERT INTO [AuditData] ([AuditDataId], [AuditEventId], [Key], [Value], [IsAlert]) VALUES (2, 0x0B05, 'Host self-test failed', 'Host self-test failed', 0)"]
[null,"Audit","WIFI_HOST_CONN_FAIL    ","Wi-Fi Host Connect Event","Wi-Fi lockup: in data mode",24,26,"0x0B05","0003",null,null,null,null,"IF EXISTS(SELECT TOP 1 * FROM [AuditEvent] WHERE [AuditEventId] = 0x0B05) UPDATE [AuditEvent] SET [Key] = 'Wi-Fi Host Connect Event', [Value] = 'Wi-Fi Host Connect Event', [IsAlert] = 0 WHERE [AuditEventId] = 0x0B05 ELSE INSERT INTO [AuditEvent] ([AuditEventId], [Key], [Value], [IsAlert]) VALUES (0x0B05, 'Wi-Fi Host Connect Event', 'Wi-Fi Host Connect Event', 0)","IF EXISTS(SELECT TOP 1 * FROM [AuditData] WHERE [AuditDataId] = 3 AND [AuditEventId] = 0x0B05) UPDATE [AuditData] SET [Key] = 'Wi-Fi lockup: in data mode', [Value] = 'Wi-Fi lockup: in data mode', [IsAlert] = 0 WHERE [AuditDataId] = 3 AND [AuditEventId] = 0x0B05 ELSE INSERT INTO [AuditData] ([AuditDataId], [AuditEventId], [Key], [Value], [IsAlert]) VALUES (3, 0x0B05, 'Wi-Fi lockup: in data mode', 'Wi-Fi lockup: in data mode', 0)"]
[null,"Audit","WIFI_HOST_CONN_FAIL    ","Wi-Fi Host Connect Event","Power-on test failed",24,20,"0x0B05","0004",null,null,null,null,"IF EXISTS(SELECT TOP 1 * FROM [AuditEvent] WHERE [AuditEventId] = 0x0B05) UPDATE [AuditEvent] SET [Key] = 'Wi-Fi Host Connect Event', [Value] = 'Wi-Fi Host Connect Event', [IsAlert] = 0 WHERE [AuditEventId] = 0x0B05 ELSE INSERT INTO [AuditEvent] ([AuditEventId], [Key], [Value], [IsAlert]) VALUES (0x0B05, 'Wi-Fi Host Connect Event', 'Wi-Fi Host Connect Event', 0)","IF EXISTS(SELECT TOP 1 * FROM [AuditData] WHERE [AuditDataId] = 4 AND [AuditEventId] = 0x0B05) UPDATE [AuditData] SET [Key] = 'Power-on test failed', [Value] = 'Power-on test failed', [IsAlert] = 0 WHERE [AuditDataId] = 4 AND [AuditEventId] = 0x0B05 ELSE INSERT INTO [AuditData] ([AuditDataId], [AuditEventId], [Key], [Value], [IsAlert]) VALUES (4, 0x0B05, 'Power-on test failed', 'Power-on test failed', 0)"]
[null,"Audit","WIFI_HOST_CONN_FAIL    ","Wi-Fi Host Connect Event","Invalid configuration ",24,22,"0x0B05","0005",null,null,null,null,"IF EXISTS(SELECT TOP 1 * FROM [AuditEvent] WHERE [AuditEventId] = 0x0B05) UPDATE [AuditEvent] SET [Key] = 'Wi-Fi Host Connect Event', [Value] = 'Wi-Fi Host Connect Event', [IsAlert] = 0 WHERE [AuditEventId] = 0x0B05 ELSE INSERT INTO [AuditEvent] ([AuditEventId], [Key], [Value], [IsAlert]) VALUES (0x0B05, 'Wi-Fi Host Connect Event', 'Wi-Fi Host Connect Event', 0)","IF EXISTS(SELECT TOP 1 * FROM [AuditData] WHERE [AuditDataId] = 5 AND [AuditEventId] = 0x0B05) UPDATE [AuditData] SET [Key] = 'Invalid configuration ', [Value] = 'Invalid configuration ', [IsAlert] = 0 WHERE [AuditDataId] = 5 AND [AuditEventId] = 0x0B05 ELSE INSERT INTO [AuditData] ([AuditDataId], [AuditEventId], [Key], [Value], [IsAlert]) VALUES (5, 0x0B05, 'Invalid configuration ', 'Invalid configuration ', 0)"]
[null,"Audit","WIFI_HOST_CONN_FAIL    ","Wi-Fi Host Connect Event","Configuration failed",24,20,"0x0B05","0006",null,null,null,null,"IF EXISTS(SELECT TOP 1 * FROM [AuditEvent] WHERE [AuditEventId] = 0x0B05) UPDATE [AuditEvent] SET [Key] = 'Wi-Fi Host Connect Event', [Value] = 'Wi-Fi Host Connect Event', [IsAlert] = 0 WHERE [AuditEventId] = 0x0B05 ELSE INSERT INTO [AuditEvent] ([AuditEventId], [Key], [Value], [IsAlert]) VALUES (0x0B05, 'Wi-Fi Host Connect Event', 'Wi-Fi Host Connect Event', 0)","IF EXISTS(SELECT TOP 1 * FROM [AuditData] WHERE [AuditDataId] = 6 AND [AuditEventId] = 0x0B05) UPDATE [AuditData] SET [Key] = 'Configuration failed', [Value] = 'Configuration failed', [IsAlert] = 0 WHERE [AuditDataId] = 6 AND [AuditEventId] = 0x0B05 ELSE INSERT INTO [AuditData] ([AuditDataId], [AuditEventId], [Key], [Value], [IsAlert]) VALUES (6, 0x0B05, 'Configuration failed', 'Configuration failed', 0)"]
[null,"Audit","WIFI_HOST_CONN_FAIL    ","Wi-Fi Host Connect Event","Failed to associate with host",24,29,"0x0B05","0007",null,null,null,null,"IF EXISTS(SELECT TOP 1 * FROM [AuditEvent] WHERE [AuditEventId] = 0x0B05) UPDATE [AuditEvent] SET [Key] = 'Wi-Fi Host Connect Event', [Value] = 'Wi-Fi Host Connect Event', [IsAlert] = 0 WHERE [AuditEventId] = 0x0B05 ELSE INSERT INTO [AuditEvent] ([AuditEventId], [Key], [Value], [IsAlert]) VALUES (0x0B05, 'Wi-Fi Host Connect Event', 'Wi-Fi Host Connect Event', 0)","IF EXISTS(SELECT TOP 1 * FROM [AuditData] WHERE [AuditDataId] = 7 AND [AuditEventId] = 0x0B05) UPDATE [AuditData] SET [Key] = 'Failed to associate with host', [Value] = 'Failed to associate with host', [IsAlert] = 0 WHERE [AuditDataId] = 7 AND [AuditEventId] = 0x0B05 ELSE INSERT INTO [AuditData] ([AuditDataId], [AuditEventId], [Key], [Value], [IsAlert]) VALUES (7, 0x0B05, 'Failed to associate with host', 'Failed to associate with host', 0)"]
[null,"Audit","WIFI_HOST_CONN_FAIL    ","Wi-Fi Host Connect Event","Failed to disassociate from host",24,32,"0x0B05","0008",null,null,null,null,"IF EXISTS(SELECT TOP 1 * FROM [AuditEvent] WHERE [AuditEventId] = 0x0B05) UPDATE [AuditEvent] SET [Key] = 'Wi-Fi Host Connect Event', [Value] = 'Wi-Fi Host Connect Event', [IsAlert] = 0 WHERE [AuditEventId] = 0x0B05 ELSE INSERT INTO [AuditEvent] ([AuditEventId], [Key], [Value], [IsAlert]) VALUES (0x0B05, 'Wi-Fi Host Connect Event', 'Wi-Fi Host Connect Event', 0)","IF EXISTS(SELECT TOP 1 * FROM [AuditData] WHERE [AuditDataId] = 8 AND [AuditEventId] = 0x0B05) UPDATE [AuditData] SET [Key] = 'Failed to disassociate from host', [Value] = 'Failed to disassociate from host', [IsAlert] = 0 WHERE [AuditDataId] = 8 AND [AuditEventId] = 0x0B05 ELSE INSERT INTO [AuditData] ([AuditDataId], [AuditEventId], [Key], [Value], [IsAlert]) VALUES (8, 0x0B05, 'Failed to disassociate from host', 'Failed to disassociate from host', 0)"]
[null,"Audit","WIFI_HOST_CONN_FAIL    ","Wi-Fi Host Connect Event","Failed to obtain IP address",24,27,"0x0B05","0009",null,null,null,null,"IF EXISTS(SELECT TOP 1 * FROM [AuditEvent] WHERE [AuditEventId] = 0x0B05) UPDATE [AuditEvent] SET [Key] = 'Wi-Fi Host Connect Event', [Value] = 'Wi-Fi Host Connect Event', [IsAlert] = 0 WHERE [AuditEventId] = 0x0B05 ELSE INSERT INTO [AuditEvent] ([AuditEventId], [Key], [Value], [IsAlert]) VALUES (0x0B05, 'Wi-Fi Host Connect Event', 'Wi-Fi Host Connect Event', 0)","IF EXISTS(SELECT TOP 1 * FROM [AuditData] WHERE [AuditDataId] = 9 AND [AuditEventId] = 0x0B05) UPDATE [AuditData] SET [Key] = 'Failed to obtain IP address', [Value] = 'Failed to obtain IP address', [IsAlert] = 0 WHERE [AuditDataId] = 9 AND [AuditEventId] = 0x0B05 ELSE INSERT INTO [AuditData] ([AuditDataId], [AuditEventId], [Key], [Value], [IsAlert]) VALUES (9, 0x0B05, 'Failed to obtain IP address', 'Failed to obtain IP address', 0)"]
[null,"Audit","WIFI_HOST_CONN_FAIL    ","Wi-Fi Host Connect Event","Failed to connect to host",24,25,"0x0B05","000A",null,null,null,null,"IF EXISTS(SELECT TOP 1 * FROM [AuditEvent] WHERE [AuditEventId] = 0x0B05) UPDATE [AuditEvent] SET [Key] = 'Wi-Fi Host Connect Event', [Value] = 'Wi-Fi Host Connect Event', [IsAlert] = 0 WHERE [AuditEventId] = 0x0B05 ELSE INSERT INTO [AuditEvent] ([AuditEventId], [Key], [Value], [IsAlert]) VALUES (0x0B05, 'Wi-Fi Host Connect Event', 'Wi-Fi Host Connect Event', 0)","IF EXISTS(SELECT TOP 1 * FROM [AuditData] WHERE [AuditDataId] = 10 AND [AuditEventId] = 0x0B05) UPDATE [AuditData] SET [Key] = 'Failed to connect to host', [Value] = 'Failed to connect to host', [IsAlert] = 0 WHERE [AuditDataId] = 10 AND [AuditEventId] = 0x0B05 ELSE INSERT INTO [AuditData] ([AuditDataId], [AuditEventId], [Key], [Value], [IsAlert]) VALUES (10, 0x0B05, 'Failed to connect to host', 'Failed to connect to host', 0)"]
[null,"Audit","WIFI_HOST_CONN_FAIL    ","Wi-Fi Host Connect Event","DNS Failed",24,10,"0x0B05","000B",null,null,null,null,"IF EXISTS(SELECT TOP 1 * FROM [AuditEvent] WHERE [AuditEventId] = 0x0B05) UPDATE [AuditEvent] SET [Key] = 'Wi-Fi Host Connect Event', [Value] = 'Wi-Fi Host Connect Event', [IsAlert] = 0 WHERE [AuditEventId] = 0x0B05 ELSE INSERT INTO [AuditEvent] ([AuditEventId], [Key], [Value], [IsAlert]) VALUES (0x0B05, 'Wi-Fi Host Connect Event', 'Wi-Fi Host Connect Event', 0)","IF EXISTS(SELECT TOP 1 * FROM [AuditData] WHERE [AuditDataId] = 11 AND [AuditEventId] = 0x0B05) UPDATE [AuditData] SET [Key] = 'DNS Failed', [Value] = 'DNS Failed', [IsAlert] = 0 WHERE [AuditDataId] = 11 AND [AuditEventId] = 0x0B05 ELSE INSERT INTO [AuditData] ([AuditDataId], [AuditEventId], [Key], [Value], [IsAlert]) VALUES (11, 0x0B05, 'DNS Failed', 'DNS Failed', 0)"]
[null,"Audit","WIFI_HOST_CONN_FAIL    ","Wi-Fi Host Connect Event","Wi-Fi configurations not set",24,28,"0x0B05","000C",null,null,null,null,"IF EXISTS(SELECT TOP 1 * FROM [AuditEvent] WHERE [AuditEventId] = 0x0B05) UPDATE [AuditEvent] SET [Key] = 'Wi-Fi Host Connect Event', [Value] = 'Wi-Fi Host Connect Event', [IsAlert] = 0 WHERE [AuditEventId] = 0x0B05 ELSE INSERT INTO [AuditEvent] ([AuditEventId], [Key], [Value], [IsAlert]) VALUES (0x0B05, 'Wi-Fi Host Connect Event', 'Wi-Fi Host Connect Event', 0)","IF EXISTS(SELECT TOP 1 * FROM [AuditData] WHERE [AuditDataId] = 12 AND [AuditEventId] = 0x0B05) UPDATE [AuditData] SET [Key] = 'Wi-Fi configurations not set', [Value] = 'Wi-Fi configurations not set', [IsAlert] = 0 WHERE [AuditDataId] = 12 AND [AuditEventId] = 0x0B05 ELSE INSERT INTO [AuditData] ([AuditDataId], [AuditEventId], [Key], [Value], [IsAlert]) VALUES (12, 0x0B05, 'Wi-Fi configurations not set', 'Wi-Fi configurations not set', 0)"]
[null,"Audit","WIFI_HOST_CONN_FAIL    ","Wi-Fi Host Connect Event","Communication failure",24,21,"0x0B05","000D",null,null,null,null,"IF EXISTS(SELECT TOP 1 * FROM [AuditEvent] WHERE [AuditEventId] = 0x0B05) UPDATE [AuditEvent] SET [Key] = 'Wi-Fi Host Connect Event', [Value] = 'Wi-Fi Host Connect Event', [IsAlert] = 0 WHERE [AuditEventId] = 0x0B05 ELSE INSERT INTO [AuditEvent] ([AuditEventId], [Key], [Value], [IsAlert]) VALUES (0x0B05, 'Wi-Fi Host Connect Event', 'Wi-Fi Host Connect Event', 0)","IF EXISTS(SELECT TOP 1 * FROM [AuditData] WHERE [AuditDataId] = 13 AND [AuditEventId] = 0x0B05) UPDATE [AuditData] SET [Key] = 'Communication failure', [Value] = 'Communication failure', [IsAlert] = 0 WHERE [AuditDataId] = 13 AND [AuditEventId] = 0x0B05 ELSE INSERT INTO [AuditData] ([AuditDataId], [AuditEventId], [Key], [Value], [IsAlert]) VALUES (13, 0x0B05, 'Communication failure', 'Communication failure', 0)"]
[null,"Audit","WIFI_HOST_CONN_FAIL    ","Wi-Fi Host Connect Event","Write config to memory fail",24,27,"0x0B05","000E",null,null,null,null,"IF EXISTS(SELECT TOP 1 * FROM [AuditEvent] WHERE [AuditEventId] = 0x0B05) UPDATE [AuditEvent] SET [Key] = 'Wi-Fi Host Connect Event', [Value] = 'Wi-Fi Host Connect Event', [IsAlert] = 0 WHERE [AuditEventId] = 0x0B05 ELSE INSERT INTO [AuditEvent] ([AuditEventId], [Key], [Value], [IsAlert]) VALUES (0x0B05, 'Wi-Fi Host Connect Event', 'Wi-Fi Host Connect Event', 0)","IF EXISTS(SELECT TOP 1 * FROM [AuditData] WHERE [AuditDataId] = 14 AND [AuditEventId] = 0x0B05) UPDATE [AuditData] SET [Key] = 'Write config to memory fail', [Value] = 'Write config to memory fail', [IsAlert] = 0 WHERE [AuditDataId] = 14 AND [AuditEventId] = 0x0B05 ELSE INSERT INTO [AuditData] ([AuditDataId], [AuditEventId], [Key], [Value], [IsAlert]) VALUES (14, 0x0B05, 'Write config to memory fail', 'Write config to memory fail', 0)"]
[null,"Audit","WIFI_HOST_CONN_FAIL    ","Wi-Fi Host Connect Event","Error getting data from host",24,28,"0x0B05","000F",null,null,null,null,"IF EXISTS(SELECT TOP 1 * FROM [AuditEvent] WHERE [AuditEventId] = 0x0B05) UPDATE [AuditEvent] SET [Key] = 'Wi-Fi Host Connect Event', [Value] = 'Wi-Fi Host Connect Event', [IsAlert] = 0 WHERE [AuditEventId] = 0x0B05 ELSE INSERT INTO [AuditEvent] ([AuditEventId], [Key], [Value], [IsAlert]) VALUES (0x0B05, 'Wi-Fi Host Connect Event', 'Wi-Fi Host Connect Event', 0)","IF EXISTS(SELECT TOP 1 * FROM [AuditData] WHERE [AuditDataId] = 15 AND [AuditEventId] = 0x0B05) UPDATE [AuditData] SET [Key] = 'Error getting data from host', [Value] = 'Error getting data from host', [IsAlert] = 0 WHERE [AuditDataId] = 15 AND [AuditEventId] = 0x0B05 ELSE INSERT INTO [AuditData] ([AuditDataId], [AuditEventId], [Key], [Value], [IsAlert]) VALUES (15, 0x0B05, 'Error getting data from host', 'Error getting data from host', 0)"]
[null,"Audit","WIFI_HOST_CONN_FAIL    ","Wi-Fi Host Connect Event","Error sending data to host",24,26,"0x0B05","0010",null,null,null,null,"IF EXISTS(SELECT TOP 1 * FROM [AuditEvent] WHERE [AuditEventId] = 0x0B05) UPDATE [AuditEvent] SET [Key] = 'Wi-Fi Host Connect Event', [Value] = 'Wi-Fi Host Connect Event', [IsAlert] = 0 WHERE [AuditEventId] = 0x0B05 ELSE INSERT INTO [AuditEvent] ([AuditEventId], [Key], [Value], [IsAlert]) VALUES (0x0B05, 'Wi-Fi Host Connect Event', 'Wi-Fi Host Connect Event', 0)","IF EXISTS(SELECT TOP 1 * FROM [AuditData] WHERE [AuditDataId] = 16 AND [AuditEventId] = 0x0B05) UPDATE [AuditData] SET [Key] = 'Error sending data to host', [Value] = 'Error sending data to host', [IsAlert] = 0 WHERE [AuditDataId] = 16 AND [AuditEventId] = 0x0B05 ELSE INSERT INTO [AuditData] ([AuditDataId], [AuditEventId], [Key], [Value], [IsAlert]) VALUES (16, 0x0B05, 'Error sending data to host', 'Error sending data to host', 0)"]
[null,"Audit","WIFI_HOST_CONN_FAIL    ","Wi-Fi Host Connect Event","Unsupported feature",24,19,"0x0B05","0011",null,null,null,null,"IF EXISTS(SELECT TOP 1 * FROM [AuditEvent] WHERE [AuditEventId] = 0x0B05) UPDATE [AuditEvent] SET [Key] = 'Wi-Fi Host Connect Event', [Value] = 'Wi-Fi Host Connect Event', [IsAlert] = 0 WHERE [AuditEventId] = 0x0B05 ELSE INSERT INTO [AuditEvent] ([AuditEventId], [Key], [Value], [IsAlert]) VALUES (0x0B05, 'Wi-Fi Host Connect Event', 'Wi-Fi Host Connect Event', 0)","IF EXISTS(SELECT TOP 1 * FROM [AuditData] WHERE [AuditDataId] = 17 AND [AuditEventId] = 0x0B05) UPDATE [AuditData] SET [Key] = 'Unsupported feature', [Value] = 'Unsupported feature', [IsAlert] = 0 WHERE [AuditDataId] = 17 AND [AuditEventId] = 0x0B05 ELSE INSERT INTO [AuditData] ([AuditDataId], [AuditEventId], [Key], [Value], [IsAlert]) VALUES (17, 0x0B05, 'Unsupported feature', 'Unsupported feature', 0)"]
[null,"Audit","WIFI_HOST_CONN_FAIL    ","Wi-Fi Host Connect Event","HTTP error received from host",24,29,"0x0B05","0012",null,null,null,null,"IF EXISTS(SELECT TOP 1 * FROM [AuditEvent] WHERE [AuditEventId] = 0x0B05) UPDATE [AuditEvent] SET [Key] = 'Wi-Fi Host Connect Event', [Value] = 'Wi-Fi Host Connect Event', [IsAlert] = 0 WHERE [AuditEventId] = 0x0B05 ELSE INSERT INTO [AuditEvent] ([AuditEventId], [Key], [Value], [IsAlert]) VALUES (0x0B05, 'Wi-Fi Host Connect Event', 'Wi-Fi Host Connect Event', 0)","IF EXISTS(SELECT TOP 1 * FROM [AuditData] WHERE [AuditDataId] = 18 AND [AuditEventId] = 0x0B05) UPDATE [AuditData] SET [Key] = 'HTTP error received from host', [Value] = 'HTTP error received from host', [IsAlert] = 0 WHERE [AuditDataId] = 18 AND [AuditEventId] = 0x0B05 ELSE INSERT INTO [AuditData] ([AuditDataId], [AuditEventId], [Key], [Value], [IsAlert]) VALUES (18, 0x0B05, 'HTTP error received from host', 'HTTP error received from host', 0)"]
[null,"Audit","WIFI_HOST_CONN_FAIL    ","Wi-Fi Host Connect Event","Unknown lock name in URL",24,24,"0x0B05","0013",null,null,null,null,"IF EXISTS(SELECT TOP 1 * FROM [AuditEvent] WHERE [AuditEventId] = 0x0B05) UPDATE [AuditEvent] SET [Key] = 'Wi-Fi Host Connect Event', [Value] = 'Wi-Fi Host Connect Event', [IsAlert] = 0 WHERE [AuditEventId] = 0x0B05 ELSE INSERT INTO [AuditEvent] ([AuditEventId], [Key], [Value], [IsAlert]) VALUES (0x0B05, 'Wi-Fi Host Connect Event', 'Wi-Fi Host Connect Event', 0)","IF EXISTS(SELECT TOP 1 * FROM [AuditData] WHERE [AuditDataId] = 19 AND [AuditEventId] = 0x0B05) UPDATE [AuditData] SET [Key] = 'Unknown lock name in URL', [Value] = 'Unknown lock name in URL', [IsAlert] = 0 WHERE [AuditDataId] = 19 AND [AuditEventId] = 0x0B05 ELSE INSERT INTO [AuditData] ([AuditDataId], [AuditEventId], [Key], [Value], [IsAlert]) VALUES (19, 0x0B05, 'Unknown lock name in URL', 'Unknown lock name in URL', 0)"]
[null,"Audit","WIFI_HOST_CONN_FAIL    ","Wi-Fi Host Connect Event","FTP config error",24,16,"0x0B05","0014",null,null,null,null,"IF EXISTS(SELECT TOP 1 * FROM [AuditEvent] WHERE [AuditEventId] = 0x0B05) UPDATE [AuditEvent] SET [Key] = 'Wi-Fi Host Connect Event', [Value] = 'Wi-Fi Host Connect Event', [IsAlert] = 0 WHERE [AuditEventId] = 0x0B05 ELSE INSERT INTO [AuditEvent] ([AuditEventId], [Key], [Value], [IsAlert]) VALUES (0x0B05, 'Wi-Fi Host Connect Event', 'Wi-Fi Host Connect Event', 0)","IF EXISTS(SELECT TOP 1 * FROM [AuditData] WHERE [AuditDataId] = 20 AND [AuditEventId] = 0x0B05) UPDATE [AuditData] SET [Key] = 'FTP config error', [Value] = 'FTP config error', [IsAlert] = 0 WHERE [AuditDataId] = 20 AND [AuditEventId] = 0x0B05 ELSE INSERT INTO [AuditData] ([AuditDataId], [AuditEventId], [Key], [Value], [IsAlert]) VALUES (20, 0x0B05, 'FTP config error', 'FTP config error', 0)"]
[null,"Audit","WIFI_HOST_CONN_FAIL    ","Wi-Fi Host Connect Event","Network AP retry failed",24,23,"0x0B05","0015",null,null,null,null,"IF EXISTS(SELECT TOP 1 * FROM [AuditEvent] WHERE [AuditEventId] = 0x0B05) UPDATE [AuditEvent] SET [Key] = 'Wi-Fi Host Connect Event', [Value] = 'Wi-Fi Host Connect Event', [IsAlert] = 0 WHERE [AuditEventId] = 0x0B05 ELSE INSERT INTO [AuditEvent] ([AuditEventId], [Key], [Value], [IsAlert]) VALUES (0x0B05, 'Wi-Fi Host Connect Event', 'Wi-Fi Host Connect Event', 0)","IF EXISTS(SELECT TOP 1 * FROM [AuditData] WHERE [AuditDataId] = 21 AND [AuditEventId] = 0x0B05) UPDATE [AuditData] SET [Key] = 'Network AP retry failed', [Value] = 'Network AP retry failed', [IsAlert] = 0 WHERE [AuditDataId] = 21 AND [AuditEventId] = 0x0B05 ELSE INSERT INTO [AuditData] ([AuditDataId], [AuditEventId], [Key], [Value], [IsAlert]) VALUES (21, 0x0B05, 'Network AP retry failed', 'Network AP retry failed', 0)"]
[null,"Audit","WIFI_HOST_CONN_FAIL    ","Wi-Fi Host Connect Event","Data size too large",24,19,"0x0B05","0016",null,null,null,null,"IF EXISTS(SELECT TOP 1 * FROM [AuditEvent] WHERE [AuditEventId] = 0x0B05) UPDATE [AuditEvent] SET [Key] = 'Wi-Fi Host Connect Event', [Value] = 'Wi-Fi Host Connect Event', [IsAlert] = 0 WHERE [AuditEventId] = 0x0B05 ELSE INSERT INTO [AuditEvent] ([AuditEventId], [Key], [Value], [IsAlert]) VALUES (0x0B05, 'Wi-Fi Host Connect Event', 'Wi-Fi Host Connect Event', 0)","IF EXISTS(SELECT TOP 1 * FROM [AuditData] WHERE [AuditDataId] = 22 AND [AuditEventId] = 0x0B05) UPDATE [AuditData] SET [Key] = 'Data size too large', [Value] = 'Data size too large', [IsAlert] = 0 WHERE [AuditDataId] = 22 AND [AuditEventId] = 0x0B05 ELSE INSERT INTO [AuditData] ([AuditDataId], [AuditEventId], [Key], [Value], [IsAlert]) VALUES (22, 0x0B05, 'Data size too large', 'Data size too large', 0)"]
[null,"Audit","WIFI_HOST_CONN_FAIL    ","Wi-Fi Host Connect Event","No buffer during download",24,25,"0x0B05","0017",null,null,null,null,"IF EXISTS(SELECT TOP 1 * FROM [AuditEvent] WHERE [AuditEventId] = 0x0B05) UPDATE [AuditEvent] SET [Key] = 'Wi-Fi Host Connect Event', [Value] = 'Wi-Fi Host Connect Event', [IsAlert] = 0 WHERE [AuditEventId] = 0x0B05 ELSE INSERT INTO [AuditEvent] ([AuditEventId], [Key], [Value], [IsAlert]) VALUES (0x0B05, 'Wi-Fi Host Connect Event', 'Wi-Fi Host Connect Event', 0)","IF EXISTS(SELECT TOP 1 * FROM [AuditData] WHERE [AuditDataId] = 23 AND [AuditEventId] = 0x0B05) UPDATE [AuditData] SET [Key] = 'No buffer during download', [Value] = 'No buffer during download', [IsAlert] = 0 WHERE [AuditDataId] = 23 AND [AuditEventId] = 0x0B05 ELSE INSERT INTO [AuditData] ([AuditDataId], [AuditEventId], [Key], [Value], [IsAlert]) VALUES (23, 0x0B05, 'No buffer during download', 'No buffer during download', 0)"]
[null,"Audit","WIFI_HOST_CONN_FAIL    ","Wi-Fi Host Connect Event","UART read failed",24,16,"0x0B05","0018",null,null,null,null,"IF EXISTS(SELECT TOP 1 * FROM [AuditEvent] WHERE [AuditEventId] = 0x0B05) UPDATE [AuditEvent] SET [Key] = 'Wi-Fi Host Connect Event', [Value] = 'Wi-Fi Host Connect Event', [IsAlert] = 0 WHERE [AuditEventId] = 0x0B05 ELSE INSERT INTO [AuditEvent] ([AuditEventId], [Key], [Value], [IsAlert]) VALUES (0x0B05, 'Wi-Fi Host Connect Event', 'Wi-Fi Host Connect Event', 0)","IF EXISTS(SELECT TOP 1 * FROM [AuditData] WHERE [AuditDataId] = 24 AND [AuditEventId] = 0x0B05) UPDATE [AuditData] SET [Key] = 'UART read failed', [Value] = 'UART read failed', [IsAlert] = 0 WHERE [AuditDataId] = 24 AND [AuditEventId] = 0x0B05 ELSE INSERT INTO [AuditData] ([AuditDataId], [AuditEventId], [Key], [Value], [IsAlert]) VALUES (24, 0x0B05, 'UART read failed', 'UART read failed', 0)"]
[null,"Audit","WIFI_HOST_CONN_FAIL    ","Wi-Fi Host Connect Event","UART write failed",24,17,"0x0B05","0019",null,null,null,null,"IF EXISTS(SELECT TOP 1 * FROM [AuditEvent] WHERE [AuditEventId] = 0x0B05) UPDATE [AuditEvent] SET [Key] = 'Wi-Fi Host Connect Event', [Value] = 'Wi-Fi Host Connect Event', [IsAlert] = 0 WHERE [AuditEventId] = 0x0B05 ELSE INSERT INTO [AuditEvent] ([AuditEventId], [Key], [Value], [IsAlert]) VALUES (0x0B05, 'Wi-Fi Host Connect Event', 'Wi-Fi Host Connect Event', 0)","IF EXISTS(SELECT TOP 1 * FROM [AuditData] WHERE [AuditDataId] = 25 AND [AuditEventId] = 0x0B05) UPDATE [AuditData] SET [Key] = 'UART write failed', [Value] = 'UART write failed', [IsAlert] = 0 WHERE [AuditDataId] = 25 AND [AuditEventId] = 0x0B05 ELSE INSERT INTO [AuditData] ([AuditDataId], [AuditEventId], [Key], [Value], [IsAlert]) VALUES (25, 0x0B05, 'UART write failed', 'UART write failed', 0)"]
[null,"Audit","WIFI_HOST_CONN_FAIL    ","Wi-Fi Host Connect Event","Error writing to memory",24,23,"0x0B05","001A",null,null,null,null,"IF EXISTS(SELECT TOP 1 * FROM [AuditEvent] WHERE [AuditEventId] = 0x0B05) UPDATE [AuditEvent] SET [Key] = 'Wi-Fi Host Connect Event', [Value] = 'Wi-Fi Host Connect Event', [IsAlert] = 0 WHERE [AuditEventId] = 0x0B05 ELSE INSERT INTO [AuditEvent] ([AuditEventId], [Key], [Value], [IsAlert]) VALUES (0x0B05, 'Wi-Fi Host Connect Event', 'Wi-Fi Host Connect Event', 0)","IF EXISTS(SELECT TOP 1 * FROM [AuditData] WHERE [AuditDataId] = 26 AND [AuditEventId] = 0x0B05) UPDATE [AuditData] SET [Key] = 'Error writing to memory', [Value] = 'Error writing to memory', [IsAlert] = 0 WHERE [AuditDataId] = 26 AND [AuditEventId] = 0x0B05 ELSE INSERT INTO [AuditData] ([AuditDataId], [AuditEventId], [Key], [Value], [IsAlert]) VALUES (26, 0x0B05, 'Error writing to memory', 'Error writing to memory', 0)"]
[null,"Audit","WIFI_HOST_CONN_FAIL    ","Wi-Fi Host Connect Event","Error erasing memory",24,20,"0x0B05","001B",null,null,null,null,"IF EXISTS(SELECT TOP 1 * FROM [AuditEvent] WHERE [AuditEventId] = 0x0B05) UPDATE [AuditEvent] SET [Key] = 'Wi-Fi Host Connect Event', [Value] = 'Wi-Fi Host Connect Event', [IsAlert] = 0 WHERE [AuditEventId] = 0x0B05 ELSE INSERT INTO [AuditEvent] ([AuditEventId], [Key], [Value], [IsAlert]) VALUES (0x0B05, 'Wi-Fi Host Connect Event', 'Wi-Fi Host Connect Event', 0)","IF EXISTS(SELECT TOP 1 * FROM [AuditData] WHERE [AuditDataId] = 27 AND [AuditEventId] = 0x0B05) UPDATE [AuditData] SET [Key] = 'Error erasing memory', [Value] = 'Error erasing memory', [IsAlert] = 0 WHERE [AuditDataId] = 27 AND [AuditEventId] = 0x0B05 ELSE INSERT INTO [AuditData] ([AuditDataId], [AuditEventId], [Key], [Value], [IsAlert]) VALUES (27, 0x0B05, 'Error erasing memory', 'Error erasing memory', 0)"]
[null,"Audit","WIFI_HOST_CONN_FAIL    ","Wi-Fi Host Connect Event","Failed CRC check",24,16,"0x0B05","001C",null,null,null,null,"IF EXISTS(SELECT TOP 1 * FROM [AuditEvent] WHERE [AuditEventId] = 0x0B05) UPDATE [AuditEvent] SET [Key] = 'Wi-Fi Host Connect Event', [Value] = 'Wi-Fi Host Connect Event', [IsAlert] = 0 WHERE [AuditEventId] = 0x0B05 ELSE INSERT INTO [AuditEvent] ([AuditEventId], [Key], [Value], [IsAlert]) VALUES (0x0B05, 'Wi-Fi Host Connect Event', 'Wi-Fi Host Connect Event', 0)","IF EXISTS(SELECT TOP 1 * FROM [AuditData] WHERE [AuditDataId] = 28 AND [AuditEventId] = 0x0B05) UPDATE [AuditData] SET [Key] = 'Failed CRC check', [Value] = 'Failed CRC check', [IsAlert] = 0 WHERE [AuditDataId] = 28 AND [AuditEventId] = 0x0B05 ELSE INSERT INTO [AuditData] ([AuditDataId], [AuditEventId], [Key], [Value], [IsAlert]) VALUES (28, 0x0B05, 'Failed CRC check', 'Failed CRC check', 0)"]
[null,"Audit","WIFI_HOST_CONN_FAIL    ","Wi-Fi Host Connect Event","Upgrade: no values received",{"$f":"LEN(D341)","v":24},{"$f":"LEN(E341)","v":27},"0x0B05","001D",null,null,null,null,"IF EXISTS(SELECT TOP 1 * FROM [AuditEvent] WHERE [AuditEventId] = 0x0B05) UPDATE [AuditEvent] SET [Key] = 'Wi-Fi Host Connect Event', [Value] = 'Wi-Fi Host Connect Event', [IsAlert] = 0 WHERE [AuditEventId] = 0x0B05 ELSE INSERT INTO [AuditEvent] ([AuditEventId], [Key], [Value], [IsAlert]) VALUES (0x0B05, 'Wi-Fi Host Connect Event', 'Wi-Fi Host Connect Event', 0)","IF EXISTS(SELECT TOP 1 * FROM [AuditData] WHERE [AuditDataId] = 29 AND [AuditEventId] = 0x0B05) UPDATE [AuditData] SET [Key] = 'Upgrade: no values received', [Value] = 'Upgrade: no values received', [IsAlert] = 0 WHERE [AuditDataId] = 29 AND [AuditEventId] = 0x0B05 ELSE INSERT INTO [AuditData] ([AuditDataId], [AuditEventId], [Key], [Value], [IsAlert]) VALUES (29, 0x0B05, 'Upgrade: no values received', 'Upgrade: no values received', 0)"]
[null,"Audit","WIFI_HOST_CONN_FAIL    ","Wi-Fi Host Connect Event","Upgrade: invalid values entered",24,31,"0x0B05","001E",null,null,null,null,"IF EXISTS(SELECT TOP 1 * FROM [AuditEvent] WHERE [AuditEventId] = 0x0B05) UPDATE [AuditEvent] SET [Key] = 'Wi-Fi Host Connect Event', [Value] = 'Wi-Fi Host Connect Event', [IsAlert] = 0 WHERE [AuditEventId] = 0x0B05 ELSE INSERT INTO [AuditEvent] ([AuditEventId], [Key], [Value], [IsAlert]) VALUES (0x0B05, 'Wi-Fi Host Connect Event', 'Wi-Fi Host Connect Event', 0)","IF EXISTS(SELECT TOP 1 * FROM [AuditData] WHERE [AuditDataId] = 30 AND [AuditEventId] = 0x0B05) UPDATE [AuditData] SET [Key] = 'Upgrade: invalid values entered', [Value] = 'Upgrade: invalid values entered', [IsAlert] = 0 WHERE [AuditDataId] = 30 AND [AuditEventId] = 0x0B05 ELSE INSERT INTO [AuditData] ([AuditDataId], [AuditEventId], [Key], [Value], [IsAlert]) VALUES (30, 0x0B05, 'Upgrade: invalid values entered', 'Upgrade: invalid values entered', 0)"]
[null,"Audit","WIFI_HOST_CONN_FAIL    ","Wi-Fi Host Connect Event","Upgrade: transfer failed",24,24,"0x0B05","001F",null,null,null,null,"IF EXISTS(SELECT TOP 1 * FROM [AuditEvent] WHERE [AuditEventId] = 0x0B05) UPDATE [AuditEvent] SET [Key] = 'Wi-Fi Host Connect Event', [Value] = 'Wi-Fi Host Connect Event', [IsAlert] = 0 WHERE [AuditEventId] = 0x0B05 ELSE INSERT INTO [AuditEvent] ([AuditEventId], [Key], [Value], [IsAlert]) VALUES (0x0B05, 'Wi-Fi Host Connect Event', 'Wi-Fi Host Connect Event', 0)","IF EXISTS(SELECT TOP 1 * FROM [AuditData] WHERE [AuditDataId] = 31 AND [AuditEventId] = 0x0B05) UPDATE [AuditData] SET [Key] = 'Upgrade: transfer failed', [Value] = 'Upgrade: transfer failed', [IsAlert] = 0 WHERE [AuditDataId] = 31 AND [AuditEventId] = 0x0B05 ELSE INSERT INTO [AuditData] ([AuditDataId], [AuditEventId], [Key], [Value], [IsAlert]) VALUES (31, 0x0B05, 'Upgrade: transfer failed', 'Upgrade: transfer failed', 0)"]
[null,"Audit","WIFI_HOST_CONN_FAIL    ","Wi-Fi Host Connect Event","Upgrade: installation failed",24,28,"0x0B05","0020",null,null,null,null,"IF EXISTS(SELECT TOP 1 * FROM [AuditEvent] WHERE [AuditEventId] = 0x0B05) UPDATE [AuditEvent] SET [Key] = 'Wi-Fi Host Connect Event', [Value] = 'Wi-Fi Host Connect Event', [IsAlert] = 0 WHERE [AuditEventId] = 0x0B05 ELSE INSERT INTO [AuditEvent] ([AuditEventId], [Key], [Value], [IsAlert]) VALUES (0x0B05, 'Wi-Fi Host Connect Event', 'Wi-Fi Host Connect Event', 0)","IF EXISTS(SELECT TOP 1 * FROM [AuditData] WHERE [AuditDataId] = 32 AND [AuditEventId] = 0x0B05) UPDATE [AuditData] SET [Key] = 'Upgrade: installation failed', [Value] = 'Upgrade: installation failed', [IsAlert] = 0 WHERE [AuditDataId] = 32 AND [AuditEventId] = 0x0B05 ELSE INSERT INTO [AuditData] ([AuditDataId], [AuditEventId], [Key], [Value], [IsAlert]) VALUES (32, 0x0B05, 'Upgrade: installation failed', 'Upgrade: installation failed', 0)"]
[null,"Audit","WIFI_HOST_CONN_FAIL    ","Wi-Fi Host Connect Event","Interrupted by FDR",24,18,"0x0B05","0021",null,null,null,null,"IF EXISTS(SELECT TOP 1 * FROM [AuditEvent] WHERE [AuditEventId] = 0x0B05) UPDATE [AuditEvent] SET [Key] = 'Wi-Fi Host Connect Event', [Value] = 'Wi-Fi Host Connect Event', [IsAlert] = 0 WHERE [AuditEventId] = 0x0B05 ELSE INSERT INTO [AuditEvent] ([AuditEventId], [Key], [Value], [IsAlert]) VALUES (0x0B05, 'Wi-Fi Host Connect Event', 'Wi-Fi Host Connect Event', 0)","IF EXISTS(SELECT TOP 1 * FROM [AuditData] WHERE [AuditDataId] = 33 AND [AuditEventId] = 0x0B05) UPDATE [AuditData] SET [Key] = 'Interrupted by FDR', [Value] = 'Interrupted by FDR', [IsAlert] = 0 WHERE [AuditDataId] = 33 AND [AuditEventId] = 0x0B05 ELSE INSERT INTO [AuditData] ([AuditDataId], [AuditEventId], [Key], [Value], [IsAlert]) VALUES (33, 0x0B05, 'Interrupted by FDR', 'Interrupted by FDR', 0)"]
[null,"Audit","WIFI_HOST_CONN_FAIL    ","Wi-Fi Host Connect Event","Interrupted by Power Manager",24,28,"0x0B05","0022",null,null,null,null,"IF EXISTS(SELECT TOP 1 * FROM [AuditEvent] WHERE [AuditEventId] = 0x0B05) UPDATE [AuditEvent] SET [Key] = 'Wi-Fi Host Connect Event', [Value] = 'Wi-Fi Host Connect Event', [IsAlert] = 0 WHERE [AuditEventId] = 0x0B05 ELSE INSERT INTO [AuditEvent] ([AuditEventId], [Key], [Value], [IsAlert]) VALUES (0x0B05, 'Wi-Fi Host Connect Event', 'Wi-Fi Host Connect Event', 0)","IF EXISTS(SELECT TOP 1 * FROM [AuditData] WHERE [AuditDataId] = 34 AND [AuditEventId] = 0x0B05) UPDATE [AuditData] SET [Key] = 'Interrupted by Power Manager', [Value] = 'Interrupted by Power Manager', [IsAlert] = 0 WHERE [AuditDataId] = 34 AND [AuditEventId] = 0x0B05 ELSE INSERT INTO [AuditData] ([AuditDataId], [AuditEventId], [Key], [Value], [IsAlert]) VALUES (34, 0x0B05, 'Interrupted by Power Manager', 'Interrupted by Power Manager', 0)"]
[null,"Audit","WIFI_HOST_CONN_FAIL    ","Wi-Fi Host Connect Event","Host disconnected",24,17,"0x0B05","0023",null,null,null,null,"IF EXISTS(SELECT TOP 1 * FROM [AuditEvent] WHERE [AuditEventId] = 0x0B05) UPDATE [AuditEvent] SET [Key] = 'Wi-Fi Host Connect Event', [Value] = 'Wi-Fi Host Connect Event', [IsAlert] = 0 WHERE [AuditEventId] = 0x0B05 ELSE INSERT INTO [AuditEvent] ([AuditEventId], [Key], [Value], [IsAlert]) VALUES (0x0B05, 'Wi-Fi Host Connect Event', 'Wi-Fi Host Connect Event', 0)","IF EXISTS(SELECT TOP 1 * FROM [AuditData] WHERE [AuditDataId] = 35 AND [AuditEventId] = 0x0B05) UPDATE [AuditData] SET [Key] = 'Host disconnected', [Value] = 'Host disconnected', [IsAlert] = 0 WHERE [AuditDataId] = 35 AND [AuditEventId] = 0x0B05 ELSE INSERT INTO [AuditData] ([AuditDataId], [AuditEventId], [Key], [Value], [IsAlert]) VALUES (35, 0x0B05, 'Host disconnected', 'Host disconnected', 0)"]
[null,"Audit","WIFI_HOST_CONN_FAIL    ","Wi-Fi Host Connect Event","Disconnected from AP",24,20,"0x0B05","0024",null,null,null,null,"IF EXISTS(SELECT TOP 1 * FROM [AuditEvent] WHERE [AuditEventId] = 0x0B05) UPDATE [AuditEvent] SET [Key] = 'Wi-Fi Host Connect Event', [Value] = 'Wi-Fi Host Connect Event', [IsAlert] = 0 WHERE [AuditEventId] = 0x0B05 ELSE INSERT INTO [AuditEvent] ([AuditEventId], [Key], [Value], [IsAlert]) VALUES (0x0B05, 'Wi-Fi Host Connect Event', 'Wi-Fi Host Connect Event', 0)","IF EXISTS(SELECT TOP 1 * FROM [AuditData] WHERE [AuditDataId] = 36 AND [AuditEventId] = 0x0B05) UPDATE [AuditData] SET [Key] = 'Disconnected from AP', [Value] = 'Disconnected from AP', [IsAlert] = 0 WHERE [AuditDataId] = 36 AND [AuditEventId] = 0x0B05 ELSE INSERT INTO [AuditData] ([AuditDataId], [AuditEventId], [Key], [Value], [IsAlert]) VALUES (36, 0x0B05, 'Disconnected from AP', 'Disconnected from AP', 0)"]
[null,"Audit","WIFI_HOST_CONN_FAIL    ","Wi-Fi Host Connect Event","Download timeout",24,16,"0x0B05","0025",null,null,null,null,"IF EXISTS(SELECT TOP 1 * FROM [AuditEvent] WHERE [AuditEventId] = 0x0B05) UPDATE [AuditEvent] SET [Key] = 'Wi-Fi Host Connect Event', [Value] = 'Wi-Fi Host Connect Event', [IsAlert] = 0 WHERE [AuditEventId] = 0x0B05 ELSE INSERT INTO [AuditEvent] ([AuditEventId], [Key], [Value], [IsAlert]) VALUES (0x0B05, 'Wi-Fi Host Connect Event', 'Wi-Fi Host Connect Event', 0)","IF EXISTS(SELECT TOP 1 * FROM [AuditData] WHERE [AuditDataId] = 37 AND [AuditEventId] = 0x0B05) UPDATE [AuditData] SET [Key] = 'Download timeout', [Value] = 'Download timeout', [IsAlert] = 0 WHERE [AuditDataId] = 37 AND [AuditEventId] = 0x0B05 ELSE INSERT INTO [AuditData] ([AuditDataId], [AuditEventId], [Key], [Value], [IsAlert]) VALUES (37, 0x0B05, 'Download timeout', 'Download timeout', 0)"]
[null,"Audit","WIFI_HOST_CONN_FAIL    ","Wi-Fi Host Connect Event","JSON audit framing error",24,24,"0x0B05","0026",null,null,null,null,"IF EXISTS(SELECT TOP 1 * FROM [AuditEvent] WHERE [AuditEventId] = 0x0B05) UPDATE [AuditEvent] SET [Key] = 'Wi-Fi Host Connect Event', [Value] = 'Wi-Fi Host Connect Event', [IsAlert] = 0 WHERE [AuditEventId] = 0x0B05 ELSE INSERT INTO [AuditEvent] ([AuditEventId], [Key], [Value], [IsAlert]) VALUES (0x0B05, 'Wi-Fi Host Connect Event', 'Wi-Fi Host Connect Event', 0)","IF EXISTS(SELECT TOP 1 * FROM [AuditData] WHERE [AuditDataId] = 38 AND [AuditEventId] = 0x0B05) UPDATE [AuditData] SET [Key] = 'JSON audit framing error', [Value] = 'JSON audit framing error', [IsAlert] = 0 WHERE [AuditDataId] = 38 AND [AuditEventId] = 0x0B05 ELSE INSERT INTO [AuditData] ([AuditDataId], [AuditEventId], [Key], [Value], [IsAlert]) VALUES (38, 0x0B05, 'JSON audit framing error', 'JSON audit framing error', 0)"]
[null,"Audit","WIFI_HOST_CONN_FAIL    ","Wi-Fi Host Connect Event","Failed to create HTTP header",24,28,"0x0B05","0027",null,null,null,null,"IF EXISTS(SELECT TOP 1 * FROM [AuditEvent] WHERE [AuditEventId] = 0x0B05) UPDATE [AuditEvent] SET [Key] = 'Wi-Fi Host Connect Event', [Value] = 'Wi-Fi Host Connect Event', [IsAlert] = 0 WHERE [AuditEventId] = 0x0B05 ELSE INSERT INTO [AuditEvent] ([AuditEventId], [Key], [Value], [IsAlert]) VALUES (0x0B05, 'Wi-Fi Host Connect Event', 'Wi-Fi Host Connect Event', 0)","IF EXISTS(SELECT TOP 1 * FROM [AuditData] WHERE [AuditDataId] = 39 AND [AuditEventId] = 0x0B05) UPDATE [AuditData] SET [Key] = 'Failed to create HTTP header', [Value] = 'Failed to create HTTP header', [IsAlert] = 0 WHERE [AuditDataId] = 39 AND [AuditEventId] = 0x0B05 ELSE INSERT INTO [AuditData] ([AuditDataId], [AuditEventId], [Key], [Value], [IsAlert]) VALUES (39, 0x0B05, 'Failed to create HTTP header', 'Failed to create HTTP header', 0)"]
[null,"Audit","WIFI_HOST_CONN_FAIL    ","Wi-Fi Host Connect Event","Host did not respond",24,20,"0x0B05","0028",null,null,null,null,"IF EXISTS(SELECT TOP 1 * FROM [AuditEvent] WHERE [AuditEventId] = 0x0B05) UPDATE [AuditEvent] SET [Key] = 'Wi-Fi Host Connect Event', [Value] = 'Wi-Fi Host Connect Event', [IsAlert] = 0 WHERE [AuditEventId] = 0x0B05 ELSE INSERT INTO [AuditEvent] ([AuditEventId], [Key], [Value], [IsAlert]) VALUES (0x0B05, 'Wi-Fi Host Connect Event', 'Wi-Fi Host Connect Event', 0)","IF EXISTS(SELECT TOP 1 * FROM [AuditData] WHERE [AuditDataId] = 40 AND [AuditEventId] = 0x0B05) UPDATE [AuditData] SET [Key] = 'Host did not respond', [Value] = 'Host did not respond', [IsAlert] = 0 WHERE [AuditDataId] = 40 AND [AuditEventId] = 0x0B05 ELSE INSERT INTO [AuditData] ([AuditDataId], [AuditEventId], [Key], [Value], [IsAlert]) VALUES (40, 0x0B05, 'Host did not respond', 'Host did not respond', 0)"]
[null,"Audit","WIFI_HOST_CONN_FAIL    ","Wi-Fi Host Connect Event","Download interrupted by alert",24,29,"0x0B05","0029",null,null,null,null,"IF EXISTS(SELECT TOP 1 * FROM [AuditEvent] WHERE [AuditEventId] = 0x0B05) UPDATE [AuditEvent] SET [Key] = 'Wi-Fi Host Connect Event', [Value] = 'Wi-Fi Host Connect Event', [IsAlert] = 0 WHERE [AuditEventId] = 0x0B05 ELSE INSERT INTO [AuditEvent] ([AuditEventId], [Key], [Value], [IsAlert]) VALUES (0x0B05, 'Wi-Fi Host Connect Event', 'Wi-Fi Host Connect Event', 0)",{"$f":"IF(AND(LEFT(H353,2)=\"0x\",ISNUMBER(HEX2DEC(TRIM(I353))*1)),CONCATENATE(\"IF EXISTS(SELECT TOP 1 * FROM [AuditData] WHERE [AuditDataId] = \",HEX2DEC(I353),\" AND [AuditEventId] = \",H353,\") UPDATE [AuditData] SET [Key] = '\",E353,\"', [Value] = '\",E353,\"', [IsAlert] = 0 WHERE [AuditDataId] = \",HEX2DEC(I353),\" AND [AuditEventId] = \",H353,\" ELSE INSERT INTO [AuditData] ([AuditDataId], [AuditEventId], [Key], [Value], [IsAlert]) VALUES (\",HEX2DEC(I353),\", \",H353,\", '\",E353,\"', '\",E353,\"', 0)\"),\"-- no value\")","v":"IF EXISTS(SELECT TOP 1 * FROM [AuditData] WHERE [AuditDataId] = 41 AND [AuditEventId] = 0x0B05) UPDATE [AuditData] SET [Key] = 'Download interrupted by alert', [Value] = 'Download interrupted by alert', [IsAlert] = 0 WHERE [AuditDataId] = 41 AND [AuditEventId] = 0x0B05 ELSE INSERT INTO [AuditData] ([AuditDataId], [AuditEventId], [Key], [Value], [IsAlert]) VALUES (41, 0x0B05, 'Download interrupted by alert', 'Download interrupted by alert', 0)"}]
[null,"Audit","WIFI_HOST_CONN_FAIL    ","Wi-Fi Host Connect Event","Active tamper stopped download",24,30,"0x0B05","002A",null,null,null,null,"IF EXISTS(SELECT TOP 1 * FROM [AuditEvent] WHERE [AuditEventId] = 0x0B05) UPDATE [AuditEvent] SET [Key] = 'Wi-Fi Host Connect Event', [Value] = 'Wi-Fi Host Connect Event', [IsAlert] = 0 WHERE [AuditEventId] = 0x0B05 ELSE INSERT INTO [AuditEvent] ([AuditEventId], [Key], [Value], [IsAlert]) VALUES (0x0B05, 'Wi-Fi Host Connect Event', 'Wi-Fi Host Connect Event', 0)","IF EXISTS(SELECT TOP 1 * FROM [AuditData] WHERE [AuditDataId] = 42 AND [AuditEventId] = 0x0B05) UPDATE [AuditData] SET [Key] = 'Active tamper stopped download', [Value] = 'Active tamper stopped download', [IsAlert] = 0 WHERE [AuditDataId] = 42 AND [AuditEventId] = 0x0B05 ELSE INSERT INTO [AuditData] ([AuditDataId], [AuditEventId], [Key], [Value], [IsAlert]) VALUES (42, 0x0B05, 'Active tamper stopped download', 'Active tamper stopped download', 0)"]
[null,"Audit","WIFI_HOST_CONN_FAIL    ","Wi-Fi Host Connect Event","No HTTP content received",24,24,"0x0B05","002B",null,null,null,null,"IF EXISTS(SELECT TOP 1 * FROM [AuditEvent] WHERE [AuditEventId] = 0x0B05) UPDATE [AuditEvent] SET [Key] = 'Wi-Fi Host Connect Event', [Value] = 'Wi-Fi Host Connect Event', [IsAlert] = 0 WHERE [AuditEventId] = 0x0B05 ELSE INSERT INTO [AuditEvent] ([AuditEventId], [Key], [Value], [IsAlert]) VALUES (0x0B05, 'Wi-Fi Host Connect Event', 'Wi-Fi Host Connect Event', 0)","IF EXISTS(SELECT TOP 1 * FROM [AuditData] WHERE [AuditDataId] = 43 AND [AuditEventId] = 0x0B05) UPDATE [AuditData] SET [Key] = 'No HTTP content received', [Value] = 'No HTTP content received', [IsAlert] = 0 WHERE [AuditDataId] = 43 AND [AuditEventId] = 0x0B05 ELSE INSERT INTO [AuditData] ([AuditDataId], [AuditEventId], [Key], [Value], [IsAlert]) VALUES (43, 0x0B05, 'No HTTP content received', 'No HTTP content received', 0)"]
[null,"Audit","WIFI_HOST_CONN_FAIL    ","Wi-Fi Host Connect Event","Init AP mode failed",24,19,"0x0B05","002C",null,null,null,null,{"$f":"IF(LEFT(H356,2)=\"0x\",CONCATENATE(\"IF EXISTS(SELECT TOP 1 * FROM [AuditEvent] WHERE [AuditEventId] = \",H356,\") UPDATE [AuditEvent] SET [Key] = '\",TRIM(D356),\"', [Value] = '\",TRIM(D356),\"', [IsAlert] = \",IF(B356=\"Audit\",0,1),\" WHERE [AuditEventId] = \",H356,\" ELSE INSERT INTO [AuditEvent] ([AuditEventId], [Key], [Value], [IsAlert]) VALUES (\",H356,\", '\",TRIM(D356),\"', '\",TRIM(D356),\"', \",IF(B356=\"Audit\",0,1), \")\"),\"-- no value\")","v":"IF EXISTS(SELECT TOP 1 * FROM [AuditEvent] WHERE [AuditEventId] = 0x0B05) UPDATE [AuditEvent] SET [Key] = 'Wi-Fi Host Connect Event', [Value] = 'Wi-Fi Host Connect Event', [IsAlert] = 0 WHERE [AuditEventId] = 0x0B05 ELSE INSERT INTO [AuditEvent] ([AuditEventId], [Key], [Value], [IsAlert]) VALUES (0x0B05, 'Wi-Fi Host Connect Event', 'Wi-Fi Host Connect Event', 0)"},"IF EXISTS(SELECT TOP 1 * FROM [AuditData] WHERE [AuditDataId] = 44 AND [AuditEventId] = 0x0B05) UPDATE [AuditData] SET [Key] = 'Init AP mode failed', [Value] = 'Init AP mode failed', [IsAlert] = 0 WHERE [AuditDataId] = 44 AND [AuditEventId] = 0x0B05 ELSE INSERT INTO [AuditData] ([AuditDataId], [AuditEventId], [Key], [Value], [IsAlert]) VALUES (44, 0x0B05, 'Init AP mode failed', 'Init AP mode failed', 0)"]
[null,"Audit","WIFI_HOST_CONN_FAIL    ","Wi-Fi Host Connect Event","Client mode failed",24,18,"0x0B05","002D",null,null,null,null,"IF EXISTS(SELECT TOP 1 * FROM [AuditEvent] WHERE [AuditEventId] = 0x0B05) UPDATE [AuditEvent] SET [Key] = 'Wi-Fi Host Connect Event', [Value] = 'Wi-Fi Host Connect Event', [IsAlert] = 0 WHERE [AuditEventId] = 0x0B05 ELSE INSERT INTO [AuditEvent] ([AuditEventId], [Key], [Value], [IsAlert]) VALUES (0x0B05, 'Wi-Fi Host Connect Event', 'Wi-Fi Host Connect Event', 0)","IF EXISTS(SELECT TOP 1 * FROM [AuditData] WHERE [AuditDataId] = 45 AND [AuditEventId] = 0x0B05) UPDATE [AuditData] SET [Key] = 'Client mode failed', [Value] = 'Client mode failed', [IsAlert] = 0 WHERE [AuditDataId] = 45 AND [AuditEventId] = 0x0B05 ELSE INSERT INTO [AuditData] ([AuditDataId], [AuditEventId], [Key], [Value], [IsAlert]) VALUES (45, 0x0B05, 'Client mode failed', 'Client mode failed', 0)"]
[null,"Audit","WIFI_HOST_CONN_FAIL    ","Wi-Fi Host Connect Event","AP mode active",24,14,"0x0B05","002E",null,null,null,null,"IF EXISTS(SELECT TOP 1 * FROM [AuditEvent] WHERE [AuditEventId] = 0x0B05) UPDATE [AuditEvent] SET [Key] = 'Wi-Fi Host Connect Event', [Value] = 'Wi-Fi Host Connect Event', [IsAlert] = 0 WHERE [AuditEventId] = 0x0B05 ELSE INSERT INTO [AuditEvent] ([AuditEventId], [Key], [Value], [IsAlert]) VALUES (0x0B05, 'Wi-Fi Host Connect Event', 'Wi-Fi Host Connect Event', 0)","IF EXISTS(SELECT TOP 1 * FROM [AuditData] WHERE [AuditDataId] = 46 AND [AuditEventId] = 0x0B05) UPDATE [AuditData] SET [Key] = 'AP mode active', [Value] = 'AP mode active', [IsAlert] = 0 WHERE [AuditDataId] = 46 AND [AuditEventId] = 0x0B05 ELSE INSERT INTO [AuditData] ([AuditDataId], [AuditEventId], [Key], [Value], [IsAlert]) VALUES (46, 0x0B05, 'AP mode active', 'AP mode active', 0)"]
[null,"Audit","WIFI_HOST_CONN_FAIL    ","Wi-Fi Host Connect Event","AP mode off",24,11,"0x0B05","002F",null,null,null,null,"IF EXISTS(SELECT TOP 1 * FROM [AuditEvent] WHERE [AuditEventId] = 0x0B05) UPDATE [AuditEvent] SET [Key] = 'Wi-Fi Host Connect Event', [Value] = 'Wi-Fi Host Connect Event', [IsAlert] = 0 WHERE [AuditEventId] = 0x0B05 ELSE INSERT INTO [AuditEvent] ([AuditEventId], [Key], [Value], [IsAlert]) VALUES (0x0B05, 'Wi-Fi Host Connect Event', 'Wi-Fi Host Connect Event', 0)","IF EXISTS(SELECT TOP 1 * FROM [AuditData] WHERE [AuditDataId] = 47 AND [AuditEventId] = 0x0B05) UPDATE [AuditData] SET [Key] = 'AP mode off', [Value] = 'AP mode off', [IsAlert] = 0 WHERE [AuditDataId] = 47 AND [AuditEventId] = 0x0B05 ELSE INSERT INTO [AuditData] ([AuditDataId], [AuditEventId], [Key], [Value], [IsAlert]) VALUES (47, 0x0B05, 'AP mode off', 'AP mode off', 0)"]
[null,"Audit","WIFI_HOST_CONN_FAIL    ","Wi-Fi Host Connect Event","Server auth failed",24,18,"0x0B05","0030",null,null,null,null,"IF EXISTS(SELECT TOP 1 * FROM [AuditEvent] WHERE [AuditEventId] = 0x0B05) UPDATE [AuditEvent] SET [Key] = 'Wi-Fi Host Connect Event', [Value] = 'Wi-Fi Host Connect Event', [IsAlert] = 0 WHERE [AuditEventId] = 0x0B05 ELSE INSERT INTO [AuditEvent] ([AuditEventId], [Key], [Value], [IsAlert]) VALUES (0x0B05, 'Wi-Fi Host Connect Event', 'Wi-Fi Host Connect Event', 0)","IF EXISTS(SELECT TOP 1 * FROM [AuditData] WHERE [AuditDataId] = 48 AND [AuditEventId] = 0x0B05) UPDATE [AuditData] SET [Key] = 'Server auth failed', [Value] = 'Server auth failed', [IsAlert] = 0 WHERE [AuditDataId] = 48 AND [AuditEventId] = 0x0B05 ELSE INSERT INTO [AuditData] ([AuditDataId], [AuditEventId], [Key], [Value], [IsAlert]) VALUES (48, 0x0B05, 'Server auth failed', 'Server auth failed', 0)"]
[null,"Audit","WIFI_HOST_CONN_FAIL    ","Wi-Fi Host Connect Event","Missing Site Key",null,{"$f":"LEN(E361)","v":16},"0x0B05","0031",null,null,null,null,"IF EXISTS(SELECT TOP 1 * FROM [AuditEvent] WHERE [AuditEventId] = 0x0B05) UPDATE [AuditEvent] SET [Key] = 'Wi-Fi Host Connect Event', [Value] = 'Wi-Fi Host Connect Event', [IsAlert] = 0 WHERE [AuditEventId] = 0x0B05 ELSE INSERT INTO [AuditEvent] ([AuditEventId], [Key], [Value], [IsAlert]) VALUES (0x0B05, 'Wi-Fi Host Connect Event', 'Wi-Fi Host Connect Event', 0)","IF EXISTS(SELECT TOP 1 * FROM [AuditData] WHERE [AuditDataId] = 49 AND [AuditEventId] = 0x0B05) UPDATE [AuditData] SET [Key] = 'Missing Site Key', [Value] = 'Missing Site Key', [IsAlert] = 0 WHERE [AuditDataId] = 49 AND [AuditEventId] = 0x0B05 ELSE INSERT INTO [AuditData] ([AuditDataId], [AuditEventId], [Key], [Value], [IsAlert]) VALUES (49, 0x0B05, 'Missing Site Key', 'Missing Site Key', 0)"]
[null,"Audit","WIFI_HOST_CONN_FAIL    ","Wi-Fi Host Connect Event","Download Retry",null,14,"0x0B05","0032",null,null,null,null,"IF EXISTS(SELECT TOP 1 * FROM [AuditEvent] WHERE [AuditEventId] = 0x0B05) UPDATE [AuditEvent] SET [Key] = 'Wi-Fi Host Connect Event', [Value] = 'Wi-Fi Host Connect Event', [IsAlert] = 0 WHERE [AuditEventId] = 0x0B05 ELSE INSERT INTO [AuditEvent] ([AuditEventId], [Key], [Value], [IsAlert]) VALUES (0x0B05, 'Wi-Fi Host Connect Event', 'Wi-Fi Host Connect Event', 0)","IF EXISTS(SELECT TOP 1 * FROM [AuditData] WHERE [AuditDataId] = 50 AND [AuditEventId] = 0x0B05) UPDATE [AuditData] SET [Key] = 'Download Retry', [Value] = 'Download Retry', [IsAlert] = 0 WHERE [AuditDataId] = 50 AND [AuditEventId] = 0x0B05 ELSE INSERT INTO [AuditData] ([AuditDataId], [AuditEventId], [Key], [Value], [IsAlert]) VALUES (50, 0x0B05, 'Download Retry', 'Download Retry', 0)"]
[null,"Audit","WIFI_HOST_CONN_FAIL    ","Wi-Fi Host Connect Event","AP Mode timeout Error",null,21,"0x0B05","0033",null,null,null,null,"IF EXISTS(SELECT TOP 1 * FROM [AuditEvent] WHERE [AuditEventId] = 0x0B05) UPDATE [AuditEvent] SET [Key] = 'Wi-Fi Host Connect Event', [Value] = 'Wi-Fi Host Connect Event', [IsAlert] = 0 WHERE [AuditEventId] = 0x0B05 ELSE INSERT INTO [AuditEvent] ([AuditEventId], [Key], [Value], [IsAlert]) VALUES (0x0B05, 'Wi-Fi Host Connect Event', 'Wi-Fi Host Connect Event', 0)","IF EXISTS(SELECT TOP 1 * FROM [AuditData] WHERE [AuditDataId] = 51 AND [AuditEventId] = 0x0B05) UPDATE [AuditData] SET [Key] = 'AP Mode timeout Error', [Value] = 'AP Mode timeout Error', [IsAlert] = 0 WHERE [AuditDataId] = 51 AND [AuditEventId] = 0x0B05 ELSE INSERT INTO [AuditData] ([AuditDataId], [AuditEventId], [Key], [Value], [IsAlert]) VALUES (51, 0x0B05, 'AP Mode timeout Error', 'AP Mode timeout Error', 0)"]
[null,"Audit","WIFI_HOST_CONN_FAIL    ","Wi-Fi Host Connect Event","Incorrect Password",null,18,"0x0B05","0035",null,null,null,null,"IF EXISTS(SELECT TOP 1 * FROM [AuditEvent] WHERE [AuditEventId] = 0x0B05) UPDATE [AuditEvent] SET [Key] = 'Wi-Fi Host Connect Event', [Value] = 'Wi-Fi Host Connect Event', [IsAlert] = 0 WHERE [AuditEventId] = 0x0B05 ELSE INSERT INTO [AuditEvent] ([AuditEventId], [Key], [Value], [IsAlert]) VALUES (0x0B05, 'Wi-Fi Host Connect Event', 'Wi-Fi Host Connect Event', 0)","IF EXISTS(SELECT TOP 1 * FROM [AuditData] WHERE [AuditDataId] = 53 AND [AuditEventId] = 0x0B05) UPDATE [AuditData] SET [Key] = 'Incorrect Password', [Value] = 'Incorrect Password', [IsAlert] = 0 WHERE [AuditDataId] = 53 AND [AuditEventId] = 0x0B05 ELSE INSERT INTO [AuditData] ([AuditDataId], [AuditEventId], [Key], [Value], [IsAlert]) VALUES (53, 0x0B05, 'Incorrect Password', 'Incorrect Password', 0)"]
[null,"Audit","WIFI_HOST_CONN_FAIL    ","Wi-Fi Host Connect Event","Incorrect SSID or Poor Signal",null,29,"0x0B05","0036",null,null,null,null,"IF EXISTS(SELECT TOP 1 * FROM [AuditEvent] WHERE [AuditEventId] = 0x0B05) UPDATE [AuditEvent] SET [Key] = 'Wi-Fi Host Connect Event', [Value] = 'Wi-Fi Host Connect Event', [IsAlert] = 0 WHERE [AuditEventId] = 0x0B05 ELSE INSERT INTO [AuditEvent] ([AuditEventId], [Key], [Value], [IsAlert]) VALUES (0x0B05, 'Wi-Fi Host Connect Event', 'Wi-Fi Host Connect Event', 0)","IF EXISTS(SELECT TOP 1 * FROM [AuditData] WHERE [AuditDataId] = 54 AND [AuditEventId] = 0x0B05) UPDATE [AuditData] SET [Key] = 'Incorrect SSID or Poor Signal', [Value] = 'Incorrect SSID or Poor Signal', [IsAlert] = 0 WHERE [AuditDataId] = 54 AND [AuditEventId] = 0x0B05 ELSE INSERT INTO [AuditData] ([AuditDataId], [AuditEventId], [Key], [Value], [IsAlert]) VALUES (54, 0x0B05, 'Incorrect SSID or Poor Signal', 'Incorrect SSID or Poor Signal', 0)"]
[null,"Audit","WIFI_HOST_CONN_FAIL    ","Wi-Fi Host Connect Event","Incorrect User-ID or Password",null,29,"0x0B05","0037",null,null,null,null,"IF EXISTS(SELECT TOP 1 * FROM [AuditEvent] WHERE [AuditEventId] = 0x0B05) UPDATE [AuditEvent] SET [Key] = 'Wi-Fi Host Connect Event', [Value] = 'Wi-Fi Host Connect Event', [IsAlert] = 0 WHERE [AuditEventId] = 0x0B05 ELSE INSERT INTO [AuditEvent] ([AuditEventId], [Key], [Value], [IsAlert]) VALUES (0x0B05, 'Wi-Fi Host Connect Event', 'Wi-Fi Host Connect Event', 0)","IF EXISTS(SELECT TOP 1 * FROM [AuditData] WHERE [AuditDataId] = 55 AND [AuditEventId] = 0x0B05) UPDATE [AuditData] SET [Key] = 'Incorrect User-ID or Password', [Value] = 'Incorrect User-ID or Password', [IsAlert] = 0 WHERE [AuditDataId] = 55 AND [AuditEventId] = 0x0B05 ELSE INSERT INTO [AuditData] ([AuditDataId], [AuditEventId], [Key], [Value], [IsAlert]) VALUES (55, 0x0B05, 'Incorrect User-ID or Password', 'Incorrect User-ID or Password', 0)"]
[null,"Audit","WIFI_HOST_CONN_FAIL    ","Wi-Fi Host Connect Event","TLS Certificate Validation Failed",null,33,"0x0B05","0038",null,null,null,null,"IF EXISTS(SELECT TOP 1 * FROM [AuditEvent] WHERE [AuditEventId] = 0x0B05) UPDATE [AuditEvent] SET [Key] = 'Wi-Fi Host Connect Event', [Value] = 'Wi-Fi Host Connect Event', [IsAlert] = 0 WHERE [AuditEventId] = 0x0B05 ELSE INSERT INTO [AuditEvent] ([AuditEventId], [Key], [Value], [IsAlert]) VALUES (0x0B05, 'Wi-Fi Host Connect Event', 'Wi-Fi Host Connect Event', 0)","IF EXISTS(SELECT TOP 1 * FROM [AuditData] WHERE [AuditDataId] = 56 AND [AuditEventId] = 0x0B05) UPDATE [AuditData] SET [Key] = 'TLS Certificate Validation Failed', [Value] = 'TLS Certificate Validation Failed', [IsAlert] = 0 WHERE [AuditDataId] = 56 AND [AuditEventId] = 0x0B05 ELSE INSERT INTO [AuditData] ([AuditDataId], [AuditEventId], [Key], [Value], [IsAlert]) VALUES (56, 0x0B05, 'TLS Certificate Validation Failed', 'TLS Certificate Validation Failed', 0)"]
[null,"Audit","WIFI_GOT_VALID_HTTP_HEAD   ","Valid HTTP header received",null,{"$f":"LEN(D368)","v":26},0,"0x0B06",0,null,null,null,null,"IF EXISTS(SELECT TOP 1 * FROM [AuditEvent] WHERE [AuditEventId] = 0x0B06) UPDATE [AuditEvent] SET [Key] = 'Valid HTTP header received', [Value] = 'Valid HTTP header received', [IsAlert] = 0 WHERE [AuditEventId] = 0x0B06 ELSE INSERT INTO [AuditEvent] ([AuditEventId], [Key], [Value], [IsAlert]) VALUES (0x0B06, 'Valid HTTP header received', 'Valid HTTP header received', 0)","IF EXISTS(SELECT TOP 1 * FROM [AuditData] WHERE [AuditDataId] = 0 AND [AuditEventId] = 0x0B06) UPDATE [AuditData] SET [Key] = '', [Value] = '', [IsAlert] = 0 WHERE [AuditDataId] = 0 AND [AuditEventId] = 0x0B06 ELSE INSERT INTO [AuditData] ([AuditDataId], [AuditEventId], [Key], [Value], [IsAlert]) VALUES (0, 0x0B06, '', '', 0)"]
[null,"Audit","WIFI_DLD_SUCCESS  ","Wi-Fi: Download Successful",null,26,0,"0x0B07",0,null,null,null,null,"IF EXISTS(SELECT TOP 1 * FROM [AuditEvent] WHERE [AuditEventId] = 0x0B07) UPDATE [AuditEvent] SET [Key] = 'Wi-Fi: Download Successful', [Value] = 'Wi-Fi: Download Successful', [IsAlert] = 0 WHERE [AuditEventId] = 0x0B07 ELSE INSERT INTO [AuditEvent] ([AuditEventId], [Key], [Value], [IsAlert]) VALUES (0x0B07, 'Wi-Fi: Download Successful', 'Wi-Fi: Download Successful', 0)","IF EXISTS(SELECT TOP 1 * FROM [AuditData] WHERE [AuditDataId] = 0 AND [AuditEventId] = 0x0B07) UPDATE [AuditData] SET [Key] = '', [Value] = '', [IsAlert] = 0 WHERE [AuditDataId] = 0 AND [AuditEventId] = 0x0B07 ELSE INSERT INTO [AuditData] ([AuditDataId], [AuditEventId], [Key], [Value], [IsAlert]) VALUES (0, 0x0B07, '', '', 0)"]
["`","Audit","WIFI_DLD_SUCCESS  ","Wi-Fi Download Event","TLS Certificate Download Successful",{"$f":"LEN(D370)","v":20},{"$f":"LEN(E370)","v":35},"0x0B07","0039",null,null,null,null,"IF EXISTS(SELECT TOP 1 * FROM [AuditEvent] WHERE [AuditEventId] = 0x0B07) UPDATE [AuditEvent] SET [Key] = 'Wi-Fi Download Event', [Value] = 'Wi-Fi Download Event', [IsAlert] = 0 WHERE [AuditEventId] = 0x0B07 ELSE INSERT INTO [AuditEvent] ([AuditEventId], [Key], [Value], [IsAlert]) VALUES (0x0B07, 'Wi-Fi Download Event', 'Wi-Fi Download Event', 0)","IF EXISTS(SELECT TOP 1 * FROM [AuditData] WHERE [AuditDataId] = 57 AND [AuditEventId] = 0x0B07) UPDATE [AuditData] SET [Key] = 'TLS Certificate Download Successful', [Value] = 'TLS Certificate Download Successful', [IsAlert] = 0 WHERE [AuditDataId] = 57 AND [AuditEventId] = 0x0B07 ELSE INSERT INTO [AuditData] ([AuditDataId], [AuditEventId], [Key], [Value], [IsAlert]) VALUES (57, 0x0B07, 'TLS Certificate Download Successful', 'TLS Certificate Download Successful', 0)"]
[null,"Audit","WIFI_DLD_FAIL                 ","Wi-Fi Download Event","Associated to host",20,18,"0x0B08","0000",null,null,null,null,"IF EXISTS(SELECT TOP 1 * FROM [AuditEvent] WHERE [AuditEventId] = 0x0B08) UPDATE [AuditEvent] SET [Key] = 'Wi-Fi Download Event', [Value] = 'Wi-Fi Download Event', [IsAlert] = 0 WHERE [AuditEventId] = 0x0B08 ELSE INSERT INTO [AuditEvent] ([AuditEventId], [Key], [Value], [IsAlert]) VALUES (0x0B08, 'Wi-Fi Download Event', 'Wi-Fi Download Event', 0)","IF EXISTS(SELECT TOP 1 * FROM [AuditData] WHERE [AuditDataId] = 0 AND [AuditEventId] = 0x0B08) UPDATE [AuditData] SET [Key] = 'Associated to host', [Value] = 'Associated to host', [IsAlert] = 0 WHERE [AuditDataId] = 0 AND [AuditEventId] = 0x0B08 ELSE INSERT INTO [AuditData] ([AuditDataId], [AuditEventId], [Key], [Value], [IsAlert]) VALUES (0, 0x0B08, 'Associated to host', 'Associated to host', 0)"]
[null,"Audit","WIFI_DLD_FAIL                 ","Wi-Fi Download Event","Not initialized",20,15,"0x0B08","0001",null,null,null,null,"IF EXISTS(SELECT TOP 1 * FROM [AuditEvent] WHERE [AuditEventId] = 0x0B08) UPDATE [AuditEvent] SET [Key] = 'Wi-Fi Download Event', [Value] = 'Wi-Fi Download Event', [IsAlert] = 0 WHERE [AuditEventId] = 0x0B08 ELSE INSERT INTO [AuditEvent] ([AuditEventId], [Key], [Value], [IsAlert]) VALUES (0x0B08, 'Wi-Fi Download Event', 'Wi-Fi Download Event', 0)","IF EXISTS(SELECT TOP 1 * FROM [AuditData] WHERE [AuditDataId] = 1 AND [AuditEventId] = 0x0B08) UPDATE [AuditData] SET [Key] = 'Not initialized', [Value] = 'Not initialized', [IsAlert] = 0 WHERE [AuditDataId] = 1 AND [AuditEventId] = 0x0B08 ELSE INSERT INTO [AuditData] ([AuditDataId], [AuditEventId], [Key], [Value], [IsAlert]) VALUES (1, 0x0B08, 'Not initialized', 'Not initialized', 0)"]
[null,"Audit","WIFI_DLD_FAIL                 ","Wi-Fi Download Event","Self-test failed",20,16,"0x0B08","0002",null,null,null,null,"IF EXISTS(SELECT TOP 1 * FROM [AuditEvent] WHERE [AuditEventId] = 0x0B08) UPDATE [AuditEvent] SET [Key] = 'Wi-Fi Download Event', [Value] = 'Wi-Fi Download Event', [IsAlert] = 0 WHERE [AuditEventId] = 0x0B08 ELSE INSERT INTO [AuditEvent] ([AuditEventId], [Key], [Value], [IsAlert]) VALUES (0x0B08, 'Wi-Fi Download Event', 'Wi-Fi Download Event', 0)","IF EXISTS(SELECT TOP 1 * FROM [AuditData] WHERE [AuditDataId] = 2 AND [AuditEventId] = 0x0B08) UPDATE [AuditData] SET [Key] = 'Self-test failed', [Value] = 'Self-test failed', [IsAlert] = 0 WHERE [AuditDataId] = 2 AND [AuditEventId] = 0x0B08 ELSE INSERT INTO [AuditData] ([AuditDataId], [AuditEventId], [Key], [Value], [IsAlert]) VALUES (2, 0x0B08, 'Self-test failed', 'Self-test failed', 0)"]
[null,"Audit","WIFI_DLD_FAIL                 ","Wi-Fi Download Event","Wi-Fi lockup: in data mode",20,26,"0x0B08","0003",null,null,null,null,"IF EXISTS(SELECT TOP 1 * FROM [AuditEvent] WHERE [AuditEventId] = 0x0B08) UPDATE [AuditEvent] SET [Key] = 'Wi-Fi Download Event', [Value] = 'Wi-Fi Download Event', [IsAlert] = 0 WHERE [AuditEventId] = 0x0B08 ELSE INSERT INTO [AuditEvent] ([AuditEventId], [Key], [Value], [IsAlert]) VALUES (0x0B08, 'Wi-Fi Download Event', 'Wi-Fi Download Event', 0)","IF EXISTS(SELECT TOP 1 * FROM [AuditData] WHERE [AuditDataId] = 3 AND [AuditEventId] = 0x0B08) UPDATE [AuditData] SET [Key] = 'Wi-Fi lockup: in data mode', [Value] = 'Wi-Fi lockup: in data mode', [IsAlert] = 0 WHERE [AuditDataId] = 3 AND [AuditEventId] = 0x0B08 ELSE INSERT INTO [AuditData] ([AuditDataId], [AuditEventId], [Key], [Value], [IsAlert]) VALUES (3, 0x0B08, 'Wi-Fi lockup: in data mode', 'Wi-Fi lockup: in data mode', 0)"]
[null,"Audit","WIFI_DLD_FAIL                 ","Wi-Fi Download Event","Power-on test failed",20,20,"0x0B08","0004",null,null,null,null,"IF EXISTS(SELECT TOP 1 * FROM [AuditEvent] WHERE [AuditEventId] = 0x0B08) UPDATE [AuditEvent] SET [Key] = 'Wi-Fi Download Event', [Value] = 'Wi-Fi Download Event', [IsAlert] = 0 WHERE [AuditEventId] = 0x0B08 ELSE INSERT INTO [AuditEvent] ([AuditEventId], [Key], [Value], [IsAlert]) VALUES (0x0B08, 'Wi-Fi Download Event', 'Wi-Fi Download Event', 0)","IF EXISTS(SELECT TOP 1 * FROM [AuditData] WHERE [AuditDataId] = 4 AND [AuditEventId] = 0x0B08) UPDATE [AuditData] SET [Key] = 'Power-on test failed', [Value] = 'Power-on test failed', [IsAlert] = 0 WHERE [AuditDataId] = 4 AND [AuditEventId] = 0x0B08 ELSE INSERT INTO [AuditData] ([AuditDataId], [AuditEventId], [Key], [Value], [IsAlert]) VALUES (4, 0x0B08, 'Power-on test failed', 'Power-on test failed', 0)"]
[null,"Audit","WIFI_DLD_FAIL                 ","Wi-Fi Download Event","Invalid configuration ",20,22,"0x0B08","0005",null,null,null,null,"IF EXISTS(SELECT TOP 1 * FROM [AuditEvent] WHERE [AuditEventId] = 0x0B08) UPDATE [AuditEvent] SET [Key] = 'Wi-Fi Download Event', [Value] = 'Wi-Fi Download Event', [IsAlert] = 0 WHERE [AuditEventId] = 0x0B08 ELSE INSERT INTO [AuditEvent] ([AuditEventId], [Key], [Value], [IsAlert]) VALUES (0x0B08, 'Wi-Fi Download Event', 'Wi-Fi Download Event', 0)","IF EXISTS(SELECT TOP 1 * FROM [AuditData] WHERE [AuditDataId] = 5 AND [AuditEventId] = 0x0B08) UPDATE [AuditData] SET [Key] = 'Invalid configuration ', [Value] = 'Invalid configuration ', [IsAlert] = 0 WHERE [AuditDataId] = 5 AND [AuditEventId] = 0x0B08 ELSE INSERT INTO [AuditData] ([AuditDataId], [AuditEventId], [Key], [Value], [IsAlert]) VALUES (5, 0x0B08, 'Invalid configuration ', 'Invalid configuration ', 0)"]
[null,"Audit","WIFI_DLD_FAIL                 ","Wi-Fi Download Event","Configuration failed",20,20,"0x0B08","0006",null,null,null,null,"IF EXISTS(SELECT TOP 1 * FROM [AuditEvent] WHERE [AuditEventId] = 0x0B08) UPDATE [AuditEvent] SET [Key] = 'Wi-Fi Download Event', [Value] = 'Wi-Fi Download Event', [IsAlert] = 0 WHERE [AuditEventId] = 0x0B08 ELSE INSERT INTO [AuditEvent] ([AuditEventId], [Key], [Value], [IsAlert]) VALUES (0x0B08, 'Wi-Fi Download Event', 'Wi-Fi Download Event', 0)","IF EXISTS(SELECT TOP 1 * FROM [AuditData] WHERE [AuditDataId] = 6 AND [AuditEventId] = 0x0B08) UPDATE [AuditData] SET [Key] = 'Configuration failed', [Value] = 'Configuration failed', [IsAlert] = 0 WHERE [AuditDataId] = 6 AND [AuditEventId] = 0x0B08 ELSE INSERT INTO [AuditData] ([AuditDataId], [AuditEventId], [Key], [Value], [IsAlert]) VALUES (6, 0x0B08, 'Configuration failed', 'Configuration failed', 0)"]
[null,"Audit","WIFI_DLD_FAIL                 ","Wi-Fi Download Event","Failed to associate with host",20,29,"0x0B08","0007",null,null,null,null,"IF EXISTS(SELECT TOP 1 * FROM [AuditEvent] WHERE [AuditEventId] = 0x0B08) UPDATE [AuditEvent] SET [Key] = 'Wi-Fi Download Event', [Value] = 'Wi-Fi Download Event', [IsAlert] = 0 WHERE [AuditEventId] = 0x0B08 ELSE INSERT INTO [AuditEvent] ([AuditEventId], [Key], [Value], [IsAlert]) VALUES (0x0B08, 'Wi-Fi Download Event', 'Wi-Fi Download Event', 0)","IF EXISTS(SELECT TOP 1 * FROM [AuditData] WHERE [AuditDataId] = 7 AND [AuditEventId] = 0x0B08) UPDATE [AuditData] SET [Key] = 'Failed to associate with host', [Value] = 'Failed to associate with host', [IsAlert] = 0 WHERE [AuditDataId] = 7 AND [AuditEventId] = 0x0B08 ELSE INSERT INTO [AuditData] ([AuditDataId], [AuditEventId], [Key], [Value], [IsAlert]) VALUES (7, 0x0B08, 'Failed to associate with host', 'Failed to associate with host', 0)"]
[null,"Audit","WIFI_DLD_FAIL                 ","Wi-Fi Download Event","Failed to disassociate from host",20,32,"0x0B08","0008",null,null,null,null,"IF EXISTS(SELECT TOP 1 * FROM [AuditEvent] WHERE [AuditEventId] = 0x0B08) UPDATE [AuditEvent] SET [Key] = 'Wi-Fi Download Event', [Value] = 'Wi-Fi Download Event', [IsAlert] = 0 WHERE [AuditEventId] = 0x0B08 ELSE INSERT INTO [AuditEvent] ([AuditEventId], [Key], [Value], [IsAlert]) VALUES (0x0B08, 'Wi-Fi Download Event', 'Wi-Fi Download Event', 0)","IF EXISTS(SELECT TOP 1 * FROM [AuditData] WHERE [AuditDataId] = 8 AND [AuditEventId] = 0x0B08) UPDATE [AuditData] SET [Key] = 'Failed to disassociate from host', [Value] = 'Failed to disassociate from host', [IsAlert] = 0 WHERE [AuditDataId] = 8 AND [AuditEventId] = 0x0B08 ELSE INSERT INTO [AuditData] ([AuditDataId], [AuditEventId], [Key], [Value], [IsAlert]) VALUES (8, 0x0B08, 'Failed to disassociate from host', 'Failed to disassociate from host', 0)"]
[null,"Audit","WIFI_DLD_FAIL                 ","Wi-Fi Download Event","Failed to obtain IP address",20,27,"0x0B08","0009",null,null,null,null,"IF EXISTS(SELECT TOP 1 * FROM [AuditEvent] WHERE [AuditEventId] = 0x0B08) UPDATE [AuditEvent] SET [Key] = 'Wi-Fi Download Event', [Value] = 'Wi-Fi Download Event', [IsAlert] = 0 WHERE [AuditEventId] = 0x0B08 ELSE INSERT INTO [AuditEvent] ([AuditEventId], [Key], [Value], [IsAlert]) VALUES (0x0B08, 'Wi-Fi Download Event', 'Wi-Fi Download Event', 0)","IF EXISTS(SELECT TOP 1 * FROM [AuditData] WHERE [AuditDataId] = 9 AND [AuditEventId] = 0x0B08) UPDATE [AuditData] SET [Key] = 'Failed to obtain IP address', [Value] = 'Failed to obtain IP address', [IsAlert] = 0 WHERE [AuditDataId] = 9 AND [AuditEventId] = 0x0B08 ELSE INSERT INTO [AuditData] ([AuditDataId], [AuditEventId], [Key], [Value], [IsAlert]) VALUES (9, 0x0B08, 'Failed to obtain IP address', 'Failed to obtain IP address', 0)"]
[null,"Audit","WIFI_DLD_FAIL                 ","Wi-Fi Download Event","Failed to connect to host",20,25,"0x0B08","000A",null,null,null,null,"IF EXISTS(SELECT TOP 1 * FROM [AuditEvent] WHERE [AuditEventId] = 0x0B08) UPDATE [AuditEvent] SET [Key] = 'Wi-Fi Download Event', [Value] = 'Wi-Fi Download Event', [IsAlert] = 0 WHERE [AuditEventId] = 0x0B08 ELSE INSERT INTO [AuditEvent] ([AuditEventId], [Key], [Value], [IsAlert]) VALUES (0x0B08, 'Wi-Fi Download Event', 'Wi-Fi Download Event', 0)","IF EXISTS(SELECT TOP 1 * FROM [AuditData] WHERE [AuditDataId] = 10 AND [AuditEventId] = 0x0B08) UPDATE [AuditData] SET [Key] = 'Failed to connect to host', [Value] = 'Failed to connect to host', [IsAlert] = 0 WHERE [AuditDataId] = 10 AND [AuditEventId] = 0x0B08 ELSE INSERT INTO [AuditData] ([AuditDataId], [AuditEventId], [Key], [Value], [IsAlert]) VALUES (10, 0x0B08, 'Failed to connect to host', 'Failed to connect to host', 0)"]
[null,"Audit","WIFI_DLD_FAIL                 ","Wi-Fi Download Event","DNS Failed",20,10,"0x0B08","000B",null,null,null,null,"IF EXISTS(SELECT TOP 1 * FROM [AuditEvent] WHERE [AuditEventId] = 0x0B08) UPDATE [AuditEvent] SET [Key] = 'Wi-Fi Download Event', [Value] = 'Wi-Fi Download Event', [IsAlert] = 0 WHERE [AuditEventId] = 0x0B08 ELSE INSERT INTO [AuditEvent] ([AuditEventId], [Key], [Value], [IsAlert]) VALUES (0x0B08, 'Wi-Fi Download Event', 'Wi-Fi Download Event', 0)","IF EXISTS(SELECT TOP 1 * FROM [AuditData] WHERE [AuditDataId] = 11 AND [AuditEventId] = 0x0B08) UPDATE [AuditData] SET [Key] = 'DNS Failed', [Value] = 'DNS Failed', [IsAlert] = 0 WHERE [AuditDataId] = 11 AND [AuditEventId] = 0x0B08 ELSE INSERT INTO [AuditData] ([AuditDataId], [AuditEventId], [Key], [Value], [IsAlert]) VALUES (11, 0x0B08, 'DNS Failed', 'DNS Failed', 0)"]
[null,"Audit","WIFI_DLD_FAIL                 ","Wi-Fi Download Event","Wi-Fi configurations not set",20,28,"0x0B08","000C",null,null,null,null,"IF EXISTS(SELECT TOP 1 * FROM [AuditEvent] WHERE [AuditEventId] = 0x0B08) UPDATE [AuditEvent] SET [Key] = 'Wi-Fi Download Event', [Value] = 'Wi-Fi Download Event', [IsAlert] = 0 WHERE [AuditEventId] = 0x0B08 ELSE INSERT INTO [AuditEvent] ([AuditEventId], [Key], [Value], [IsAlert]) VALUES (0x0B08, 'Wi-Fi Download Event', 'Wi-Fi Download Event', 0)","IF EXISTS(SELECT TOP 1 * FROM [AuditData] WHERE [AuditDataId] = 12 AND [AuditEventId] = 0x0B08) UPDATE [AuditData] SET [Key] = 'Wi-Fi configurations not set', [Value] = 'Wi-Fi configurations not set', [IsAlert] = 0 WHERE [AuditDataId] = 12 AND [AuditEventId] = 0x0B08 ELSE INSERT INTO [AuditData] ([AuditDataId], [AuditEventId], [Key], [Value], [IsAlert]) VALUES (12, 0x0B08, 'Wi-Fi configurations not set', 'Wi-Fi configurations not set', 0)"]
[null,"Audit","WIFI_DLD_FAIL                 ","Wi-Fi Download Event","Communication failure",20,21,"0x0B08","000D",null,null,null,null,"IF EXISTS(SELECT TOP 1 * FROM [AuditEvent] WHERE [AuditEventId] = 0x0B08) UPDATE [AuditEvent] SET [Key] = 'Wi-Fi Download Event', [Value] = 'Wi-Fi Download Event', [IsAlert] = 0 WHERE [AuditEventId] = 0x0B08 ELSE INSERT INTO [AuditEvent] ([AuditEventId], [Key], [Value], [IsAlert]) VALUES (0x0B08, 'Wi-Fi Download Event', 'Wi-Fi Download Event', 0)","IF EXISTS(SELECT TOP 1 * FROM [AuditData] WHERE [AuditDataId] = 13 AND [AuditEventId] = 0x0B08) UPDATE [AuditData] SET [Key] = 'Communication failure', [Value] = 'Communication failure', [IsAlert] = 0 WHERE [AuditDataId] = 13 AND [AuditEventId] = 0x0B08 ELSE INSERT INTO [AuditData] ([AuditDataId], [AuditEventId], [Key], [Value], [IsAlert]) VALUES (13, 0x0B08, 'Communication failure', 'Communication failure', 0)"]
[null,"Audit","WIFI_DLD_FAIL                 ","Wi-Fi Download Event","Write config to memory fail",20,27,"0x0B08","000E",null,null,null,null,"IF EXISTS(SELECT TOP 1 * FROM [AuditEvent] WHERE [AuditEventId] = 0x0B08) UPDATE [AuditEvent] SET [Key] = 'Wi-Fi Download Event', [Value] = 'Wi-Fi Download Event', [IsAlert] = 0 WHERE [AuditEventId] = 0x0B08 ELSE INSERT INTO [AuditEvent] ([AuditEventId], [Key], [Value], [IsAlert]) VALUES (0x0B08, 'Wi-Fi Download Event', 'Wi-Fi Download Event', 0)","IF EXISTS(SELECT TOP 1 * FROM [AuditData] WHERE [AuditDataId] = 14 AND [AuditEventId] = 0x0B08) UPDATE [AuditData] SET [Key] = 'Write config to memory fail', [Value] = 'Write config to memory fail', [IsAlert] = 0 WHERE [AuditDataId] = 14 AND [AuditEventId] = 0x0B08 ELSE INSERT INTO [AuditData] ([AuditDataId], [AuditEventId], [Key], [Value], [IsAlert]) VALUES (14, 0x0B08, 'Write config to memory fail', 'Write config to memory fail', 0)"]
[null,"Audit","WIFI_DLD_FAIL                 ","Wi-Fi Download Event","Error getting data from host",20,28,"0x0B08","000F",null,null,null,null,"IF EXISTS(SELECT TOP 1 * FROM [AuditEvent] WHERE [AuditEventId] = 0x0B08) UPDATE [AuditEvent] SET [Key] = 'Wi-Fi Download Event', [Value] = 'Wi-Fi Download Event', [IsAlert] = 0 WHERE [AuditEventId] = 0x0B08 ELSE INSERT INTO [AuditEvent] ([AuditEventId], [Key], [Value], [IsAlert]) VALUES (0x0B08, 'Wi-Fi Download Event', 'Wi-Fi Download Event', 0)","IF EXISTS(SELECT TOP 1 * FROM [AuditData] WHERE [AuditDataId] = 15 AND [AuditEventId] = 0x0B08) UPDATE [AuditData] SET [Key] = 'Error getting data from host', [Value] = 'Error getting data from host', [IsAlert] = 0 WHERE [AuditDataId] = 15 AND [AuditEventId] = 0x0B08 ELSE INSERT INTO [AuditData] ([AuditDataId], [AuditEventId], [Key], [Value], [IsAlert]) VALUES (15, 0x0B08, 'Error getting data from host', 'Error getting data from host', 0)"]
[null,"Audit","WIFI_DLD_FAIL                 ","Wi-Fi Download Event","Error sending data to host",20,26,"0x0B08","0010",null,null,null,null,"IF EXISTS(SELECT TOP 1 * FROM [AuditEvent] WHERE [AuditEventId] = 0x0B08) UPDATE [AuditEvent] SET [Key] = 'Wi-Fi Download Event', [Value] = 'Wi-Fi Download Event', [IsAlert] = 0 WHERE [AuditEventId] = 0x0B08 ELSE INSERT INTO [AuditEvent] ([AuditEventId], [Key], [Value], [IsAlert]) VALUES (0x0B08, 'Wi-Fi Download Event', 'Wi-Fi Download Event', 0)","IF EXISTS(SELECT TOP 1 * FROM [AuditData] WHERE [AuditDataId] = 16 AND [AuditEventId] = 0x0B08) UPDATE [AuditData] SET [Key] = 'Error sending data to host', [Value] = 'Error sending data to host', [IsAlert] = 0 WHERE [AuditDataId] = 16 AND [AuditEventId] = 0x0B08 ELSE INSERT INTO [AuditData] ([AuditDataId], [AuditEventId], [Key], [Value], [IsAlert]) VALUES (16, 0x0B08, 'Error sending data to host', 'Error sending data to host', 0)"]
[null,"Audit","WIFI_DLD_FAIL                 ","Wi-Fi Download Event","Unsupported feature",20,19,"0x0B08","0011",null,null,null,null,"IF EXISTS(SELECT TOP 1 * FROM [AuditEvent] WHERE [AuditEventId] = 0x0B08) UPDATE [AuditEvent] SET [Key] = 'Wi-Fi Download Event', [Value] = 'Wi-Fi Download Event', [IsAlert] = 0 WHERE [AuditEventId] = 0x0B08 ELSE INSERT INTO [AuditEvent] ([AuditEventId], [Key], [Value], [IsAlert]) VALUES (0x0B08, 'Wi-Fi Download Event', 'Wi-Fi Download Event', 0)","IF EXISTS(SELECT TOP 1 * FROM [AuditData] WHERE [AuditDataId] = 17 AND [AuditEventId] = 0x0B08) UPDATE [AuditData] SET [Key] = 'Unsupported feature', [Value] = 'Unsupported feature', [IsAlert] = 0 WHERE [AuditDataId] = 17 AND [AuditEventId] = 0x0B08 ELSE INSERT INTO [AuditData] ([AuditDataId], [AuditEventId], [Key], [Value], [IsAlert]) VALUES (17, 0x0B08, 'Unsupported feature', 'Unsupported feature', 0)"]
[null,"Audit","WIFI_DLD_FAIL                 ","Wi-Fi Download Event","HTTP error received from host",20,29,"0x0B08","0012",null,null,null,null,"IF EXISTS(SELECT TOP 1 * FROM [AuditEvent] WHERE [AuditEventId] = 0x0B08) UPDATE [AuditEvent] SET [Key] = 'Wi-Fi Download Event', [Value] = 'Wi-Fi Download Event', [IsAlert] = 0 WHERE [AuditEventId] = 0x0B08 ELSE INSERT INTO [AuditEvent] ([AuditEventId], [Key], [Value], [IsAlert]) VALUES (0x0B08, 'Wi-Fi Download Event', 'Wi-Fi Download Event', 0)","IF EXISTS(SELECT TOP 1 * FROM [AuditData] WHERE [AuditDataId] = 18 AND [AuditEventId] = 0x0B08) UPDATE [AuditData] SET [Key] = 'HTTP error received from host', [Value] = 'HTTP error received from host', [IsAlert] = 0 WHERE [AuditDataId] = 18 AND [AuditEventId] = 0x0B08 ELSE INSERT INTO [AuditData] ([AuditDataId], [AuditEventId], [Key], [Value], [IsAlert]) VALUES (18, 0x0B08, 'HTTP error received from host', 'HTTP error received from host', 0)"]
[null,"Audit","WIFI_DLD_FAIL                 ","Wi-Fi Download Event","Unknown lock name in URL",20,24,"0x0B08","0013",null,null,null,null,"IF EXISTS(SELECT TOP 1 * FROM [AuditEvent] WHERE [AuditEventId] = 0x0B08) UPDATE [AuditEvent] SET [Key] = 'Wi-Fi Download Event', [Value] = 'Wi-Fi Download Event', [IsAlert] = 0 WHERE [AuditEventId] = 0x0B08 ELSE INSERT INTO [AuditEvent] ([AuditEventId], [Key], [Value], [IsAlert]) VALUES (0x0B08, 'Wi-Fi Download Event', 'Wi-Fi Download Event', 0)","IF EXISTS(SELECT TOP 1 * FROM [AuditData] WHERE [AuditDataId] = 19 AND [AuditEventId] = 0x0B08) UPDATE [AuditData] SET [Key] = 'Unknown lock name in URL', [Value] = 'Unknown lock name in URL', [IsAlert] = 0 WHERE [AuditDataId] = 19 AND [AuditEventId] = 0x0B08 ELSE INSERT INTO [AuditData] ([AuditDataId], [AuditEventId], [Key], [Value], [IsAlert]) VALUES (19, 0x0B08, 'Unknown lock name in URL', 'Unknown lock name in URL', 0)"]
[null,"Audit","WIFI_DLD_FAIL                 ","Wi-Fi Download Event","FTP config error",20,16,"0x0B08","0014",null,null,null,null,"IF EXISTS(SELECT TOP 1 * FROM [AuditEvent] WHERE [AuditEventId] = 0x0B08) UPDATE [AuditEvent] SET [Key] = 'Wi-Fi Download Event', [Value] = 'Wi-Fi Download Event', [IsAlert] = 0 WHERE [AuditEventId] = 0x0B08 ELSE INSERT INTO [AuditEvent] ([AuditEventId], [Key], [Value], [IsAlert]) VALUES (0x0B08, 'Wi-Fi Download Event', 'Wi-Fi Download Event', 0)","IF EXISTS(SELECT TOP 1 * FROM [AuditData] WHERE [AuditDataId] = 20 AND [AuditEventId] = 0x0B08) UPDATE [AuditData] SET [Key] = 'FTP config error', [Value] = 'FTP config error', [IsAlert] = 0 WHERE [AuditDataId] = 20 AND [AuditEventId] = 0x0B08 ELSE INSERT INTO [AuditData] ([AuditDataId], [AuditEventId], [Key], [Value], [IsAlert]) VALUES (20, 0x0B08, 'FTP config error', 'FTP config error', 0)"]
[null,"Audit","WIFI_DLD_FAIL                 ","Wi-Fi Download Event","Network AP retry failed",20,23,"0x0B08","0015",null,null,null,null,"IF EXISTS(SELECT TOP 1 * FROM [AuditEvent] WHERE [AuditEventId] = 0x0B08) UPDATE [AuditEvent] SET [Key] = 'Wi-Fi Download Event', [Value] = 'Wi-Fi Download Event', [IsAlert] = 0 WHERE [AuditEventId] = 0x0B08 ELSE INSERT INTO [AuditEvent] ([AuditEventId], [Key], [Value], [IsAlert]) VALUES (0x0B08, 'Wi-Fi Download Event', 'Wi-Fi Download Event', 0)","IF EXISTS(SELECT TOP 1 * FROM [AuditData] WHERE [AuditDataId] = 21 AND [AuditEventId] = 0x0B08) UPDATE [AuditData] SET [Key] = 'Network AP retry failed', [Value] = 'Network AP retry failed', [IsAlert] = 0 WHERE [AuditDataId] = 21 AND [AuditEventId] = 0x0B08 ELSE INSERT INTO [AuditData] ([AuditDataId], [AuditEventId], [Key], [Value], [IsAlert]) VALUES (21, 0x0B08, 'Network AP retry failed', 'Network AP retry failed', 0)"]
[null,"Audit","WIFI_DLD_FAIL                 ","Wi-Fi Download Event","Data size too large",20,19,"0x0B08","0016",null,null,null,null,"IF EXISTS(SELECT TOP 1 * FROM [AuditEvent] WHERE [AuditEventId] = 0x0B08) UPDATE [AuditEvent] SET [Key] = 'Wi-Fi Download Event', [Value] = 'Wi-Fi Download Event', [IsAlert] = 0 WHERE [AuditEventId] = 0x0B08 ELSE INSERT INTO [AuditEvent] ([AuditEventId], [Key], [Value], [IsAlert]) VALUES (0x0B08, 'Wi-Fi Download Event', 'Wi-Fi Download Event', 0)","IF EXISTS(SELECT TOP 1 * FROM [AuditData] WHERE [AuditDataId] = 22 AND [AuditEventId] = 0x0B08) UPDATE [AuditData] SET [Key] = 'Data size too large', [Value] = 'Data size too large', [IsAlert] = 0 WHERE [AuditDataId] = 22 AND [AuditEventId] = 0x0B08 ELSE INSERT INTO [AuditData] ([AuditDataId], [AuditEventId], [Key], [Value], [IsAlert]) VALUES (22, 0x0B08, 'Data size too large', 'Data size too large', 0)"]
[null,"Audit","WIFI_DLD_FAIL                 ","Wi-Fi Download Event","No buffer during download",20,{"$f":"LEN(E394)","v":25},"0x0B08","0017",null,null,null,null,"IF EXISTS(SELECT TOP 1 * FROM [AuditEvent] WHERE [AuditEventId] = 0x0B08) UPDATE [AuditEvent] SET [Key] = 'Wi-Fi Download Event', [Value] = 'Wi-Fi Download Event', [IsAlert] = 0 WHERE [AuditEventId] = 0x0B08 ELSE INSERT INTO [AuditEvent] ([AuditEventId], [Key], [Value], [IsAlert]) VALUES (0x0B08, 'Wi-Fi Download Event', 'Wi-Fi Download Event', 0)","IF EXISTS(SELECT TOP 1 * FROM [AuditData] WHERE [AuditDataId] = 23 AND [AuditEventId] = 0x0B08) UPDATE [AuditData] SET [Key] = 'No buffer during download', [Value] = 'No buffer during download', [IsAlert] = 0 WHERE [AuditDataId] = 23 AND [AuditEventId] = 0x0B08 ELSE INSERT INTO [AuditData] ([AuditDataId], [AuditEventId], [Key], [Value], [IsAlert]) VALUES (23, 0x0B08, 'No buffer during download', 'No buffer during download', 0)"]
[null,"Audit","WIFI_DLD_FAIL                 ","Wi-Fi Download Event","UART read failed",20,16,"0x0B08","0018",null,null,null,null,"IF EXISTS(SELECT TOP 1 * FROM [AuditEvent] WHERE [AuditEventId] = 0x0B08) UPDATE [AuditEvent] SET [Key] = 'Wi-Fi Download Event', [Value] = 'Wi-Fi Download Event', [IsAlert] = 0 WHERE [AuditEventId] = 0x0B08 ELSE INSERT INTO [AuditEvent] ([AuditEventId], [Key], [Value], [IsAlert]) VALUES (0x0B08, 'Wi-Fi Download Event', 'Wi-Fi Download Event', 0)","IF EXISTS(SELECT TOP 1 * FROM [AuditData] WHERE [AuditDataId] = 24 AND [AuditEventId] = 0x0B08) UPDATE [AuditData] SET [Key] = 'UART read failed', [Value] = 'UART read failed', [IsAlert] = 0 WHERE [AuditDataId] = 24 AND [AuditEventId] = 0x0B08 ELSE INSERT INTO [AuditData] ([AuditDataId], [AuditEventId], [Key], [Value], [IsAlert]) VALUES (24, 0x0B08, 'UART read failed', 'UART read failed', 0)"]
[null,"Audit","WIFI_DLD_FAIL                 ","Wi-Fi Download Event","UART write failed",20,17,"0x0B08","0019",null,null,null,null,"IF EXISTS(SELECT TOP 1 * FROM [AuditEvent] WHERE [AuditEventId] = 0x0B08) UPDATE [AuditEvent] SET [Key] = 'Wi-Fi Download Event', [Value] = 'Wi-Fi Download Event', [IsAlert] = 0 WHERE [AuditEventId] = 0x0B08 ELSE INSERT INTO [AuditEvent] ([AuditEventId], [Key], [Value], [IsAlert]) VALUES (0x0B08, 'Wi-Fi Download Event', 'Wi-Fi Download Event', 0)","IF EXISTS(SELECT TOP 1 * FROM [AuditData] WHERE [AuditDataId] = 25 AND [AuditEventId] = 0x0B08) UPDATE [AuditData] SET [Key] = 'UART write failed', [Value] = 'UART write failed', [IsAlert] = 0 WHERE [AuditDataId] = 25 AND [AuditEventId] = 0x0B08 ELSE INSERT INTO [AuditData] ([AuditDataId], [AuditEventId], [Key], [Value], [IsAlert]) VALUES (25, 0x0B08, 'UART write failed', 'UART write failed', 0)"]
[null,"Audit","WIFI_DLD_FAIL                 ","Wi-Fi Download Event","Error writing to memory",20,23,"0x0B08","001A",null,null,null,null,"IF EXISTS(SELECT TOP 1 * FROM [AuditEvent] WHERE [AuditEventId] = 0x0B08) UPDATE [AuditEvent] SET [Key] = 'Wi-Fi Download Event', [Value] = 'Wi-Fi Download Event', [IsAlert] = 0 WHERE [AuditEventId] = 0x0B08 ELSE INSERT INTO [AuditEvent] ([AuditEventId], [Key], [Value], [IsAlert]) VALUES (0x0B08, 'Wi-Fi Download Event', 'Wi-Fi Download Event', 0)","IF EXISTS(SELECT TOP 1 * FROM [AuditData] WHERE [AuditDataId] = 26 AND [AuditEventId] = 0x0B08) UPDATE [AuditData] SET [Key] = 'Error writing to memory', [Value] = 'Error writing to memory', [IsAlert] = 0 WHERE [AuditDataId] = 26 AND [AuditEventId] = 0x0B08 ELSE INSERT INTO [AuditData] ([AuditDataId], [AuditEventId], [Key], [Value], [IsAlert]) VALUES (26, 0x0B08, 'Error writing to memory', 'Error writing to memory', 0)"]
[null,"Audit","WIFI_DLD_FAIL                 ","Wi-Fi Download Event","Error erasing memory",20,20,"0x0B08","001B",null,null,null,null,"IF EXISTS(SELECT TOP 1 * FROM [AuditEvent] WHERE [AuditEventId] = 0x0B08) UPDATE [AuditEvent] SET [Key] = 'Wi-Fi Download Event', [Value] = 'Wi-Fi Download Event', [IsAlert] = 0 WHERE [AuditEventId] = 0x0B08 ELSE INSERT INTO [AuditEvent] ([AuditEventId], [Key], [Value], [IsAlert]) VALUES (0x0B08, 'Wi-Fi Download Event', 'Wi-Fi Download Event', 0)","IF EXISTS(SELECT TOP 1 * FROM [AuditData] WHERE [AuditDataId] = 27 AND [AuditEventId] = 0x0B08) UPDATE [AuditData] SET [Key] = 'Error erasing memory', [Value] = 'Error erasing memory', [IsAlert] = 0 WHERE [AuditDataId] = 27 AND [AuditEventId] = 0x0B08 ELSE INSERT INTO [AuditData] ([AuditDataId], [AuditEventId], [Key], [Value], [IsAlert]) VALUES (27, 0x0B08, 'Error erasing memory', 'Error erasing memory', 0)"]
[null,"Audit","WIFI_DLD_FAIL                 ","Wi-Fi Download Event","Failed CRC check - invalid FW image",20,35,"0x0B08","001C",null,null,null,null,"IF EXISTS(SELECT TOP 1 * FROM [AuditEvent] WHERE [AuditEventId] = 0x0B08) UPDATE [AuditEvent] SET [Key] = 'Wi-Fi Download Event', [Value] = 'Wi-Fi Download Event', [IsAlert] = 0 WHERE [AuditEventId] = 0x0B08 ELSE INSERT INTO [AuditEvent] ([AuditEventId], [Key], [Value], [IsAlert]) VALUES (0x0B08, 'Wi-Fi Download Event', 'Wi-Fi Download Event', 0)","IF EXISTS(SELECT TOP 1 * FROM [AuditData] WHERE [AuditDataId] = 28 AND [AuditEventId] = 0x0B08) UPDATE [AuditData] SET [Key] = 'Failed CRC check - invalid FW image', [Value] = 'Failed CRC check - invalid FW image', [IsAlert] = 0 WHERE [AuditDataId] = 28 AND [AuditEventId] = 0x0B08 ELSE INSERT INTO [AuditData] ([AuditDataId], [AuditEventId], [Key], [Value], [IsAlert]) VALUES (28, 0x0B08, 'Failed CRC check - invalid FW image', 'Failed CRC check - invalid FW image', 0)"]
[null,"Audit","WIFI_DLD_FAIL                 ","Wi-Fi Download Event","Upgrade: no values received",20,27,"0x0B08","001D",null,null,null,null,"IF EXISTS(SELECT TOP 1 * FROM [AuditEvent] WHERE [AuditEventId] = 0x0B08) UPDATE [AuditEvent] SET [Key] = 'Wi-Fi Download Event', [Value] = 'Wi-Fi Download Event', [IsAlert] = 0 WHERE [AuditEventId] = 0x0B08 ELSE INSERT INTO [AuditEvent] ([AuditEventId], [Key], [Value], [IsAlert]) VALUES (0x0B08, 'Wi-Fi Download Event', 'Wi-Fi Download Event', 0)","IF EXISTS(SELECT TOP 1 * FROM [AuditData] WHERE [AuditDataId] = 29 AND [AuditEventId] = 0x0B08) UPDATE [AuditData] SET [Key] = 'Upgrade: no values received', [Value] = 'Upgrade: no values received', [IsAlert] = 0 WHERE [AuditDataId] = 29 AND [AuditEventId] = 0x0B08 ELSE INSERT INTO [AuditData] ([AuditDataId], [AuditEventId], [Key], [Value], [IsAlert]) VALUES (29, 0x0B08, 'Upgrade: no values received', 'Upgrade: no values received', 0)"]
[null,"Audit","WIFI_DLD_FAIL                 ","Wi-Fi Download Event","Upgrade: invalid values entered",{"$f":"LEN(D401)","v":20},31,"0x0B08","001E",null,null,null,null,"IF EXISTS(SELECT TOP 1 * FROM [AuditEvent] WHERE [AuditEventId] = 0x0B08) UPDATE [AuditEvent] SET [Key] = 'Wi-Fi Download Event', [Value] = 'Wi-Fi Download Event', [IsAlert] = 0 WHERE [AuditEventId] = 0x0B08 ELSE INSERT INTO [AuditEvent] ([AuditEventId], [Key], [Value], [IsAlert]) VALUES (0x0B08, 'Wi-Fi Download Event', 'Wi-Fi Download Event', 0)","IF EXISTS(SELECT TOP 1 * FROM [AuditData] WHERE [AuditDataId] = 30 AND [AuditEventId] = 0x0B08) UPDATE [AuditData] SET [Key] = 'Upgrade: invalid values entered', [Value] = 'Upgrade: invalid values entered', [IsAlert] = 0 WHERE [AuditDataId] = 30 AND [AuditEventId] = 0x0B08 ELSE INSERT INTO [AuditData] ([AuditDataId], [AuditEventId], [Key], [Value], [IsAlert]) VALUES (30, 0x0B08, 'Upgrade: invalid values entered', 'Upgrade: invalid values entered', 0)"]
[null,"Audit","WIFI_DLD_FAIL                 ","Wi-Fi Download Event","Upgrade: transfer failed",20,24,"0x0B08","001F",null,null,null,null,"IF EXISTS(SELECT TOP 1 * FROM [AuditEvent] WHERE [AuditEventId] = 0x0B08) UPDATE [AuditEvent] SET [Key] = 'Wi-Fi Download Event', [Value] = 'Wi-Fi Download Event', [IsAlert] = 0 WHERE [AuditEventId] = 0x0B08 ELSE INSERT INTO [AuditEvent] ([AuditEventId], [Key], [Value], [IsAlert]) VALUES (0x0B08, 'Wi-Fi Download Event', 'Wi-Fi Download Event', 0)","IF EXISTS(SELECT TOP 1 * FROM [AuditData] WHERE [AuditDataId] = 31 AND [AuditEventId] = 0x0B08) UPDATE [AuditData] SET [Key] = 'Upgrade: transfer failed', [Value] = 'Upgrade: transfer failed', [IsAlert] = 0 WHERE [AuditDataId] = 31 AND [AuditEventId] = 0x0B08 ELSE INSERT INTO [AuditData] ([AuditDataId], [AuditEventId], [Key], [Value], [IsAlert]) VALUES (31, 0x0B08, 'Upgrade: transfer failed', 'Upgrade: transfer failed', 0)"]
[null,"Audit","WIFI_DLD_FAIL                 ","Wi-Fi Download Event","Upgrade: installation failed",20,28,"0x0B08","0020",null,null,null,null,"IF EXISTS(SELECT TOP 1 * FROM [AuditEvent] WHERE [AuditEventId] = 0x0B08) UPDATE [AuditEvent] SET [Key] = 'Wi-Fi Download Event', [Value] = 'Wi-Fi Download Event', [IsAlert] = 0 WHERE [AuditEventId] = 0x0B08 ELSE INSERT INTO [AuditEvent] ([AuditEventId], [Key], [Value], [IsAlert]) VALUES (0x0B08, 'Wi-Fi Download Event', 'Wi-Fi Download Event', 0)","IF EXISTS(SELECT TOP 1 * FROM [AuditData] WHERE [AuditDataId] = 32 AND [AuditEventId] = 0x0B08) UPDATE [AuditData] SET [Key] = 'Upgrade: installation failed', [Value] = 'Upgrade: installation failed', [IsAlert] = 0 WHERE [AuditDataId] = 32 AND [AuditEventId] = 0x0B08 ELSE INSERT INTO [AuditData] ([AuditDataId], [AuditEventId], [Key], [Value], [IsAlert]) VALUES (32, 0x0B08, 'Upgrade: installation failed', 'Upgrade: installation failed', 0)"]
[null,"Audit","WIFI_DLD_FAIL                 ","Wi-Fi Download Event","Interrupted by FDR",20,18,"0x0B08","0021",null,null,null,null,"IF EXISTS(SELECT TOP 1 * FROM [AuditEvent] WHERE [AuditEventId] = 0x0B08) UPDATE [AuditEvent] SET [Key] = 'Wi-Fi Download Event', [Value] = 'Wi-Fi Download Event', [IsAlert] = 0 WHERE [AuditEventId] = 0x0B08 ELSE INSERT INTO [AuditEvent] ([AuditEventId], [Key], [Value], [IsAlert]) VALUES (0x0B08, 'Wi-Fi Download Event', 'Wi-Fi Download Event', 0)","IF EXISTS(SELECT TOP 1 * FROM [AuditData] WHERE [AuditDataId] = 33 AND [AuditEventId] = 0x0B08) UPDATE [AuditData] SET [Key] = 'Interrupted by FDR', [Value] = 'Interrupted by FDR', [IsAlert] = 0 WHERE [AuditDataId] = 33 AND [AuditEventId] = 0x0B08 ELSE INSERT INTO [AuditData] ([AuditDataId], [AuditEventId], [Key], [Value], [IsAlert]) VALUES (33, 0x0B08, 'Interrupted by FDR', 'Interrupted by FDR', 0)"]
[null,"Audit","WIFI_DLD_FAIL                 ","Wi-Fi Download Event","Interrupted by power manager",20,28,"0x0B08","0022",null,null,null,null,"IF EXISTS(SELECT TOP 1 * FROM [AuditEvent] WHERE [AuditEventId] = 0x0B08) UPDATE [AuditEvent] SET [Key] = 'Wi-Fi Download Event', [Value] = 'Wi-Fi Download Event', [IsAlert] = 0 WHERE [AuditEventId] = 0x0B08 ELSE INSERT INTO [AuditEvent] ([AuditEventId], [Key], [Value], [IsAlert]) VALUES (0x0B08, 'Wi-Fi Download Event', 'Wi-Fi Download Event', 0)","IF EXISTS(SELECT TOP 1 * FROM [AuditData] WHERE [AuditDataId] = 34 AND [AuditEventId] = 0x0B08) UPDATE [AuditData] SET [Key] = 'Interrupted by power manager', [Value] = 'Interrupted by power manager', [IsAlert] = 0 WHERE [AuditDataId] = 34 AND [AuditEventId] = 0x0B08 ELSE INSERT INTO [AuditData] ([AuditDataId], [AuditEventId], [Key], [Value], [IsAlert]) VALUES (34, 0x0B08, 'Interrupted by power manager', 'Interrupted by power manager', 0)"]
[null,"Audit","WIFI_DLD_FAIL                 ","Wi-Fi Download Event","Host disconnected",20,17,"0x0B08","0023",null,null,null,null,"IF EXISTS(SELECT TOP 1 * FROM [AuditEvent] WHERE [AuditEventId] = 0x0B08) UPDATE [AuditEvent] SET [Key] = 'Wi-Fi Download Event', [Value] = 'Wi-Fi Download Event', [IsAlert] = 0 WHERE [AuditEventId] = 0x0B08 ELSE INSERT INTO [AuditEvent] ([AuditEventId], [Key], [Value], [IsAlert]) VALUES (0x0B08, 'Wi-Fi Download Event', 'Wi-Fi Download Event', 0)","IF EXISTS(SELECT TOP 1 * FROM [AuditData] WHERE [AuditDataId] = 35 AND [AuditEventId] = 0x0B08) UPDATE [AuditData] SET [Key] = 'Host disconnected', [Value] = 'Host disconnected', [IsAlert] = 0 WHERE [AuditDataId] = 35 AND [AuditEventId] = 0x0B08 ELSE INSERT INTO [AuditData] ([AuditDataId], [AuditEventId], [Key], [Value], [IsAlert]) VALUES (35, 0x0B08, 'Host disconnected', 'Host disconnected', 0)"]
[null,"Audit","WIFI_DLD_FAIL                 ","Wi-Fi Download Event","Disconnected from network AP",20,28,"0x0B08","0024",null,null,null,null,"IF EXISTS(SELECT TOP 1 * FROM [AuditEvent] WHERE [AuditEventId] = 0x0B08) UPDATE [AuditEvent] SET [Key] = 'Wi-Fi Download Event', [Value] = 'Wi-Fi Download Event', [IsAlert] = 0 WHERE [AuditEventId] = 0x0B08 ELSE INSERT INTO [AuditEvent] ([AuditEventId], [Key], [Value], [IsAlert]) VALUES (0x0B08, 'Wi-Fi Download Event', 'Wi-Fi Download Event', 0)","IF EXISTS(SELECT TOP 1 * FROM [AuditData] WHERE [AuditDataId] = 36 AND [AuditEventId] = 0x0B08) UPDATE [AuditData] SET [Key] = 'Disconnected from network AP', [Value] = 'Disconnected from network AP', [IsAlert] = 0 WHERE [AuditDataId] = 36 AND [AuditEventId] = 0x0B08 ELSE INSERT INTO [AuditData] ([AuditDataId], [AuditEventId], [Key], [Value], [IsAlert]) VALUES (36, 0x0B08, 'Disconnected from network AP', 'Disconnected from network AP', 0)"]
[null,"Audit","WIFI_DLD_FAIL                 ","Wi-Fi Download Event","Download timeout",20,16,"0x0B08","0025",null,null,null,null,"IF EXISTS(SELECT TOP 1 * FROM [AuditEvent] WHERE [AuditEventId] = 0x0B08) UPDATE [AuditEvent] SET [Key] = 'Wi-Fi Download Event', [Value] = 'Wi-Fi Download Event', [IsAlert] = 0 WHERE [AuditEventId] = 0x0B08 ELSE INSERT INTO [AuditEvent] ([AuditEventId], [Key], [Value], [IsAlert]) VALUES (0x0B08, 'Wi-Fi Download Event', 'Wi-Fi Download Event', 0)","IF EXISTS(SELECT TOP 1 * FROM [AuditData] WHERE [AuditDataId] = 37 AND [AuditEventId] = 0x0B08) UPDATE [AuditData] SET [Key] = 'Download timeout', [Value] = 'Download timeout', [IsAlert] = 0 WHERE [AuditDataId] = 37 AND [AuditEventId] = 0x0B08 ELSE INSERT INTO [AuditData] ([AuditDataId], [AuditEventId], [Key], [Value], [IsAlert]) VALUES (37, 0x0B08, 'Download timeout', 'Download timeout', 0)"]
[null,"Audit","WIFI_DLD_FAIL                 ","Wi-Fi Download Event","JSON audit framing error",20,24,"0x0B08","0026",null,null,null,null,"IF EXISTS(SELECT TOP 1 * FROM [AuditEvent] WHERE [AuditEventId] = 0x0B08) UPDATE [AuditEvent] SET [Key] = 'Wi-Fi Download Event', [Value] = 'Wi-Fi Download Event', [IsAlert] = 0 WHERE [AuditEventId] = 0x0B08 ELSE INSERT INTO [AuditEvent] ([AuditEventId], [Key], [Value], [IsAlert]) VALUES (0x0B08, 'Wi-Fi Download Event', 'Wi-Fi Download Event', 0)","IF EXISTS(SELECT TOP 1 * FROM [AuditData] WHERE [AuditDataId] = 38 AND [AuditEventId] = 0x0B08) UPDATE [AuditData] SET [Key] = 'JSON audit framing error', [Value] = 'JSON audit framing error', [IsAlert] = 0 WHERE [AuditDataId] = 38 AND [AuditEventId] = 0x0B08 ELSE INSERT INTO [AuditData] ([AuditDataId], [AuditEventId], [Key], [Value], [IsAlert]) VALUES (38, 0x0B08, 'JSON audit framing error', 'JSON audit framing error', 0)"]
[null,"Audit","WIFI_DLD_FAIL                 ","Wi-Fi Download Event","Failed to create HTTP header",20,28,"0x0B08","0027",null,null,null,null,"IF EXISTS(SELECT TOP 1 * FROM [AuditEvent] WHERE [AuditEventId] = 0x0B08) UPDATE [AuditEvent] SET [Key] = 'Wi-Fi Download Event', [Value] = 'Wi-Fi Download Event', [IsAlert] = 0 WHERE [AuditEventId] = 0x0B08 ELSE INSERT INTO [AuditEvent] ([AuditEventId], [Key], [Value], [IsAlert]) VALUES (0x0B08, 'Wi-Fi Download Event', 'Wi-Fi Download Event', 0)","IF EXISTS(SELECT TOP 1 * FROM [AuditData] WHERE [AuditDataId] = 39 AND [AuditEventId] = 0x0B08) UPDATE [AuditData] SET [Key] = 'Failed to create HTTP header', [Value] = 'Failed to create HTTP header', [IsAlert] = 0 WHERE [AuditDataId] = 39 AND [AuditEventId] = 0x0B08 ELSE INSERT INTO [AuditData] ([AuditDataId], [AuditEventId], [Key], [Value], [IsAlert]) VALUES (39, 0x0B08, 'Failed to create HTTP header', 'Failed to create HTTP header', 0)"]
[null,"Audit","WIFI_DLD_FAIL                 ","Wi-Fi Download Event","Host did not respond",20,20,"0x0B08","0028",null,null,null,null,"IF EXISTS(SELECT TOP 1 * FROM [AuditEvent] WHERE [AuditEventId] = 0x0B08) UPDATE [AuditEvent] SET [Key] = 'Wi-Fi Download Event', [Value] = 'Wi-Fi Download Event', [IsAlert] = 0 WHERE [AuditEventId] = 0x0B08 ELSE INSERT INTO [AuditEvent] ([AuditEventId], [Key], [Value], [IsAlert]) VALUES (0x0B08, 'Wi-Fi Download Event', 'Wi-Fi Download Event', 0)","IF EXISTS(SELECT TOP 1 * FROM [AuditData] WHERE [AuditDataId] = 40 AND [AuditEventId] = 0x0B08) UPDATE [AuditData] SET [Key] = 'Host did not respond', [Value] = 'Host did not respond', [IsAlert] = 0 WHERE [AuditDataId] = 40 AND [AuditEventId] = 0x0B08 ELSE INSERT INTO [AuditData] ([AuditDataId], [AuditEventId], [Key], [Value], [IsAlert]) VALUES (40, 0x0B08, 'Host did not respond', 'Host did not respond', 0)"]
[null,"Audit","WIFI_DLD_FAIL                 ","Wi-Fi Download Event","Download interrupted by alert",20,29,"0x0B08","0029",null,null,null,null,"IF EXISTS(SELECT TOP 1 * FROM [AuditEvent] WHERE [AuditEventId] = 0x0B08) UPDATE [AuditEvent] SET [Key] = 'Wi-Fi Download Event', [Value] = 'Wi-Fi Download Event', [IsAlert] = 0 WHERE [AuditEventId] = 0x0B08 ELSE INSERT INTO [AuditEvent] ([AuditEventId], [Key], [Value], [IsAlert]) VALUES (0x0B08, 'Wi-Fi Download Event', 'Wi-Fi Download Event', 0)","IF EXISTS(SELECT TOP 1 * FROM [AuditData] WHERE [AuditDataId] = 41 AND [AuditEventId] = 0x0B08) UPDATE [AuditData] SET [Key] = 'Download interrupted by alert', [Value] = 'Download interrupted by alert', [IsAlert] = 0 WHERE [AuditDataId] = 41 AND [AuditEventId] = 0x0B08 ELSE INSERT INTO [AuditData] ([AuditDataId], [AuditEventId], [Key], [Value], [IsAlert]) VALUES (41, 0x0B08, 'Download interrupted by alert', 'Download interrupted by alert', 0)"]
[null,"Audit","WIFI_DLD_FAIL                 ","Wi-Fi Download Event","Active tamper stopped download",20,30,"0x0B08","002A",null,null,null,null,"IF EXISTS(SELECT TOP 1 * FROM [AuditEvent] WHERE [AuditEventId] = 0x0B08) UPDATE [AuditEvent] SET [Key] = 'Wi-Fi Download Event', [Value] = 'Wi-Fi Download Event', [IsAlert] = 0 WHERE [AuditEventId] = 0x0B08 ELSE INSERT INTO [AuditEvent] ([AuditEventId], [Key], [Value], [IsAlert]) VALUES (0x0B08, 'Wi-Fi Download Event', 'Wi-Fi Download Event', 0)","IF EXISTS(SELECT TOP 1 * FROM [AuditData] WHERE [AuditDataId] = 42 AND [AuditEventId] = 0x0B08) UPDATE [AuditData] SET [Key] = 'Active tamper stopped download', [Value] = 'Active tamper stopped download', [IsAlert] = 0 WHERE [AuditDataId] = 42 AND [AuditEventId] = 0x0B08 ELSE INSERT INTO [AuditData] ([AuditDataId], [AuditEventId], [Key], [Value], [IsAlert]) VALUES (42, 0x0B08, 'Active tamper stopped download', 'Active tamper stopped download', 0)"]
[null,"Audit","WIFI_DLD_FAIL                 ","Wi-Fi Download Event","No HTTP content received",20,24,"0x0B08","002B",null,null,null,null,"IF EXISTS(SELECT TOP 1 * FROM [AuditEvent] WHERE [AuditEventId] = 0x0B08) UPDATE [AuditEvent] SET [Key] = 'Wi-Fi Download Event', [Value] = 'Wi-Fi Download Event', [IsAlert] = 0 WHERE [AuditEventId] = 0x0B08 ELSE INSERT INTO [AuditEvent] ([AuditEventId], [Key], [Value], [IsAlert]) VALUES (0x0B08, 'Wi-Fi Download Event', 'Wi-Fi Download Event', 0)","IF EXISTS(SELECT TOP 1 * FROM [AuditData] WHERE [AuditDataId] = 43 AND [AuditEventId] = 0x0B08) UPDATE [AuditData] SET [Key] = 'No HTTP content received', [Value] = 'No HTTP content received', [IsAlert] = 0 WHERE [AuditDataId] = 43 AND [AuditEventId] = 0x0B08 ELSE INSERT INTO [AuditData] ([AuditDataId], [AuditEventId], [Key], [Value], [IsAlert]) VALUES (43, 0x0B08, 'No HTTP content received', 'No HTTP content received', 0)"]
[null,"Audit","WIFI_DLD_FAIL                 ","Wi-Fi Download Event","Init AP mode failed",20,19,"0x0B08","002C",null,null,null,null,"IF EXISTS(SELECT TOP 1 * FROM [AuditEvent] WHERE [AuditEventId] = 0x0B08) UPDATE [AuditEvent] SET [Key] = 'Wi-Fi Download Event', [Value] = 'Wi-Fi Download Event', [IsAlert] = 0 WHERE [AuditEventId] = 0x0B08 ELSE INSERT INTO [AuditEvent] ([AuditEventId], [Key], [Value], [IsAlert]) VALUES (0x0B08, 'Wi-Fi Download Event', 'Wi-Fi Download Event', 0)","IF EXISTS(SELECT TOP 1 * FROM [AuditData] WHERE [AuditDataId] = 44 AND [AuditEventId] = 0x0B08) UPDATE [AuditData] SET [Key] = 'Init AP mode failed', [Value] = 'Init AP mode failed', [IsAlert] = 0 WHERE [AuditDataId] = 44 AND [AuditEventId] = 0x0B08 ELSE INSERT INTO [AuditData] ([AuditDataId], [AuditEventId], [Key], [Value], [IsAlert]) VALUES (44, 0x0B08, 'Init AP mode failed', 'Init AP mode failed', 0)"]
[null,"Audit","WIFI_DLD_FAIL                 ","Wi-Fi Download Event","Client mode failed",20,18,"0x0B08","002D",null,null,null,null,"IF EXISTS(SELECT TOP 1 * FROM [AuditEvent] WHERE [AuditEventId] = 0x0B08) UPDATE [AuditEvent] SET [Key] = 'Wi-Fi Download Event', [Value] = 'Wi-Fi Download Event', [IsAlert] = 0 WHERE [AuditEventId] = 0x0B08 ELSE INSERT INTO [AuditEvent] ([AuditEventId], [Key], [Value], [IsAlert]) VALUES (0x0B08, 'Wi-Fi Download Event', 'Wi-Fi Download Event', 0)","IF EXISTS(SELECT TOP 1 * FROM [AuditData] WHERE [AuditDataId] = 45 AND [AuditEventId] = 0x0B08) UPDATE [AuditData] SET [Key] = 'Client mode failed', [Value] = 'Client mode failed', [IsAlert] = 0 WHERE [AuditDataId] = 45 AND [AuditEventId] = 0x0B08 ELSE INSERT INTO [AuditData] ([AuditDataId], [AuditEventId], [Key], [Value], [IsAlert]) VALUES (45, 0x0B08, 'Client mode failed', 'Client mode failed', 0)"]
[null,"Audit","WIFI_DLD_FAIL                 ","Wi-Fi Download Event","AP mode active",20,14,"0x0B08","002E",null,null,null,null,"IF EXISTS(SELECT TOP 1 * FROM [AuditEvent] WHERE [AuditEventId] = 0x0B08) UPDATE [AuditEvent] SET [Key] = 'Wi-Fi Download Event', [Value] = 'Wi-Fi Download Event', [IsAlert] = 0 WHERE [AuditEventId] = 0x0B08 ELSE INSERT INTO [AuditEvent] ([AuditEventId], [Key], [Value], [IsAlert]) VALUES (0x0B08, 'Wi-Fi Download Event', 'Wi-Fi Download Event', 0)",{"$f":"IF(AND(LEFT(H417,2)=\"0x\",ISNUMBER(HEX2DEC(TRIM(I417))*1)),CONCATENATE(\"IF EXISTS(SELECT TOP 1 * FROM [AuditData] WHERE [AuditDataId] = \",HEX2DEC(I417),\" AND [AuditEventId] = \",H417,\") UPDATE [AuditData] SET [Key] = '\",E417,\"', [Value] = '\",E417,\"', [IsAlert] = 0 WHERE [AuditDataId] = \",HEX2DEC(I417),\" AND [AuditEventId] = \",H417,\" ELSE INSERT INTO [AuditData] ([AuditDataId], [AuditEventId], [Key], [Value], [IsAlert]) VALUES (\",HEX2DEC(I417),\", \",H417,\", '\",E417,\"', '\",E417,\"', 0)\"),\"-- no value\")","v":"IF EXISTS(SELECT TOP 1 * FROM [AuditData] WHERE [AuditDataId] = 46 AND [AuditEventId] = 0x0B08) UPDATE [AuditData] SET [Key] = 'AP mode active', [Value] = 'AP mode active', [IsAlert] = 0 WHERE [AuditDataId] = 46 AND [AuditEventId] = 0x0B08 ELSE INSERT INTO [AuditData] ([AuditDataId], [AuditEventId], [Key], [Value], [IsAlert]) VALUES (46, 0x0B08, 'AP mode active', 'AP mode active', 0)"}]
[null,"Audit","WIFI_DLD_FAIL                 ","Wi-Fi Download Event","AP mode off",20,11,"0x0B08","002F",null,null,null,null,"IF EXISTS(SELECT TOP 1 * FROM [AuditEvent] WHERE [AuditEventId] = 0x0B08) UPDATE [AuditEvent] SET [Key] = 'Wi-Fi Download Event', [Value] = 'Wi-Fi Download Event', [IsAlert] = 0 WHERE [AuditEventId] = 0x0B08 ELSE INSERT INTO [AuditEvent] ([AuditEventId], [Key], [Value], [IsAlert]) VALUES (0x0B08, 'Wi-Fi Download Event', 'Wi-Fi Download Event', 0)","IF EXISTS(SELECT TOP 1 * FROM [AuditData] WHERE [AuditDataId] = 47 AND [AuditEventId] = 0x0B08) UPDATE [AuditData] SET [Key] = 'AP mode off', [Value] = 'AP mode off', [IsAlert] = 0 WHERE [AuditDataId] = 47 AND [AuditEventId] = 0x0B08 ELSE INSERT INTO [AuditData] ([AuditDataId], [AuditEventId], [Key], [Value], [IsAlert]) VALUES (47, 0x0B08, 'AP mode off', 'AP mode off', 0)"]
[null,"Audit","WIFI_DLD_FAIL                 ","Wi-Fi Download Event","Server auth failed",20,18,"0x0B08","0030",null,null,null,null,"IF EXISTS(SELECT TOP 1 * FROM [AuditEvent] WHERE [AuditEventId] = 0x0B08) UPDATE [AuditEvent] SET [Key] = 'Wi-Fi Download Event', [Value] = 'Wi-Fi Download Event', [IsAlert] = 0 WHERE [AuditEventId] = 0x0B08 ELSE INSERT INTO [AuditEvent] ([AuditEventId], [Key], [Value], [IsAlert]) VALUES (0x0B08, 'Wi-Fi Download Event', 'Wi-Fi Download Event', 0)","IF EXISTS(SELECT TOP 1 * FROM [AuditData] WHERE [AuditDataId] = 48 AND [AuditEventId] = 0x0B08) UPDATE [AuditData] SET [Key] = 'Server auth failed', [Value] = 'Server auth failed', [IsAlert] = 0 WHERE [AuditDataId] = 48 AND [AuditEventId] = 0x0B08 ELSE INSERT INTO [AuditData] ([AuditDataId], [AuditEventId], [Key], [Value], [IsAlert]) VALUES (48, 0x0B08, 'Server auth failed', 'Server auth failed', 0)"]
[null,"Audit","WIFI_DLD_FAIL                 ","Wi-Fi Download Event","Missing Site Key",null,null,"0x0B08","0031",null,null,null,null,{"$f":"IF(LEFT(H420,2)=\"0x\",CONCATENATE(\"IF EXISTS(SELECT TOP 1 * FROM [AuditEvent] WHERE [AuditEventId] = \",H420,\") UPDATE [AuditEvent] SET [Key] = '\",TRIM(D420),\"', [Value] = '\",TRIM(D420),\"', [IsAlert] = \",IF(B420=\"Audit\",0,1),\" WHERE [AuditEventId] = \",H420,\" ELSE INSERT INTO [AuditEvent] ([AuditEventId], [Key], [Value], [IsAlert]) VALUES (\",H420,\", '\",TRIM(D420),\"', '\",TRIM(D420),\"', \",IF(B420=\"Audit\",0,1), \")\"),\"-- no value\")","v":"IF EXISTS(SELECT TOP 1 * FROM [AuditEvent] WHERE [AuditEventId] = 0x0B08) UPDATE [AuditEvent] SET [Key] = 'Wi-Fi Download Event', [Value] = 'Wi-Fi Download Event', [IsAlert] = 0 WHERE [AuditEventId] = 0x0B08 ELSE INSERT INTO [AuditEvent] ([AuditEventId], [Key], [Value], [IsAlert]) VALUES (0x0B08, 'Wi-Fi Download Event', 'Wi-Fi Download Event', 0)"},"IF EXISTS(SELECT TOP 1 * FROM [AuditData] WHERE [AuditDataId] = 49 AND [AuditEventId] = 0x0B08) UPDATE [AuditData] SET [Key] = 'Missing Site Key', [Value] = 'Missing Site Key', [IsAlert] = 0 WHERE [AuditDataId] = 49 AND [AuditEventId] = 0x0B08 ELSE INSERT INTO [AuditData] ([AuditDataId], [AuditEventId], [Key], [Value], [IsAlert]) VALUES (49, 0x0B08, 'Missing Site Key', 'Missing Site Key', 0)"]
[null,"Audit","WIFI_DLD_FAIL                 ","Wi-Fi Download Event","Download Retry",null,null,"0x0B08","0032",null,null,null,null,"IF EXISTS(SELECT TOP 1 * FROM [AuditEvent] WHERE [AuditEventId] = 0x0B08) UPDATE [AuditEvent] SET [Key] = 'Wi-Fi Download Event', [Value] = 'Wi-Fi Download Event', [IsAlert] = 0 WHERE [AuditEventId] = 0x0B08 ELSE INSERT INTO [AuditEvent] ([AuditEventId], [Key], [Value], [IsAlert]) VALUES (0x0B08, 'Wi-Fi Download Event', 'Wi-Fi Download Event', 0)","IF EXISTS(SELECT TOP 1 * FROM [AuditData] WHERE [AuditDataId] = 50 AND [AuditEventId] = 0x0B08) UPDATE [AuditData] SET [Key] = 'Download Retry', [Value] = 'Download Retry', [IsAlert] = 0 WHERE [AuditDataId] = 50 AND [AuditEventId] = 0x0B08 ELSE INSERT INTO [AuditData] ([AuditDataId], [AuditEventId], [Key], [Value], [IsAlert]) VALUES (50, 0x0B08, 'Download Retry', 'Download Retry', 0)"]
[null,"Audit","WIFI_DLD_FAIL                 ","Wi-Fi Download Event","AP Mode timeout Error",null,null,"0x0B08","0033",null,null,null,null,"IF EXISTS(SELECT TOP 1 * FROM [AuditEvent] WHERE [AuditEventId] = 0x0B08) UPDATE [AuditEvent] SET [Key] = 'Wi-Fi Download Event', [Value] = 'Wi-Fi Download Event', [IsAlert] = 0 WHERE [AuditEventId] = 0x0B08 ELSE INSERT INTO [AuditEvent] ([AuditEventId], [Key], [Value], [IsAlert]) VALUES (0x0B08, 'Wi-Fi Download Event', 'Wi-Fi Download Event', 0)","IF EXISTS(SELECT TOP 1 * FROM [AuditData] WHERE [AuditDataId] = 51 AND [AuditEventId] = 0x0B08) UPDATE [AuditData] SET [Key] = 'AP Mode timeout Error', [Value] = 'AP Mode timeout Error', [IsAlert] = 0 WHERE [AuditDataId] = 51 AND [AuditEventId] = 0x0B08 ELSE INSERT INTO [AuditData] ([AuditDataId], [AuditEventId], [Key], [Value], [IsAlert]) VALUES (51, 0x0B08, 'AP Mode timeout Error', 'AP Mode timeout Error', 0)"]
[null,"Audit","WIFI_DLD_FAIL                 ","Wi-Fi Download Event","Incorrect SSID or Password",null,null,"0x0B08","0035",null,null,null,null,"IF EXISTS(SELECT TOP 1 * FROM [AuditEvent] WHERE [AuditEventId] = 0x0B08) UPDATE [AuditEvent] SET [Key] = 'Wi-Fi Download Event', [Value] = 'Wi-Fi Download Event', [IsAlert] = 0 WHERE [AuditEventId] = 0x0B08 ELSE INSERT INTO [AuditEvent] ([AuditEventId], [Key], [Value], [IsAlert]) VALUES (0x0B08, 'Wi-Fi Download Event', 'Wi-Fi Download Event', 0)","IF EXISTS(SELECT TOP 1 * FROM [AuditData] WHERE [AuditDataId] = 53 AND [AuditEventId] = 0x0B08) UPDATE [AuditData] SET [Key] = 'Incorrect SSID or Password', [Value] = 'Incorrect SSID or Password', [IsAlert] = 0 WHERE [AuditDataId] = 53 AND [AuditEventId] = 0x0B08 ELSE INSERT INTO [AuditData] ([AuditDataId], [AuditEventId], [Key], [Value], [IsAlert]) VALUES (53, 0x0B08, 'Incorrect SSID or Password', 'Incorrect SSID or Password', 0)"]
[null,"Audit","WIFI_DLD_FAIL                 ","Wi-Fi Download Event","Incorrect SSID or Poor Signal",null,null,"0x0B08","0036",null,null,null,null,"IF EXISTS(SELECT TOP 1 * FROM [AuditEvent] WHERE [AuditEventId] = 0x0B08) UPDATE [AuditEvent] SET [Key] = 'Wi-Fi Download Event', [Value] = 'Wi-Fi Download Event', [IsAlert] = 0 WHERE [AuditEventId] = 0x0B08 ELSE INSERT INTO [AuditEvent] ([AuditEventId], [Key], [Value], [IsAlert]) VALUES (0x0B08, 'Wi-Fi Download Event', 'Wi-Fi Download Event', 0)","IF EXISTS(SELECT TOP 1 * FROM [AuditData] WHERE [AuditDataId] = 54 AND [AuditEventId] = 0x0B08) UPDATE [AuditData] SET [Key] = 'Incorrect SSID or Poor Signal', [Value] = 'Incorrect SSID or Poor Signal', [IsAlert] = 0 WHERE [AuditDataId] = 54 AND [AuditEventId] = 0x0B08 ELSE INSERT INTO [AuditData] ([AuditDataId], [AuditEventId], [Key], [Value], [IsAlert]) VALUES (54, 0x0B08, 'Incorrect SSID or Poor Signal', 'Incorrect SSID or Poor Signal', 0)"]
[null,"Audit","WIFI_DLD_FAIL                 ","Wi-Fi Download Event","Incorrect User-ID or Password",null,null,"0x0B08","0037",null,null,null,null,"IF EXISTS(SELECT TOP 1 * FROM [AuditEvent] WHERE [AuditEventId] = 0x0B08) UPDATE [AuditEvent] SET [Key] = 'Wi-Fi Download Event', [Value] = 'Wi-Fi Download Event', [IsAlert] = 0 WHERE [AuditEventId] = 0x0B08 ELSE INSERT INTO [AuditEvent] ([AuditEventId], [Key], [Value], [IsAlert]) VALUES (0x0B08, 'Wi-Fi Download Event', 'Wi-Fi Download Event', 0)","IF EXISTS(SELECT TOP 1 * FROM [AuditData] WHERE [AuditDataId] = 55 AND [AuditEventId] = 0x0B08) UPDATE [AuditData] SET [Key] = 'Incorrect User-ID or Password', [Value] = 'Incorrect User-ID or Password', [IsAlert] = 0 WHERE [AuditDataId] = 55 AND [AuditEventId] = 0x0B08 ELSE INSERT INTO [AuditData] ([AuditDataId], [AuditEventId], [Key], [Value], [IsAlert]) VALUES (55, 0x0B08, 'Incorrect User-ID or Password', 'Incorrect User-ID or Password', 0)"]
[null,"Audit","WIFI_DLD_FAIL                 ","Wi-Fi Download Event","TLS Certificate Validation Failed",null,null,"0x0B08","0038",null,null,null,null,"IF EXISTS(SELECT TOP 1 * FROM [AuditEvent] WHERE [AuditEventId] = 0x0B08) UPDATE [AuditEvent] SET [Key] = 'Wi-Fi Download Event', [Value] = 'Wi-Fi Download Event', [IsAlert] = 0 WHERE [AuditEventId] = 0x0B08 ELSE INSERT INTO [AuditEvent] ([AuditEventId], [Key], [Value], [IsAlert]) VALUES (0x0B08, 'Wi-Fi Download Event', 'Wi-Fi Download Event', 0)","IF EXISTS(SELECT TOP 1 * FROM [AuditData] WHERE [AuditDataId] = 56 AND [AuditEventId] = 0x0B08) UPDATE [AuditData] SET [Key] = 'TLS Certificate Validation Failed', [Value] = 'TLS Certificate Validation Failed', [IsAlert] = 0 WHERE [AuditDataId] = 56 AND [AuditEventId] = 0x0B08 ELSE INSERT INTO [AuditData] ([AuditDataId], [AuditEventId], [Key], [Value], [IsAlert]) VALUES (56, 0x0B08, 'TLS Certificate Validation Failed', 'TLS Certificate Validation Failed', 0)"]
[null,"Audit","WIFI_CONFIG_UPDATE  ","Wi-Fi Config Updated",null,{"$f":"LEN(D427)","v":20},0,"0x0B09",0,null,null,null,null,"IF EXISTS(SELECT TOP 1 * FROM [AuditEvent] WHERE [AuditEventId] = 0x0B09) UPDATE [AuditEvent] SET [Key] = 'Wi-Fi Config Updated', [Value] = 'Wi-Fi Config Updated', [IsAlert] = 0 WHERE [AuditEventId] = 0x0B09 ELSE INSERT INTO [AuditEvent] ([AuditEventId], [Key], [Value], [IsAlert]) VALUES (0x0B09, 'Wi-Fi Config Updated', 'Wi-Fi Config Updated', 0)","IF EXISTS(SELECT TOP 1 * FROM [AuditData] WHERE [AuditDataId] = 0 AND [AuditEventId] = 0x0B09) UPDATE [AuditData] SET [Key] = '', [Value] = '', [IsAlert] = 0 WHERE [AuditDataId] = 0 AND [AuditEventId] = 0x0B09 ELSE INSERT INTO [AuditData] ([AuditDataId], [AuditEventId], [Key], [Value], [IsAlert]) VALUES (0, 0x0B09, '', '', 0)"]
[null,"Audit","WIFI_EVENT_TRIG               ","Wi-Fi Event Activated",null,21,0,"0x0B0A",0,null,null,null,null,"IF EXISTS(SELECT TOP 1 * FROM [AuditEvent] WHERE [AuditEventId] = 0x0B0A) UPDATE [AuditEvent] SET [Key] = 'Wi-Fi Event Activated', [Value] = 'Wi-Fi Event Activated', [IsAlert] = 0 WHERE [AuditEventId] = 0x0B0A ELSE INSERT INTO [AuditEvent] ([AuditEventId], [Key], [Value], [IsAlert]) VALUES (0x0B0A, 'Wi-Fi Event Activated', 'Wi-Fi Event Activated', 0)","IF EXISTS(SELECT TOP 1 * FROM [AuditData] WHERE [AuditDataId] = 0 AND [AuditEventId] = 0x0B0A) UPDATE [AuditData] SET [Key] = '', [Value] = '', [IsAlert] = 0 WHERE [AuditDataId] = 0 AND [AuditEventId] = 0x0B0A ELSE INSERT INTO [AuditData] ([AuditDataId], [AuditEventId], [Key], [Value], [IsAlert]) VALUES (0, 0x0B0A, '', '', 0)"]
[null,"Audit","WIFI_ON_FAIL                  ","Wi-Fi Module POST Failure",null,25,0,"0x0B0B",0,null,null,null,null,"IF EXISTS(SELECT TOP 1 * FROM [AuditEvent] WHERE [AuditEventId] = 0x0B0B) UPDATE [AuditEvent] SET [Key] = 'Wi-Fi Module POST Failure', [Value] = 'Wi-Fi Module POST Failure', [IsAlert] = 0 WHERE [AuditEventId] = 0x0B0B ELSE INSERT INTO [AuditEvent] ([AuditEventId], [Key], [Value], [IsAlert]) VALUES (0x0B0B, 'Wi-Fi Module POST Failure', 'Wi-Fi Module POST Failure', 0)","IF EXISTS(SELECT TOP 1 * FROM [AuditData] WHERE [AuditDataId] = 0 AND [AuditEventId] = 0x0B0B) UPDATE [AuditData] SET [Key] = '', [Value] = '', [IsAlert] = 0 WHERE [AuditDataId] = 0 AND [AuditEventId] = 0x0B0B ELSE INSERT INTO [AuditData] ([AuditDataId], [AuditEventId], [Key], [Value], [IsAlert]) VALUES (0, 0x0B0B, '', '', 0)"]
[null,"Audit","WIFI_HTTP_ERROR","WIFI HTTP Error","xxxx",null,null,"0x0B0C","XXXX","0 to 65535","HTTP Error Value",null,null,"IF EXISTS(SELECT TOP 1 * FROM [AuditEvent] WHERE [AuditEventId] = 0x0B0C) UPDATE [AuditEvent] SET [Key] = 'WIFI HTTP Error', [Value] = 'WIFI HTTP Error', [IsAlert] = 0 WHERE [AuditEventId] = 0x0B0C ELSE INSERT INTO [AuditEvent] ([AuditEventId], [Key], [Value], [IsAlert]) VALUES (0x0B0C, 'WIFI HTTP Error', 'WIFI HTTP Error', 0)","-- no value"]
[null,"Audit","WIFI_UPDATE_CONFIG_FAIL","Wi-Fi Download Event","Unable to upload configurations",null,null,"0x0B0D",0,null,null,null,null,"IF EXISTS(SELECT TOP 1 * FROM [AuditEvent] WHERE [AuditEventId] = 0x0B0D) UPDATE [AuditEvent] SET [Key] = 'Wi-Fi Download Event', [Value] = 'Wi-Fi Download Event', [IsAlert] = 0 WHERE [AuditEventId] = 0x0B0D ELSE INSERT INTO [AuditEvent] ([AuditEventId], [Key], [Value], [IsAlert]) VALUES (0x0B0D, 'Wi-Fi Download Event', 'Wi-Fi Download Event', 0)","IF EXISTS(SELECT TOP 1 * FROM [AuditData] WHERE [AuditDataId] = 0 AND [AuditEventId] = 0x0B0D) UPDATE [AuditData] SET [Key] = 'Unable to upload configurations', [Value] = 'Unable to upload configurations', [IsAlert] = 0 WHERE [AuditDataId] = 0 AND [AuditEventId] = 0x0B0D ELSE INSERT INTO [AuditData] ([AuditDataId], [AuditEventId], [Key], [Value], [IsAlert]) VALUES (0, 0x0B0D, 'Unable to upload configurations', 'Unable to upload configurations', 0)"]
[null,"Audit","WIFI_NEW_AP_CONFIG","New AP Cfg Event","New AP Cfg Enabled",null,null,"0x0B0E",0,null,null,null,null,"IF EXISTS(SELECT TOP 1 * FROM [AuditEvent] WHERE [AuditEventId] = 0x0B0E) UPDATE [AuditEvent] SET [Key] = 'New AP Cfg Event', [Value] = 'New AP Cfg Event', [IsAlert] = 0 WHERE [AuditEventId] = 0x0B0E ELSE INSERT INTO [AuditEvent] ([AuditEventId], [Key], [Value], [IsAlert]) VALUES (0x0B0E, 'New AP Cfg Event', 'New AP Cfg Event', 0)","IF EXISTS(SELECT TOP 1 * FROM [AuditData] WHERE [AuditDataId] = 0 AND [AuditEventId] = 0x0B0E) UPDATE [AuditData] SET [Key] = 'New AP Cfg Enabled', [Value] = 'New AP Cfg Enabled', [IsAlert] = 0 WHERE [AuditDataId] = 0 AND [AuditEventId] = 0x0B0E ELSE INSERT INTO [AuditData] ([AuditDataId], [AuditEventId], [Key], [Value], [IsAlert]) VALUES (0, 0x0B0E, 'New AP Cfg Enabled', 'New AP Cfg Enabled', 0)"]
[null,"Audit","WIFI_NEW_AP_CONFIG","New AP Cfg Event","New AP Cfg Disabled",null,null,"0x0B0E",1,null,null,null,null,"IF EXISTS(SELECT TOP 1 * FROM [AuditEvent] WHERE [AuditEventId] = 0x0B0E) UPDATE [AuditEvent] SET [Key] = 'New AP Cfg Event', [Value] = 'New AP Cfg Event', [IsAlert] = 0 WHERE [AuditEventId] = 0x0B0E ELSE INSERT INTO [AuditEvent] ([AuditEventId], [Key], [Value], [IsAlert]) VALUES (0x0B0E, 'New AP Cfg Event', 'New AP Cfg Event', 0)","IF EXISTS(SELECT TOP 1 * FROM [AuditData] WHERE [AuditDataId] = 1 AND [AuditEventId] = 0x0B0E) UPDATE [AuditData] SET [Key] = 'New AP Cfg Disabled', [Value] = 'New AP Cfg Disabled', [IsAlert] = 0 WHERE [AuditDataId] = 1 AND [AuditEventId] = 0x0B0E ELSE INSERT INTO [AuditData] ([AuditDataId], [AuditEventId], [Key], [Value], [IsAlert]) VALUES (1, 0x0B0E, 'New AP Cfg Disabled', 'New AP Cfg Disabled', 0)"]
[null,"Audit","WIFI_NEW_AP_CONFIG","New AP Cfg Event","Switched to New AP",null,null,"0X0B0E",2,null,null,null,null,"IF EXISTS(SELECT TOP 1 * FROM [AuditEvent] WHERE [AuditEventId] = 0X0B0E) UPDATE [AuditEvent] SET [Key] = 'New AP Cfg Event', [Value] = 'New AP Cfg Event', [IsAlert] = 0 WHERE [AuditEventId] = 0X0B0E ELSE INSERT INTO [AuditEvent] ([AuditEventId], [Key], [Value], [IsAlert]) VALUES (0X0B0E, 'New AP Cfg Event', 'New AP Cfg Event', 0)","IF EXISTS(SELECT TOP 1 * FROM [AuditData] WHERE [AuditDataId] = 2 AND [AuditEventId] = 0X0B0E) UPDATE [AuditData] SET [Key] = 'Switched to New AP', [Value] = 'Switched to New AP', [IsAlert] = 0 WHERE [AuditDataId] = 2 AND [AuditEventId] = 0X0B0E ELSE INSERT INTO [AuditData] ([AuditDataId], [AuditEventId], [Key], [Value], [IsAlert]) VALUES (2, 0X0B0E, 'Switched to New AP', 'Switched to New AP', 0)"]
[null,"Audit","WIFI_NEW_AP_CONFIG","New AP Cfg Event","New AP Cfg Invalid",null,null,"0X0B0E",3,null,null,null,null,"IF EXISTS(SELECT TOP 1 * FROM [AuditEvent] WHERE [AuditEventId] = 0X0B0E) UPDATE [AuditEvent] SET [Key] = 'New AP Cfg Event', [Value] = 'New AP Cfg Event', [IsAlert] = 0 WHERE [AuditEventId] = 0X0B0E ELSE INSERT INTO [AuditEvent] ([AuditEventId], [Key], [Value], [IsAlert]) VALUES (0X0B0E, 'New AP Cfg Event', 'New AP Cfg Event', 0)","IF EXISTS(SELECT TOP 1 * FROM [AuditData] WHERE [AuditDataId] = 3 AND [AuditEventId] = 0X0B0E) UPDATE [AuditData] SET [Key] = 'New AP Cfg Invalid', [Value] = 'New AP Cfg Invalid', [IsAlert] = 0 WHERE [AuditDataId] = 3 AND [AuditEventId] = 0X0B0E ELSE INSERT INTO [AuditData] ([AuditDataId], [AuditEventId], [Key], [Value], [IsAlert]) VALUES (3, 0X0B0E, 'New AP Cfg Invalid', 'New AP Cfg Invalid', 0)"]
[null,"Audit","WIFI_NEW_AP_CONFIG","New AP Cfg Event","New AP Cfg Time Invalid",null,null,"0X0B0E",4,null,null,null,null,"IF EXISTS(SELECT TOP 1 * FROM [AuditEvent] WHERE [AuditEventId] = 0X0B0E) UPDATE [AuditEvent] SET [Key] = 'New AP Cfg Event', [Value] = 'New AP Cfg Event', [IsAlert] = 0 WHERE [AuditEventId] = 0X0B0E ELSE INSERT INTO [AuditEvent] ([AuditEventId], [Key], [Value], [IsAlert]) VALUES (0X0B0E, 'New AP Cfg Event', 'New AP Cfg Event', 0)","IF EXISTS(SELECT TOP 1 * FROM [AuditData] WHERE [AuditDataId] = 4 AND [AuditEventId] = 0X0B0E) UPDATE [AuditData] SET [Key] = 'New AP Cfg Time Invalid', [Value] = 'New AP Cfg Time Invalid', [IsAlert] = 0 WHERE [AuditDataId] = 4 AND [AuditEventId] = 0X0B0E ELSE INSERT INTO [AuditData] ([AuditDataId], [AuditEventId], [Key], [Value], [IsAlert]) VALUES (4, 0X0B0E, 'New AP Cfg Time Invalid', 'New AP Cfg Time Invalid', 0)"]
["System Current Audits",null,null," ",null,null,null,null,null,null,null,null,null,"-- no value","-- no value"]
["Base Value",null,null,null,null,null,null,null,null,null,null,null,null,"-- no value","-- no value"]
["0C00","Audit","SLEEP_CURRENT  ","System Current (uA)","xxxx",{"$f":"LEN(D439)","v":19},4,"0x0C00","XXXX","0 to 65535","Sleep Current in uA","Sleep Current (in uA) ",null,"IF EXISTS(SELECT TOP 1 * FROM [AuditEvent] WHERE [AuditEventId] = 0x0C00) UPDATE [AuditEvent] SET [Key] = 'System Current (uA)', [Value] = 'System Current (uA)', [IsAlert] = 0 WHERE [AuditEventId] = 0x0C00 ELSE INSERT INTO [AuditEvent] ([AuditEventId], [Key], [Value], [IsAlert]) VALUES (0x0C00, 'System Current (uA)', 'System Current (uA)', 0)","-- no value"]
[null,"Audit","SLEEP_CURRENT_WITH_BLE        ","System Current w/ BLE (uA)","xxxx",26,4,"0x0C01","XXXX","0 to 65535","Sleep Current in uA","Sleep Current With BLE (in uA)",null,"IF EXISTS(SELECT TOP 1 * FROM [AuditEvent] WHERE [AuditEventId] = 0x0C01) UPDATE [AuditEvent] SET [Key] = 'System Current w/ BLE (uA)', [Value] = 'System Current w/ BLE (uA)', [IsAlert] = 0 WHERE [AuditEventId] = 0x0C01 ELSE INSERT INTO [AuditEvent] ([AuditEventId], [Key], [Value], [IsAlert]) VALUES (0x0C01, 'System Current w/ BLE (uA)', 'System Current w/ BLE (uA)', 0)","-- no value"]
[null,"Audit","MOTOR_CURRENT","Motor Failure","Motor failed to turn on",13,23,"0x0C02","0001",null,null,null,null,"IF EXISTS(SELECT TOP 1 * FROM [AuditEvent] WHERE [AuditEventId] = 0x0C02) UPDATE [AuditEvent] SET [Key] = 'Motor Failure', [Value] = 'Motor Failure', [IsAlert] = 0 WHERE [AuditEventId] = 0x0C02 ELSE INSERT INTO [AuditEvent] ([AuditEventId], [Key], [Value], [IsAlert]) VALUES (0x0C02, 'Motor Failure', 'Motor Failure', 0)","IF EXISTS(SELECT TOP 1 * FROM [AuditData] WHERE [AuditDataId] = 1 AND [AuditEventId] = 0x0C02) UPDATE [AuditData] SET [Key] = 'Motor failed to turn on', [Value] = 'Motor failed to turn on', [IsAlert] = 0 WHERE [AuditDataId] = 1 AND [AuditEventId] = 0x0C02 ELSE INSERT INTO [AuditData] ([AuditDataId], [AuditEventId], [Key], [Value], [IsAlert]) VALUES (1, 0x0C02, 'Motor failed to turn on', 'Motor failed to turn on', 0)"]
[null,"Audit","MOTOR_CURRENT","Motor Failure","Motor failed to turn off",13,24,"0x0C02","0002",null,null,null,null,"IF EXISTS(SELECT TOP 1 * FROM [AuditEvent] WHERE [AuditEventId] = 0x0C02) UPDATE [AuditEvent] SET [Key] = 'Motor Failure', [Value] = 'Motor Failure', [IsAlert] = 0 WHERE [AuditEventId] = 0x0C02 ELSE INSERT INTO [AuditEvent] ([AuditEventId], [Key], [Value], [IsAlert]) VALUES (0x0C02, 'Motor Failure', 'Motor Failure', 0)","IF EXISTS(SELECT TOP 1 * FROM [AuditData] WHERE [AuditDataId] = 2 AND [AuditEventId] = 0x0C02) UPDATE [AuditData] SET [Key] = 'Motor failed to turn off', [Value] = 'Motor failed to turn off', [IsAlert] = 0 WHERE [AuditDataId] = 2 AND [AuditEventId] = 0x0C02 ELSE INSERT INTO [AuditData] ([AuditDataId], [AuditEventId], [Key], [Value], [IsAlert]) VALUES (2, 0x0C02, 'Motor failed to turn off', 'Motor failed to turn off', 0)"]
[null,"Audit","READER_CURRENT","Reader Current (mA)","xxxx",19,null,"0x0C04","XXXX","0 to 65535","Daily Max Current in mA","Reader Current (in mA)",null,"IF EXISTS(SELECT TOP 1 * FROM [AuditEvent] WHERE [AuditEventId] = 0x0C04) UPDATE [AuditEvent] SET [Key] = 'Reader Current (mA)', [Value] = 'Reader Current (mA)', [IsAlert] = 0 WHERE [AuditEventId] = 0x0C04 ELSE INSERT INTO [AuditEvent] ([AuditEventId], [Key], [Value], [IsAlert]) VALUES (0x0C04, 'Reader Current (mA)', 'Reader Current (mA)', 0)","-- no value"]
[null,"Audit","WET_CONTACT_CURRENT","Powered Output Current (mA)","xxxx",27,null,"0x0C05","XXXX","0 to 65535","Daily Max Current in mA","Powered Output Current (in mA) ",null,"IF EXISTS(SELECT TOP 1 * FROM [AuditEvent] WHERE [AuditEventId] = 0x0C05) UPDATE [AuditEvent] SET [Key] = 'Powered Output Current (mA)', [Value] = 'Powered Output Current (mA)', [IsAlert] = 0 WHERE [AuditEventId] = 0x0C05 ELSE INSERT INTO [AuditEvent] ([AuditEventId], [Key], [Value], [IsAlert]) VALUES (0x0C05, 'Powered Output Current (mA)', 'Powered Output Current (mA)', 0)","-- no value"]
[null,"Audit","RDR_PWR_FAULT","Reader Power Fault Detected",null,27,null,"0x0C06",0,null,null,null,null,"IF EXISTS(SELECT TOP 1 * FROM [AuditEvent] WHERE [AuditEventId] = 0x0C06) UPDATE [AuditEvent] SET [Key] = 'Reader Power Fault Detected', [Value] = 'Reader Power Fault Detected', [IsAlert] = 0 WHERE [AuditEventId] = 0x0C06 ELSE INSERT INTO [AuditEvent] ([AuditEventId], [Key], [Value], [IsAlert]) VALUES (0x0C06, 'Reader Power Fault Detected', 'Reader Power Fault Detected', 0)","IF EXISTS(SELECT TOP 1 * FROM [AuditData] WHERE [AuditDataId] = 0 AND [AuditEventId] = 0x0C06) UPDATE [AuditData] SET [Key] = '', [Value] = '', [IsAlert] = 0 WHERE [AuditDataId] = 0 AND [AuditEventId] = 0x0C06 ELSE INSERT INTO [AuditData] ([AuditDataId], [AuditEventId], [Key], [Value], [IsAlert]) VALUES (0, 0x0C06, '', '', 0)"]
[null,"Audit","OUTPUT_FAULT","Powered Output Fault Detected",null,29,null,"0x0C07",0,null,null,null,null,"IF EXISTS(SELECT TOP 1 * FROM [AuditEvent] WHERE [AuditEventId] = 0x0C07) UPDATE [AuditEvent] SET [Key] = 'Powered Output Fault Detected', [Value] = 'Powered Output Fault Detected', [IsAlert] = 0 WHERE [AuditEventId] = 0x0C07 ELSE INSERT INTO [AuditEvent] ([AuditEventId], [Key], [Value], [IsAlert]) VALUES (0x0C07, 'Powered Output Fault Detected', 'Powered Output Fault Detected', 0)","IF EXISTS(SELECT TOP 1 * FROM [AuditData] WHERE [AuditDataId] = 0 AND [AuditEventId] = 0x0C07) UPDATE [AuditData] SET [Key] = '', [Value] = '', [IsAlert] = 0 WHERE [AuditDataId] = 0 AND [AuditEventId] = 0x0C07 ELSE INSERT INTO [AuditData] ([AuditDataId], [AuditEventId], [Key], [Value], [IsAlert]) VALUES (0, 0x0C07, '', '', 0)"]
["System Diagnostic Audits",null,null,null,null,null,null,null,null,null,null,null,null,"-- no value","-- no value"]
["Base Value",null,null,null,null,null,null,null,null,null,null,null,null,"-- no value","-- no value"]
["0D00","Audit","IBIT_RESULT   ","Initiated Built in Test","OK : BLE Module",{"$f":"LEN(D449)","v":23},{"$f":"LEN(E449)","v":15},"0x0D00","0000",null,null,null,null,"IF EXISTS(SELECT TOP 1 * FROM [AuditEvent] WHERE [AuditEventId] = 0x0D00) UPDATE [AuditEvent] SET [Key] = 'Initiated Built in Test', [Value] = 'Initiated Built in Test', [IsAlert] = 0 WHERE [AuditEventId] = 0x0D00 ELSE INSERT INTO [AuditEvent] ([AuditEventId], [Key], [Value], [IsAlert]) VALUES (0x0D00, 'Initiated Built in Test', 'Initiated Built in Test', 0)","IF EXISTS(SELECT TOP 1 * FROM [AuditData] WHERE [AuditDataId] = 0 AND [AuditEventId] = 0x0D00) UPDATE [AuditData] SET [Key] = 'OK : BLE Module', [Value] = 'OK : BLE Module', [IsAlert] = 0 WHERE [AuditDataId] = 0 AND [AuditEventId] = 0x0D00 ELSE INSERT INTO [AuditData] ([AuditDataId], [AuditEventId], [Key], [Value], [IsAlert]) VALUES (0, 0x0D00, 'OK : BLE Module', 'OK : BLE Module', 0)"]
[null,"Audit","IBIT_RESULT   ","Initiated Built in Test","OK : Reader Comms",23,17,"0x0D00","0100",null,null,null,null,"IF EXISTS(SELECT TOP 1 * FROM [AuditEvent] WHERE [AuditEventId] = 0x0D00) UPDATE [AuditEvent] SET [Key] = 'Initiated Built in Test', [Value] = 'Initiated Built in Test', [IsAlert] = 0 WHERE [AuditEventId] = 0x0D00 ELSE INSERT INTO [AuditEvent] ([AuditEventId], [Key], [Value], [IsAlert]) VALUES (0x0D00, 'Initiated Built in Test', 'Initiated Built in Test', 0)","IF EXISTS(SELECT TOP 1 * FROM [AuditData] WHERE [AuditDataId] = 256 AND [AuditEventId] = 0x0D00) UPDATE [AuditData] SET [Key] = 'OK : Reader Comms', [Value] = 'OK : Reader Comms', [IsAlert] = 0 WHERE [AuditDataId] = 256 AND [AuditEventId] = 0x0D00 ELSE INSERT INTO [AuditData] ([AuditDataId], [AuditEventId], [Key], [Value], [IsAlert]) VALUES (256, 0x0D00, 'OK : Reader Comms', 'OK : Reader Comms', 0)"]
[null,"Audit","IBIT_RESULT   ","Initiated Built in Test","OK : UI Alert Module",23,20,"0x0D00","0200",null,null,null,null,"IF EXISTS(SELECT TOP 1 * FROM [AuditEvent] WHERE [AuditEventId] = 0x0D00) UPDATE [AuditEvent] SET [Key] = 'Initiated Built in Test', [Value] = 'Initiated Built in Test', [IsAlert] = 0 WHERE [AuditEventId] = 0x0D00 ELSE INSERT INTO [AuditEvent] ([AuditEventId], [Key], [Value], [IsAlert]) VALUES (0x0D00, 'Initiated Built in Test', 'Initiated Built in Test', 0)","IF EXISTS(SELECT TOP 1 * FROM [AuditData] WHERE [AuditDataId] = 512 AND [AuditEventId] = 0x0D00) UPDATE [AuditData] SET [Key] = 'OK : UI Alert Module', [Value] = 'OK : UI Alert Module', [IsAlert] = 0 WHERE [AuditDataId] = 512 AND [AuditEventId] = 0x0D00 ELSE INSERT INTO [AuditData] ([AuditDataId], [AuditEventId], [Key], [Value], [IsAlert]) VALUES (512, 0x0D00, 'OK : UI Alert Module', 'OK : UI Alert Module', 0)"]
[null,"Audit","IBIT_RESULT   ","Initiated Built in Test","OK : DPS Module",23,15,"0x0D00","0300",null,null,null,null,"IF EXISTS(SELECT TOP 1 * FROM [AuditEvent] WHERE [AuditEventId] = 0x0D00) UPDATE [AuditEvent] SET [Key] = 'Initiated Built in Test', [Value] = 'Initiated Built in Test', [IsAlert] = 0 WHERE [AuditEventId] = 0x0D00 ELSE INSERT INTO [AuditEvent] ([AuditEventId], [Key], [Value], [IsAlert]) VALUES (0x0D00, 'Initiated Built in Test', 'Initiated Built in Test', 0)","IF EXISTS(SELECT TOP 1 * FROM [AuditData] WHERE [AuditDataId] = 768 AND [AuditEventId] = 0x0D00) UPDATE [AuditData] SET [Key] = 'OK : DPS Module', [Value] = 'OK : DPS Module', [IsAlert] = 0 WHERE [AuditDataId] = 768 AND [AuditEventId] = 0x0D00 ELSE INSERT INTO [AuditData] ([AuditDataId], [AuditEventId], [Key], [Value], [IsAlert]) VALUES (768, 0x0D00, 'OK : DPS Module', 'OK : DPS Module', 0)"]
[null,"Audit","IBIT_RESULT   ","Initiated Built in Test","OK : External Memory Check",23,26,"0x0D00","0400",null,null,null,null,"IF EXISTS(SELECT TOP 1 * FROM [AuditEvent] WHERE [AuditEventId] = 0x0D00) UPDATE [AuditEvent] SET [Key] = 'Initiated Built in Test', [Value] = 'Initiated Built in Test', [IsAlert] = 0 WHERE [AuditEventId] = 0x0D00 ELSE INSERT INTO [AuditEvent] ([AuditEventId], [Key], [Value], [IsAlert]) VALUES (0x0D00, 'Initiated Built in Test', 'Initiated Built in Test', 0)","IF EXISTS(SELECT TOP 1 * FROM [AuditData] WHERE [AuditDataId] = 1024 AND [AuditEventId] = 0x0D00) UPDATE [AuditData] SET [Key] = 'OK : External Memory Check', [Value] = 'OK : External Memory Check', [IsAlert] = 0 WHERE [AuditDataId] = 1024 AND [AuditEventId] = 0x0D00 ELSE INSERT INTO [AuditData] ([AuditDataId], [AuditEventId], [Key], [Value], [IsAlert]) VALUES (1024, 0x0D00, 'OK : External Memory Check', 'OK : External Memory Check', 0)"]
[null,"Audit","IBIT_RESULT   ","Initiated Built in Test","OK : Battery Health",23,19,"0x0D00","0600",null,null,null,null,"IF EXISTS(SELECT TOP 1 * FROM [AuditEvent] WHERE [AuditEventId] = 0x0D00) UPDATE [AuditEvent] SET [Key] = 'Initiated Built in Test', [Value] = 'Initiated Built in Test', [IsAlert] = 0 WHERE [AuditEventId] = 0x0D00 ELSE INSERT INTO [AuditEvent] ([AuditEventId], [Key], [Value], [IsAlert]) VALUES (0x0D00, 'Initiated Built in Test', 'Initiated Built in Test', 0)","IF EXISTS(SELECT TOP 1 * FROM [AuditData] WHERE [AuditDataId] = 1536 AND [AuditEventId] = 0x0D00) UPDATE [AuditData] SET [Key] = 'OK : Battery Health', [Value] = 'OK : Battery Health', [IsAlert] = 0 WHERE [AuditDataId] = 1536 AND [AuditEventId] = 0x0D00 ELSE INSERT INTO [AuditData] ([AuditDataId], [AuditEventId], [Key], [Value], [IsAlert]) VALUES (1536, 0x0D00, 'OK : Battery Health', 'OK : Battery Health', 0)"]
[null,"Audit","IBIT_RESULT   ","Initiated Built in Test","OK : Sleep Current Meas",23,23,"0x0D00","0700",null,null,null,null,"IF EXISTS(SELECT TOP 1 * FROM [AuditEvent] WHERE [AuditEventId] = 0x0D00) UPDATE [AuditEvent] SET [Key] = 'Initiated Built in Test', [Value] = 'Initiated Built in Test', [IsAlert] = 0 WHERE [AuditEventId] = 0x0D00 ELSE INSERT INTO [AuditEvent] ([AuditEventId], [Key], [Value], [IsAlert]) VALUES (0x0D00, 'Initiated Built in Test', 'Initiated Built in Test', 0)","IF EXISTS(SELECT TOP 1 * FROM [AuditData] WHERE [AuditDataId] = 1792 AND [AuditEventId] = 0x0D00) UPDATE [AuditData] SET [Key] = 'OK : Sleep Current Meas', [Value] = 'OK : Sleep Current Meas', [IsAlert] = 0 WHERE [AuditDataId] = 1792 AND [AuditEventId] = 0x0D00 ELSE INSERT INTO [AuditData] ([AuditDataId], [AuditEventId], [Key], [Value], [IsAlert]) VALUES (1792, 0x0D00, 'OK : Sleep Current Meas', 'OK : Sleep Current Meas', 0)"]
[null,"Audit","IBIT_RESULT   ","Initiated Built in Test","OK : Lock Configuration Check",23,29,"0x0D00","0800",null,null,null,null,"IF EXISTS(SELECT TOP 1 * FROM [AuditEvent] WHERE [AuditEventId] = 0x0D00) UPDATE [AuditEvent] SET [Key] = 'Initiated Built in Test', [Value] = 'Initiated Built in Test', [IsAlert] = 0 WHERE [AuditEventId] = 0x0D00 ELSE INSERT INTO [AuditEvent] ([AuditEventId], [Key], [Value], [IsAlert]) VALUES (0x0D00, 'Initiated Built in Test', 'Initiated Built in Test', 0)","IF EXISTS(SELECT TOP 1 * FROM [AuditData] WHERE [AuditDataId] = 2048 AND [AuditEventId] = 0x0D00) UPDATE [AuditData] SET [Key] = 'OK : Lock Configuration Check', [Value] = 'OK : Lock Configuration Check', [IsAlert] = 0 WHERE [AuditDataId] = 2048 AND [AuditEventId] = 0x0D00 ELSE INSERT INTO [AuditData] ([AuditDataId], [AuditEventId], [Key], [Value], [IsAlert]) VALUES (2048, 0x0D00, 'OK : Lock Configuration Check', 'OK : Lock Configuration Check', 0)"]
[null,"Audit","IBIT_RESULT   ","Initiated Built in Test","OK : Lock State Machine",23,23,"0x0D00","0900",null,null,null,null,"IF EXISTS(SELECT TOP 1 * FROM [AuditEvent] WHERE [AuditEventId] = 0x0D00) UPDATE [AuditEvent] SET [Key] = 'Initiated Built in Test', [Value] = 'Initiated Built in Test', [IsAlert] = 0 WHERE [AuditEventId] = 0x0D00 ELSE INSERT INTO [AuditEvent] ([AuditEventId], [Key], [Value], [IsAlert]) VALUES (0x0D00, 'Initiated Built in Test', 'Initiated Built in Test', 0)","IF EXISTS(SELECT TOP 1 * FROM [AuditData] WHERE [AuditDataId] = 2304 AND [AuditEventId] = 0x0D00) UPDATE [AuditData] SET [Key] = 'OK : Lock State Machine', [Value] = 'OK : Lock State Machine', [IsAlert] = 0 WHERE [AuditDataId] = 2304 AND [AuditEventId] = 0x0D00 ELSE INSERT INTO [AuditData] ([AuditDataId], [AuditEventId], [Key], [Value], [IsAlert]) VALUES (2304, 0x0D00, 'OK : Lock State Machine', 'OK : Lock State Machine', 0)"]
[null,"Audit","IBIT_RESULT   ","Initiated Built in Test","OK : Database Integrity",23,23,"0x0D00","0A00",null,null,null,null,"IF EXISTS(SELECT TOP 1 * FROM [AuditEvent] WHERE [AuditEventId] = 0x0D00) UPDATE [AuditEvent] SET [Key] = 'Initiated Built in Test', [Value] = 'Initiated Built in Test', [IsAlert] = 0 WHERE [AuditEventId] = 0x0D00 ELSE INSERT INTO [AuditEvent] ([AuditEventId], [Key], [Value], [IsAlert]) VALUES (0x0D00, 'Initiated Built in Test', 'Initiated Built in Test', 0)","IF EXISTS(SELECT TOP 1 * FROM [AuditData] WHERE [AuditDataId] = 2560 AND [AuditEventId] = 0x0D00) UPDATE [AuditData] SET [Key] = 'OK : Database Integrity', [Value] = 'OK : Database Integrity', [IsAlert] = 0 WHERE [AuditDataId] = 2560 AND [AuditEventId] = 0x0D00 ELSE INSERT INTO [AuditData] ([AuditDataId], [AuditEventId], [Key], [Value], [IsAlert]) VALUES (2560, 0x0D00, 'OK : Database Integrity', 'OK : Database Integrity', 0)"]
[null,"Audit","IBIT_RESULT   ","Initiated Built in Test","OK : Wi-Fi Module",23,17,"0x0D00","0B00",null,null,null,null,"IF EXISTS(SELECT TOP 1 * FROM [AuditEvent] WHERE [AuditEventId] = 0x0D00) UPDATE [AuditEvent] SET [Key] = 'Initiated Built in Test', [Value] = 'Initiated Built in Test', [IsAlert] = 0 WHERE [AuditEventId] = 0x0D00 ELSE INSERT INTO [AuditEvent] ([AuditEventId], [Key], [Value], [IsAlert]) VALUES (0x0D00, 'Initiated Built in Test', 'Initiated Built in Test', 0)","IF EXISTS(SELECT TOP 1 * FROM [AuditData] WHERE [AuditDataId] = 2816 AND [AuditEventId] = 0x0D00) UPDATE [AuditData] SET [Key] = 'OK : Wi-Fi Module', [Value] = 'OK : Wi-Fi Module', [IsAlert] = 0 WHERE [AuditDataId] = 2816 AND [AuditEventId] = 0x0D00 ELSE INSERT INTO [AuditData] ([AuditDataId], [AuditEventId], [Key], [Value], [IsAlert]) VALUES (2816, 0x0D00, 'OK : Wi-Fi Module', 'OK : Wi-Fi Module', 0)"]
[null,"Audit","IBIT_RESULT   ","Initiated Built in Test","OK : IBIT All Test Passed",23,25,"0x0D00","0C00",null,null,null,null,"IF EXISTS(SELECT TOP 1 * FROM [AuditEvent] WHERE [AuditEventId] = 0x0D00) UPDATE [AuditEvent] SET [Key] = 'Initiated Built in Test', [Value] = 'Initiated Built in Test', [IsAlert] = 0 WHERE [AuditEventId] = 0x0D00 ELSE INSERT INTO [AuditEvent] ([AuditEventId], [Key], [Value], [IsAlert]) VALUES (0x0D00, 'Initiated Built in Test', 'Initiated Built in Test', 0)","IF EXISTS(SELECT TOP 1 * FROM [AuditData] WHERE [AuditDataId] = 3072 AND [AuditEventId] = 0x0D00) UPDATE [AuditData] SET [Key] = 'OK : IBIT All Test Passed', [Value] = 'OK : IBIT All Test Passed', [IsAlert] = 0 WHERE [AuditDataId] = 3072 AND [AuditEventId] = 0x0D00 ELSE INSERT INTO [AuditData] ([AuditDataId], [AuditEventId], [Key], [Value], [IsAlert]) VALUES (3072, 0x0D00, 'OK : IBIT All Test Passed', 'OK : IBIT All Test Passed', 0)"]
[null,"Audit","IBIT_RESULT   ","Initiated Built in Test","OK : Peripheral HW Test Passed",{"$f":"LEN(D461)","v":23},{"$f":"LEN(E461)","v":30},"0x0D00","0D00",null,null,null,null,"IF EXISTS(SELECT TOP 1 * FROM [AuditEvent] WHERE [AuditEventId] = 0x0D00) UPDATE [AuditEvent] SET [Key] = 'Initiated Built in Test', [Value] = 'Initiated Built in Test', [IsAlert] = 0 WHERE [AuditEventId] = 0x0D00 ELSE INSERT INTO [AuditEvent] ([AuditEventId], [Key], [Value], [IsAlert]) VALUES (0x0D00, 'Initiated Built in Test', 'Initiated Built in Test', 0)","IF EXISTS(SELECT TOP 1 * FROM [AuditData] WHERE [AuditDataId] = 3328 AND [AuditEventId] = 0x0D00) UPDATE [AuditData] SET [Key] = 'OK : Peripheral HW Test Passed', [Value] = 'OK : Peripheral HW Test Passed', [IsAlert] = 0 WHERE [AuditDataId] = 3328 AND [AuditEventId] = 0x0D00 ELSE INSERT INTO [AuditData] ([AuditDataId], [AuditEventId], [Key], [Value], [IsAlert]) VALUES (3328, 0x0D00, 'OK : Peripheral HW Test Passed', 'OK : Peripheral HW Test Passed', 0)"]
[null,"Audit","IBIT_RESULT   ","Initiated Built in Test","OK : Ethernet Comms",null,null,"0x0D00","0E00",null,null,null,null,"IF EXISTS(SELECT TOP 1 * FROM [AuditEvent] WHERE [AuditEventId] = 0x0D00) UPDATE [AuditEvent] SET [Key] = 'Initiated Built in Test', [Value] = 'Initiated Built in Test', [IsAlert] = 0 WHERE [AuditEventId] = 0x0D00 ELSE INSERT INTO [AuditEvent] ([AuditEventId], [Key], [Value], [IsAlert]) VALUES (0x0D00, 'Initiated Built in Test', 'Initiated Built in Test', 0)","IF EXISTS(SELECT TOP 1 * FROM [AuditData] WHERE [AuditDataId] = 3584 AND [AuditEventId] = 0x0D00) UPDATE [AuditData] SET [Key] = 'OK : Ethernet Comms', [Value] = 'OK : Ethernet Comms', [IsAlert] = 0 WHERE [AuditDataId] = 3584 AND [AuditEventId] = 0x0D00 ELSE INSERT INTO [AuditData] ([AuditDataId], [AuditEventId], [Key], [Value], [IsAlert]) VALUES (3584, 0x0D00, 'OK : Ethernet Comms', 'OK : Ethernet Comms', 0)"]
[null,"Audit","IBIT_RESULT   ","Initiated Built in Test","FAIL : BLE Module",23,17,"0x0D00",1,null,null,null,null,"IF EXISTS(SELECT TOP 1 * FROM [AuditEvent] WHERE [AuditEventId] = 0x0D00) UPDATE [AuditEvent] SET [Key] = 'Initiated Built in Test', [Value] = 'Initiated Built in Test', [IsAlert] = 0 WHERE [AuditEventId] = 0x0D00 ELSE INSERT INTO [AuditEvent] ([AuditEventId], [Key], [Value], [IsAlert]) VALUES (0x0D00, 'Initiated Built in Test', 'Initiated Built in Test', 0)","IF EXISTS(SELECT TOP 1 * FROM [AuditData] WHERE [AuditDataId] = 1 AND [AuditEventId] = 0x0D00) UPDATE [AuditData] SET [Key] = 'FAIL : BLE Module', [Value] = 'FAIL : BLE Module', [IsAlert] = 0 WHERE [AuditDataId] = 1 AND [AuditEventId] = 0x0D00 ELSE INSERT INTO [AuditData] ([AuditDataId], [AuditEventId], [Key], [Value], [IsAlert]) VALUES (1, 0x0D00, 'FAIL : BLE Module', 'FAIL : BLE Module', 0)"]
[null,"Audit","IBIT_RESULT   ","Initiated Built in Test","FAIL : Reader Comms",23,19,"0x0D00","01FF",null,null,null,null,"IF EXISTS(SELECT TOP 1 * FROM [AuditEvent] WHERE [AuditEventId] = 0x0D00) UPDATE [AuditEvent] SET [Key] = 'Initiated Built in Test', [Value] = 'Initiated Built in Test', [IsAlert] = 0 WHERE [AuditEventId] = 0x0D00 ELSE INSERT INTO [AuditEvent] ([AuditEventId], [Key], [Value], [IsAlert]) VALUES (0x0D00, 'Initiated Built in Test', 'Initiated Built in Test', 0)","IF EXISTS(SELECT TOP 1 * FROM [AuditData] WHERE [AuditDataId] = 511 AND [AuditEventId] = 0x0D00) UPDATE [AuditData] SET [Key] = 'FAIL : Reader Comms', [Value] = 'FAIL : Reader Comms', [IsAlert] = 0 WHERE [AuditDataId] = 511 AND [AuditEventId] = 0x0D00 ELSE INSERT INTO [AuditData] ([AuditDataId], [AuditEventId], [Key], [Value], [IsAlert]) VALUES (511, 0x0D00, 'FAIL : Reader Comms', 'FAIL : Reader Comms', 0)"]
[null,"Audit","IBIT_RESULT   ","Initiated Built in Test","FAIL : UI Alert Module",23,22,"0x0D00","02FF",null,null,null,null,"IF EXISTS(SELECT TOP 1 * FROM [AuditEvent] WHERE [AuditEventId] = 0x0D00) UPDATE [AuditEvent] SET [Key] = 'Initiated Built in Test', [Value] = 'Initiated Built in Test', [IsAlert] = 0 WHERE [AuditEventId] = 0x0D00 ELSE INSERT INTO [AuditEvent] ([AuditEventId], [Key], [Value], [IsAlert]) VALUES (0x0D00, 'Initiated Built in Test', 'Initiated Built in Test', 0)","IF EXISTS(SELECT TOP 1 * FROM [AuditData] WHERE [AuditDataId] = 767 AND [AuditEventId] = 0x0D00) UPDATE [AuditData] SET [Key] = 'FAIL : UI Alert Module', [Value] = 'FAIL : UI Alert Module', [IsAlert] = 0 WHERE [AuditDataId] = 767 AND [AuditEventId] = 0x0D00 ELSE INSERT INTO [AuditData] ([AuditDataId], [AuditEventId], [Key], [Value], [IsAlert]) VALUES (767, 0x0D00, 'FAIL : UI Alert Module', 'FAIL : UI Alert Module', 0)"]
[null,"Audit","IBIT_RESULT   ","Initiated Built in Test","FAIL : DPS Module",23,17,"0x0D00","03FF",null,null,null,null,"IF EXISTS(SELECT TOP 1 * FROM [AuditEvent] WHERE [AuditEventId] = 0x0D00) UPDATE [AuditEvent] SET [Key] = 'Initiated Built in Test', [Value] = 'Initiated Built in Test', [IsAlert] = 0 WHERE [AuditEventId] = 0x0D00 ELSE INSERT INTO [AuditEvent] ([AuditEventId], [Key], [Value], [IsAlert]) VALUES (0x0D00, 'Initiated Built in Test', 'Initiated Built in Test', 0)","IF EXISTS(SELECT TOP 1 * FROM [AuditData] WHERE [AuditDataId] = 1023 AND [AuditEventId] = 0x0D00) UPDATE [AuditData] SET [Key] = 'FAIL : DPS Module', [Value] = 'FAIL : DPS Module', [IsAlert] = 0 WHERE [AuditDataId] = 1023 AND [AuditEventId] = 0x0D00 ELSE INSERT INTO [AuditData] ([AuditDataId], [AuditEventId], [Key], [Value], [IsAlert]) VALUES (1023, 0x0D00, 'FAIL : DPS Module', 'FAIL : DPS Module', 0)"]
[null,"Audit","IBIT_RESULT   ","Initiated Built in Test","FAIL : External Memory Check",23,28,"0x0D00","04FF",null,null,null,null,"IF EXISTS(SELECT TOP 1 * FROM [AuditEvent] WHERE [AuditEventId] = 0x0D00) UPDATE [AuditEvent] SET [Key] = 'Initiated Built in Test', [Value] = 'Initiated Built in Test', [IsAlert] = 0 WHERE [AuditEventId] = 0x0D00 ELSE INSERT INTO [AuditEvent] ([AuditEventId], [Key], [Value], [IsAlert]) VALUES (0x0D00, 'Initiated Built in Test', 'Initiated Built in Test', 0)","IF EXISTS(SELECT TOP 1 * FROM [AuditData] WHERE [AuditDataId] = 1279 AND [AuditEventId] = 0x0D00) UPDATE [AuditData] SET [Key] = 'FAIL : External Memory Check', [Value] = 'FAIL : External Memory Check', [IsAlert] = 0 WHERE [AuditDataId] = 1279 AND [AuditEventId] = 0x0D00 ELSE INSERT INTO [AuditData] ([AuditDataId], [AuditEventId], [Key], [Value], [IsAlert]) VALUES (1279, 0x0D00, 'FAIL : External Memory Check', 'FAIL : External Memory Check', 0)"]
[null,"Audit","IBIT_RESULT   ","Initiated Built in Test","FAIL : Battery Health",23,21,"0x0D00","06FF",null,null,null,null,"IF EXISTS(SELECT TOP 1 * FROM [AuditEvent] WHERE [AuditEventId] = 0x0D00) UPDATE [AuditEvent] SET [Key] = 'Initiated Built in Test', [Value] = 'Initiated Built in Test', [IsAlert] = 0 WHERE [AuditEventId] = 0x0D00 ELSE INSERT INTO [AuditEvent] ([AuditEventId], [Key], [Value], [IsAlert]) VALUES (0x0D00, 'Initiated Built in Test', 'Initiated Built in Test', 0)","IF EXISTS(SELECT TOP 1 * FROM [AuditData] WHERE [AuditDataId] = 1791 AND [AuditEventId] = 0x0D00) UPDATE [AuditData] SET [Key] = 'FAIL : Battery Health', [Value] = 'FAIL : Battery Health', [IsAlert] = 0 WHERE [AuditDataId] = 1791 AND [AuditEventId] = 0x0D00 ELSE INSERT INTO [AuditData] ([AuditDataId], [AuditEventId], [Key], [Value], [IsAlert]) VALUES (1791, 0x0D00, 'FAIL : Battery Health', 'FAIL : Battery Health', 0)"]
[null,"Audit","IBIT_RESULT   ","Initiated Built in Test","FAIL : Sleep Current Unknown",null,null,"0x0D00","07FF",null,null,null,null,"IF EXISTS(SELECT TOP 1 * FROM [AuditEvent] WHERE [AuditEventId] = 0x0D00) UPDATE [AuditEvent] SET [Key] = 'Initiated Built in Test', [Value] = 'Initiated Built in Test', [IsAlert] = 0 WHERE [AuditEventId] = 0x0D00 ELSE INSERT INTO [AuditEvent] ([AuditEventId], [Key], [Value], [IsAlert]) VALUES (0x0D00, 'Initiated Built in Test', 'Initiated Built in Test', 0)","IF EXISTS(SELECT TOP 1 * FROM [AuditData] WHERE [AuditDataId] = 2047 AND [AuditEventId] = 0x0D00) UPDATE [AuditData] SET [Key] = 'FAIL : Sleep Current Unknown', [Value] = 'FAIL : Sleep Current Unknown', [IsAlert] = 0 WHERE [AuditDataId] = 2047 AND [AuditEventId] = 0x0D00 ELSE INSERT INTO [AuditData] ([AuditDataId], [AuditEventId], [Key], [Value], [IsAlert]) VALUES (2047, 0x0D00, 'FAIL : Sleep Current Unknown', 'FAIL : Sleep Current Unknown', 0)"]
[null,"Audit","IBIT_RESULT   ","Initiated Built in Test","FAIL : Sleep Current Meas (High)",{"$f":"LEN(D470)","v":23},32,"0x0D00","0701",null,null,null,null,"IF EXISTS(SELECT TOP 1 * FROM [AuditEvent] WHERE [AuditEventId] = 0x0D00) UPDATE [AuditEvent] SET [Key] = 'Initiated Built in Test', [Value] = 'Initiated Built in Test', [IsAlert] = 0 WHERE [AuditEventId] = 0x0D00 ELSE INSERT INTO [AuditEvent] ([AuditEventId], [Key], [Value], [IsAlert]) VALUES (0x0D00, 'Initiated Built in Test', 'Initiated Built in Test', 0)","IF EXISTS(SELECT TOP 1 * FROM [AuditData] WHERE [AuditDataId] = 1793 AND [AuditEventId] = 0x0D00) UPDATE [AuditData] SET [Key] = 'FAIL : Sleep Current Meas (High)', [Value] = 'FAIL : Sleep Current Meas (High)', [IsAlert] = 0 WHERE [AuditDataId] = 1793 AND [AuditEventId] = 0x0D00 ELSE INSERT INTO [AuditData] ([AuditDataId], [AuditEventId], [Key], [Value], [IsAlert]) VALUES (1793, 0x0D00, 'FAIL : Sleep Current Meas (High)', 'FAIL : Sleep Current Meas (High)', 0)"]
[null,"Audit","IBIT_RESULT   ","Initiated Built in Test","FAIL : Sleep Current Meas (Low)",23,31,"0x0D00","0702",null,null,null,null,"IF EXISTS(SELECT TOP 1 * FROM [AuditEvent] WHERE [AuditEventId] = 0x0D00) UPDATE [AuditEvent] SET [Key] = 'Initiated Built in Test', [Value] = 'Initiated Built in Test', [IsAlert] = 0 WHERE [AuditEventId] = 0x0D00 ELSE INSERT INTO [AuditEvent] ([AuditEventId], [Key], [Value], [IsAlert]) VALUES (0x0D00, 'Initiated Built in Test', 'Initiated Built in Test', 0)","IF EXISTS(SELECT TOP 1 * FROM [AuditData] WHERE [AuditDataId] = 1794 AND [AuditEventId] = 0x0D00) UPDATE [AuditData] SET [Key] = 'FAIL : Sleep Current Meas (Low)', [Value] = 'FAIL : Sleep Current Meas (Low)', [IsAlert] = 0 WHERE [AuditDataId] = 1794 AND [AuditEventId] = 0x0D00 ELSE INSERT INTO [AuditData] ([AuditDataId], [AuditEventId], [Key], [Value], [IsAlert]) VALUES (1794, 0x0D00, 'FAIL : Sleep Current Meas (Low)', 'FAIL : Sleep Current Meas (Low)', 0)"]
[null,"Audit","IBIT_RESULT   ","Initiated Built in Test","FAIL : Lock Configuration Check",23,31,"0x0D00","08FF",null,null,null,null,"IF EXISTS(SELECT TOP 1 * FROM [AuditEvent] WHERE [AuditEventId] = 0x0D00) UPDATE [AuditEvent] SET [Key] = 'Initiated Built in Test', [Value] = 'Initiated Built in Test', [IsAlert] = 0 WHERE [AuditEventId] = 0x0D00 ELSE INSERT INTO [AuditEvent] ([AuditEventId], [Key], [Value], [IsAlert]) VALUES (0x0D00, 'Initiated Built in Test', 'Initiated Built in Test', 0)","IF EXISTS(SELECT TOP 1 * FROM [AuditData] WHERE [AuditDataId] = 2303 AND [AuditEventId] = 0x0D00) UPDATE [AuditData] SET [Key] = 'FAIL : Lock Configuration Check', [Value] = 'FAIL : Lock Configuration Check', [IsAlert] = 0 WHERE [AuditDataId] = 2303 AND [AuditEventId] = 0x0D00 ELSE INSERT INTO [AuditData] ([AuditDataId], [AuditEventId], [Key], [Value], [IsAlert]) VALUES (2303, 0x0D00, 'FAIL : Lock Configuration Check', 'FAIL : Lock Configuration Check', 0)"]
[null,"Audit","IBIT_RESULT   ","Initiated Built in Test","FAIL : Lock State Machine",23,25,"0x0D00","09FF",null,null,null,null,"IF EXISTS(SELECT TOP 1 * FROM [AuditEvent] WHERE [AuditEventId] = 0x0D00) UPDATE [AuditEvent] SET [Key] = 'Initiated Built in Test', [Value] = 'Initiated Built in Test', [IsAlert] = 0 WHERE [AuditEventId] = 0x0D00 ELSE INSERT INTO [AuditEvent] ([AuditEventId], [Key], [Value], [IsAlert]) VALUES (0x0D00, 'Initiated Built in Test', 'Initiated Built in Test', 0)","IF EXISTS(SELECT TOP 1 * FROM [AuditData] WHERE [AuditDataId] = 2559 AND [AuditEventId] = 0x0D00) UPDATE [AuditData] SET [Key] = 'FAIL : Lock State Machine', [Value] = 'FAIL : Lock State Machine', [IsAlert] = 0 WHERE [AuditDataId] = 2559 AND [AuditEventId] = 0x0D00 ELSE INSERT INTO [AuditData] ([AuditDataId], [AuditEventId], [Key], [Value], [IsAlert]) VALUES (2559, 0x0D00, 'FAIL : Lock State Machine', 'FAIL : Lock State Machine', 0)"]
[null,"Audit","IBIT_RESULT   ","Initiated Built in Test","FAIL : Database Integrity",23,25,"0x0D00","0AFF",null,null,null,null,"IF EXISTS(SELECT TOP 1 * FROM [AuditEvent] WHERE [AuditEventId] = 0x0D00) UPDATE [AuditEvent] SET [Key] = 'Initiated Built in Test', [Value] = 'Initiated Built in Test', [IsAlert] = 0 WHERE [AuditEventId] = 0x0D00 ELSE INSERT INTO [AuditEvent] ([AuditEventId], [Key], [Value], [IsAlert]) VALUES (0x0D00, 'Initiated Built in Test', 'Initiated Built in Test', 0)","IF EXISTS(SELECT TOP 1 * FROM [AuditData] WHERE [AuditDataId] = 2815 AND [AuditEventId] = 0x0D00) UPDATE [AuditData] SET [Key] = 'FAIL : Database Integrity', [Value] = 'FAIL : Database Integrity', [IsAlert] = 0 WHERE [AuditDataId] = 2815 AND [AuditEventId] = 0x0D00 ELSE INSERT INTO [AuditData] ([AuditDataId], [AuditEventId], [Key], [Value], [IsAlert]) VALUES (2815, 0x0D00, 'FAIL : Database Integrity', 'FAIL : Database Integrity', 0)"]
[null,"Audit","IBIT_RESULT   ","Initiated Built in Test","FAIL : Wi-Fi Module",23,19,"0x0D00","0BFF",null,null,null,null,"IF EXISTS(SELECT TOP 1 * FROM [AuditEvent] WHERE [AuditEventId] = 0x0D00) UPDATE [AuditEvent] SET [Key] = 'Initiated Built in Test', [Value] = 'Initiated Built in Test', [IsAlert] = 0 WHERE [AuditEventId] = 0x0D00 ELSE INSERT INTO [AuditEvent] ([AuditEventId], [Key], [Value], [IsAlert]) VALUES (0x0D00, 'Initiated Built in Test', 'Initiated Built in Test', 0)","IF EXISTS(SELECT TOP 1 * FROM [AuditData] WHERE [AuditDataId] = 3071 AND [AuditEventId] = 0x0D00) UPDATE [AuditData] SET [Key] = 'FAIL : Wi-Fi Module', [Value] = 'FAIL : Wi-Fi Module', [IsAlert] = 0 WHERE [AuditDataId] = 3071 AND [AuditEventId] = 0x0D00 ELSE INSERT INTO [AuditData] ([AuditDataId], [AuditEventId], [Key], [Value], [IsAlert]) VALUES (3071, 0x0D00, 'FAIL : Wi-Fi Module', 'FAIL : Wi-Fi Module', 0)"]
[null,"Audit","IBIT_RESULT   ","Initiated Built in Test","FAIL : Wi-Fi Power-On ",null,null,"0x0D00","0B04",null,null,null,null,"IF EXISTS(SELECT TOP 1 * FROM [AuditEvent] WHERE [AuditEventId] = 0x0D00) UPDATE [AuditEvent] SET [Key] = 'Initiated Built in Test', [Value] = 'Initiated Built in Test', [IsAlert] = 0 WHERE [AuditEventId] = 0x0D00 ELSE INSERT INTO [AuditEvent] ([AuditEventId], [Key], [Value], [IsAlert]) VALUES (0x0D00, 'Initiated Built in Test', 'Initiated Built in Test', 0)","IF EXISTS(SELECT TOP 1 * FROM [AuditData] WHERE [AuditDataId] = 2820 AND [AuditEventId] = 0x0D00) UPDATE [AuditData] SET [Key] = 'FAIL : Wi-Fi Power-On ', [Value] = 'FAIL : Wi-Fi Power-On ', [IsAlert] = 0 WHERE [AuditDataId] = 2820 AND [AuditEventId] = 0x0D00 ELSE INSERT INTO [AuditData] ([AuditDataId], [AuditEventId], [Key], [Value], [IsAlert]) VALUES (2820, 0x0D00, 'FAIL : Wi-Fi Power-On ', 'FAIL : Wi-Fi Power-On ', 0)"]
[null,"Audit","IBIT_RESULT   ","Initiated Built in Test","FAIL : Wi-Fi Configuration ",null,null,"0x0D00","0B06",null,null,null,null,"IF EXISTS(SELECT TOP 1 * FROM [AuditEvent] WHERE [AuditEventId] = 0x0D00) UPDATE [AuditEvent] SET [Key] = 'Initiated Built in Test', [Value] = 'Initiated Built in Test', [IsAlert] = 0 WHERE [AuditEventId] = 0x0D00 ELSE INSERT INTO [AuditEvent] ([AuditEventId], [Key], [Value], [IsAlert]) VALUES (0x0D00, 'Initiated Built in Test', 'Initiated Built in Test', 0)","IF EXISTS(SELECT TOP 1 * FROM [AuditData] WHERE [AuditDataId] = 2822 AND [AuditEventId] = 0x0D00) UPDATE [AuditData] SET [Key] = 'FAIL : Wi-Fi Configuration ', [Value] = 'FAIL : Wi-Fi Configuration ', [IsAlert] = 0 WHERE [AuditDataId] = 2822 AND [AuditEventId] = 0x0D00 ELSE INSERT INTO [AuditData] ([AuditDataId], [AuditEventId], [Key], [Value], [IsAlert]) VALUES (2822, 0x0D00, 'FAIL : Wi-Fi Configuration ', 'FAIL : Wi-Fi Configuration ', 0)"]
[null,"Audit","IBIT_RESULT   ","Initiated Built in Test","FAIL : Wi-Fi Association",null,null,"0x0D00","0B07",null,null,null,null,"IF EXISTS(SELECT TOP 1 * FROM [AuditEvent] WHERE [AuditEventId] = 0x0D00) UPDATE [AuditEvent] SET [Key] = 'Initiated Built in Test', [Value] = 'Initiated Built in Test', [IsAlert] = 0 WHERE [AuditEventId] = 0x0D00 ELSE INSERT INTO [AuditEvent] ([AuditEventId], [Key], [Value], [IsAlert]) VALUES (0x0D00, 'Initiated Built in Test', 'Initiated Built in Test', 0)","IF EXISTS(SELECT TOP 1 * FROM [AuditData] WHERE [AuditDataId] = 2823 AND [AuditEventId] = 0x0D00) UPDATE [AuditData] SET [Key] = 'FAIL : Wi-Fi Association', [Value] = 'FAIL : Wi-Fi Association', [IsAlert] = 0 WHERE [AuditDataId] = 2823 AND [AuditEventId] = 0x0D00 ELSE INSERT INTO [AuditData] ([AuditDataId], [AuditEventId], [Key], [Value], [IsAlert]) VALUES (2823, 0x0D00, 'FAIL : Wi-Fi Association', 'FAIL : Wi-Fi Association', 0)"]
[null,"Audit","IBIT_RESULT   ","Initiated Built in Test","FAIL : Wi-Fi Host Connect Attempt ",null,null,"0x0D00","0B0A",null,null,null,null,"IF EXISTS(SELECT TOP 1 * FROM [AuditEvent] WHERE [AuditEventId] = 0x0D00) UPDATE [AuditEvent] SET [Key] = 'Initiated Built in Test', [Value] = 'Initiated Built in Test', [IsAlert] = 0 WHERE [AuditEventId] = 0x0D00 ELSE INSERT INTO [AuditEvent] ([AuditEventId], [Key], [Value], [IsAlert]) VALUES (0x0D00, 'Initiated Built in Test', 'Initiated Built in Test', 0)","IF EXISTS(SELECT TOP 1 * FROM [AuditData] WHERE [AuditDataId] = 2826 AND [AuditEventId] = 0x0D00) UPDATE [AuditData] SET [Key] = 'FAIL : Wi-Fi Host Connect Attempt ', [Value] = 'FAIL : Wi-Fi Host Connect Attempt ', [IsAlert] = 0 WHERE [AuditDataId] = 2826 AND [AuditEventId] = 0x0D00 ELSE INSERT INTO [AuditData] ([AuditDataId], [AuditEventId], [Key], [Value], [IsAlert]) VALUES (2826, 0x0D00, 'FAIL : Wi-Fi Host Connect Attempt ', 'FAIL : Wi-Fi Host Connect Attempt ', 0)"]
[null,"Audit","IBIT_RESULT   ","Initiated Built in Test","FAIL : Wi-Fi Configuration Not Set",null,null,"0x0D00","0B0C",null,null,null,null,"IF EXISTS(SELECT TOP 1 * FROM [AuditEvent] WHERE [AuditEventId] = 0x0D00) UPDATE [AuditEvent] SET [Key] = 'Initiated Built in Test', [Value] = 'Initiated Built in Test', [IsAlert] = 0 WHERE [AuditEventId] = 0x0D00 ELSE INSERT INTO [AuditEvent] ([AuditEventId], [Key], [Value], [IsAlert]) VALUES (0x0D00, 'Initiated Built in Test', 'Initiated Built in Test', 0)","IF EXISTS(SELECT TOP 1 * FROM [AuditData] WHERE [AuditDataId] = 2828 AND [AuditEventId] = 0x0D00) UPDATE [AuditData] SET [Key] = 'FAIL : Wi-Fi Configuration Not Set', [Value] = 'FAIL : Wi-Fi Configuration Not Set', [IsAlert] = 0 WHERE [AuditDataId] = 2828 AND [AuditEventId] = 0x0D00 ELSE INSERT INTO [AuditData] ([AuditDataId], [AuditEventId], [Key], [Value], [IsAlert]) VALUES (2828, 0x0D00, 'FAIL : Wi-Fi Configuration Not Set', 'FAIL : Wi-Fi Configuration Not Set', 0)"]
[null,"Audit","IBIT_RESULT   ","Initiated Built in Test","FAIL : Wi-Fi Configuration Client Mode",null,null,"0x0D00","0B2D",null,null,null,null,"IF EXISTS(SELECT TOP 1 * FROM [AuditEvent] WHERE [AuditEventId] = 0x0D00) UPDATE [AuditEvent] SET [Key] = 'Initiated Built in Test', [Value] = 'Initiated Built in Test', [IsAlert] = 0 WHERE [AuditEventId] = 0x0D00 ELSE INSERT INTO [AuditEvent] ([AuditEventId], [Key], [Value], [IsAlert]) VALUES (0x0D00, 'Initiated Built in Test', 'Initiated Built in Test', 0)",{"$f":"IF(AND(LEFT(H481,2)=\"0x\",ISNUMBER(HEX2DEC(TRIM(I481))*1)),CONCATENATE(\"IF EXISTS(SELECT TOP 1 * FROM [AuditData] WHERE [AuditDataId] = \",HEX2DEC(I481),\" AND [AuditEventId] = \",H481,\") UPDATE [AuditData] SET [Key] = '\",E481,\"', [Value] = '\",E481,\"', [IsAlert] = 0 WHERE [AuditDataId] = \",HEX2DEC(I481),\" AND [AuditEventId] = \",H481,\" ELSE INSERT INTO [AuditData] ([AuditDataId], [AuditEventId], [Key], [Value], [IsAlert]) VALUES (\",HEX2DEC(I481),\", \",H481,\", '\",E481,\"', '\",E481,\"', 0)\"),\"-- no value\")","v":"IF EXISTS(SELECT TOP 1 * FROM [AuditData] WHERE [AuditDataId] = 2861 AND [AuditEventId] = 0x0D00) UPDATE [AuditData] SET [Key] = 'FAIL : Wi-Fi Configuration Client Mode', [Value] = 'FAIL : Wi-Fi Configuration Client Mode', [IsAlert] = 0 WHERE [AuditDataId] = 2861 AND [AuditEventId] = 0x0D00 ELSE INSERT INTO [AuditData] ([AuditDataId], [AuditEventId], [Key], [Value], [IsAlert]) VALUES (2861, 0x0D00, 'FAIL : Wi-Fi Configuration Client Mode', 'FAIL : Wi-Fi Configuration Client Mode', 0)"}]
[null,"Audit","IBIT_RESULT   ","Initiated Built in Test","FAIL:  Wi-Fi Configuration",null,null,"0x0D00","060C",null,null,null,null,"IF EXISTS(SELECT TOP 1 * FROM [AuditEvent] WHERE [AuditEventId] = 0x0D00) UPDATE [AuditEvent] SET [Key] = 'Initiated Built in Test', [Value] = 'Initiated Built in Test', [IsAlert] = 0 WHERE [AuditEventId] = 0x0D00 ELSE INSERT INTO [AuditEvent] ([AuditEventId], [Key], [Value], [IsAlert]) VALUES (0x0D00, 'Initiated Built in Test', 'Initiated Built in Test', 0)","IF EXISTS(SELECT TOP 1 * FROM [AuditData] WHERE [AuditDataId] = 1548 AND [AuditEventId] = 0x0D00) UPDATE [AuditData] SET [Key] = 'FAIL:  Wi-Fi Configuration', [Value] = 'FAIL:  Wi-Fi Configuration', [IsAlert] = 0 WHERE [AuditDataId] = 1548 AND [AuditEventId] = 0x0D00 ELSE INSERT INTO [AuditData] ([AuditDataId], [AuditEventId], [Key], [Value], [IsAlert]) VALUES (1548, 0x0D00, 'FAIL:  Wi-Fi Configuration', 'FAIL:  Wi-Fi Configuration', 0)"]
[null,"Audit","IBIT_RESULT   ","Initiated Built in Test","FAIL : IBIT Test Results Failed",{"$f":"LEN(D483)","v":23},{"$f":"LEN(E483)","v":31},"0x0D00","0CFF",null,null,null,null,"IF EXISTS(SELECT TOP 1 * FROM [AuditEvent] WHERE [AuditEventId] = 0x0D00) UPDATE [AuditEvent] SET [Key] = 'Initiated Built in Test', [Value] = 'Initiated Built in Test', [IsAlert] = 0 WHERE [AuditEventId] = 0x0D00 ELSE INSERT INTO [AuditEvent] ([AuditEventId], [Key], [Value], [IsAlert]) VALUES (0x0D00, 'Initiated Built in Test', 'Initiated Built in Test', 0)","IF EXISTS(SELECT TOP 1 * FROM [AuditData] WHERE [AuditDataId] = 3327 AND [AuditEventId] = 0x0D00) UPDATE [AuditData] SET [Key] = 'FAIL : IBIT Test Results Failed', [Value] = 'FAIL : IBIT Test Results Failed', [IsAlert] = 0 WHERE [AuditDataId] = 3327 AND [AuditEventId] = 0x0D00 ELSE INSERT INTO [AuditData] ([AuditDataId], [AuditEventId], [Key], [Value], [IsAlert]) VALUES (3327, 0x0D00, 'FAIL : IBIT Test Results Failed', 'FAIL : IBIT Test Results Failed', 0)"]
[null,"Audit","IBIT_RESULT   ","Initiated Built in Test","FAIL : Peripheral HW Failed",{"$f":"LEN(D484)","v":23},{"$f":"LEN(E484)","v":27},"0x0D00","0DFF",null,null,null,null,{"$f":"IF(LEFT(H484,2)=\"0x\",CONCATENATE(\"IF EXISTS(SELECT TOP 1 * FROM [AuditEvent] WHERE [AuditEventId] = \",H484,\") UPDATE [AuditEvent] SET [Key] = '\",TRIM(D484),\"', [Value] = '\",TRIM(D484),\"', [IsAlert] = \",IF(B484=\"Audit\",0,1),\" WHERE [AuditEventId] = \",H484,\" ELSE INSERT INTO [AuditEvent] ([AuditEventId], [Key], [Value], [IsAlert]) VALUES (\",H484,\", '\",TRIM(D484),\"', '\",TRIM(D484),\"', \",IF(B484=\"Audit\",0,1), \")\"),\"-- no value\")","v":"IF EXISTS(SELECT TOP 1 * FROM [AuditEvent] WHERE [AuditEventId] = 0x0D00) UPDATE [AuditEvent] SET [Key] = 'Initiated Built in Test', [Value] = 'Initiated Built in Test', [IsAlert] = 0 WHERE [AuditEventId] = 0x0D00 ELSE INSERT INTO [AuditEvent] ([AuditEventId], [Key], [Value], [IsAlert]) VALUES (0x0D00, 'Initiated Built in Test', 'Initiated Built in Test', 0)"},"IF EXISTS(SELECT TOP 1 * FROM [AuditData] WHERE [AuditDataId] = 3583 AND [AuditEventId] = 0x0D00) UPDATE [AuditData] SET [Key] = 'FAIL : Peripheral HW Failed', [Value] = 'FAIL : Peripheral HW Failed', [IsAlert] = 0 WHERE [AuditDataId] = 3583 AND [AuditEventId] = 0x0D00 ELSE INSERT INTO [AuditData] ([AuditDataId], [AuditEventId], [Key], [Value], [IsAlert]) VALUES (3583, 0x0D00, 'FAIL : Peripheral HW Failed', 'FAIL : Peripheral HW Failed', 0)"]
[null,"Audit","IBIT_RESULT   ","Initiated Built in Test","FAIL : Ethernet Comms",null,null,"0x0D00","0EFF",null,null,null,null,"IF EXISTS(SELECT TOP 1 * FROM [AuditEvent] WHERE [AuditEventId] = 0x0D00) UPDATE [AuditEvent] SET [Key] = 'Initiated Built in Test', [Value] = 'Initiated Built in Test', [IsAlert] = 0 WHERE [AuditEventId] = 0x0D00 ELSE INSERT INTO [AuditEvent] ([AuditEventId], [Key], [Value], [IsAlert]) VALUES (0x0D00, 'Initiated Built in Test', 'Initiated Built in Test', 0)","IF EXISTS(SELECT TOP 1 * FROM [AuditData] WHERE [AuditDataId] = 3839 AND [AuditEventId] = 0x0D00) UPDATE [AuditData] SET [Key] = 'FAIL : Ethernet Comms', [Value] = 'FAIL : Ethernet Comms', [IsAlert] = 0 WHERE [AuditDataId] = 3839 AND [AuditEventId] = 0x0D00 ELSE INSERT INTO [AuditData] ([AuditDataId], [AuditEventId], [Key], [Value], [IsAlert]) VALUES (3839, 0x0D00, 'FAIL : Ethernet Comms', 'FAIL : Ethernet Comms', 0)"]
[null,"Audit","IBIT_RESULT   ","Initiated Built in Test","Timeout : BLE Module",23,20,"0x0D00","00FE",null,null,null,null,"IF EXISTS(SELECT TOP 1 * FROM [AuditEvent] WHERE [AuditEventId] = 0x0D00) UPDATE [AuditEvent] SET [Key] = 'Initiated Built in Test', [Value] = 'Initiated Built in Test', [IsAlert] = 0 WHERE [AuditEventId] = 0x0D00 ELSE INSERT INTO [AuditEvent] ([AuditEventId], [Key], [Value], [IsAlert]) VALUES (0x0D00, 'Initiated Built in Test', 'Initiated Built in Test', 0)","IF EXISTS(SELECT TOP 1 * FROM [AuditData] WHERE [AuditDataId] = 254 AND [AuditEventId] = 0x0D00) UPDATE [AuditData] SET [Key] = 'Timeout : BLE Module', [Value] = 'Timeout : BLE Module', [IsAlert] = 0 WHERE [AuditDataId] = 254 AND [AuditEventId] = 0x0D00 ELSE INSERT INTO [AuditData] ([AuditDataId], [AuditEventId], [Key], [Value], [IsAlert]) VALUES (254, 0x0D00, 'Timeout : BLE Module', 'Timeout : BLE Module', 0)"]
[null,"Audit","IBIT_RESULT   ","Initiated Built in Test","Timeout : Reader Comms",23,22,"0x0D00","01FE",null,null,null,null,"IF EXISTS(SELECT TOP 1 * FROM [AuditEvent] WHERE [AuditEventId] = 0x0D00) UPDATE [AuditEvent] SET [Key] = 'Initiated Built in Test', [Value] = 'Initiated Built in Test', [IsAlert] = 0 WHERE [AuditEventId] = 0x0D00 ELSE INSERT INTO [AuditEvent] ([AuditEventId], [Key], [Value], [IsAlert]) VALUES (0x0D00, 'Initiated Built in Test', 'Initiated Built in Test', 0)","IF EXISTS(SELECT TOP 1 * FROM [AuditData] WHERE [AuditDataId] = 510 AND [AuditEventId] = 0x0D00) UPDATE [AuditData] SET [Key] = 'Timeout : Reader Comms', [Value] = 'Timeout : Reader Comms', [IsAlert] = 0 WHERE [AuditDataId] = 510 AND [AuditEventId] = 0x0D00 ELSE INSERT INTO [AuditData] ([AuditDataId], [AuditEventId], [Key], [Value], [IsAlert]) VALUES (510, 0x0D00, 'Timeout : Reader Comms', 'Timeout : Reader Comms', 0)"]
[null,"Audit","IBIT_RESULT   ","Initiated Built in Test","Timeout : UI Alert Module",23,25,"0x0D00","02FE",null,null,null,null,"IF EXISTS(SELECT TOP 1 * FROM [AuditEvent] WHERE [AuditEventId] = 0x0D00) UPDATE [AuditEvent] SET [Key] = 'Initiated Built in Test', [Value] = 'Initiated Built in Test', [IsAlert] = 0 WHERE [AuditEventId] = 0x0D00 ELSE INSERT INTO [AuditEvent] ([AuditEventId], [Key], [Value], [IsAlert]) VALUES (0x0D00, 'Initiated Built in Test', 'Initiated Built in Test', 0)","IF EXISTS(SELECT TOP 1 * FROM [AuditData] WHERE [AuditDataId] = 766 AND [AuditEventId] = 0x0D00) UPDATE [AuditData] SET [Key] = 'Timeout : UI Alert Module', [Value] = 'Timeout : UI Alert Module', [IsAlert] = 0 WHERE [AuditDataId] = 766 AND [AuditEventId] = 0x0D00 ELSE INSERT INTO [AuditData] ([AuditDataId], [AuditEventId], [Key], [Value], [IsAlert]) VALUES (766, 0x0D00, 'Timeout : UI Alert Module', 'Timeout : UI Alert Module', 0)"]
[null,"Audit","IBIT_RESULT   ","Initiated Built in Test","Timeout : DPS Module",23,20,"0x0D00","03FE",null,null,null,null,"IF EXISTS(SELECT TOP 1 * FROM [AuditEvent] WHERE [AuditEventId] = 0x0D00) UPDATE [AuditEvent] SET [Key] = 'Initiated Built in Test', [Value] = 'Initiated Built in Test', [IsAlert] = 0 WHERE [AuditEventId] = 0x0D00 ELSE INSERT INTO [AuditEvent] ([AuditEventId], [Key], [Value], [IsAlert]) VALUES (0x0D00, 'Initiated Built in Test', 'Initiated Built in Test', 0)","IF EXISTS(SELECT TOP 1 * FROM [AuditData] WHERE [AuditDataId] = 1022 AND [AuditEventId] = 0x0D00) UPDATE [AuditData] SET [Key] = 'Timeout : DPS Module', [Value] = 'Timeout : DPS Module', [IsAlert] = 0 WHERE [AuditDataId] = 1022 AND [AuditEventId] = 0x0D00 ELSE INSERT INTO [AuditData] ([AuditDataId], [AuditEventId], [Key], [Value], [IsAlert]) VALUES (1022, 0x0D00, 'Timeout : DPS Module', 'Timeout : DPS Module', 0)"]
[null,"Audit","IBIT_RESULT   ","Initiated Built in Test","Timeout : External Memory Check",23,31,"0x0D00","04FE",null,null,null,null,"IF EXISTS(SELECT TOP 1 * FROM [AuditEvent] WHERE [AuditEventId] = 0x0D00) UPDATE [AuditEvent] SET [Key] = 'Initiated Built in Test', [Value] = 'Initiated Built in Test', [IsAlert] = 0 WHERE [AuditEventId] = 0x0D00 ELSE INSERT INTO [AuditEvent] ([AuditEventId], [Key], [Value], [IsAlert]) VALUES (0x0D00, 'Initiated Built in Test', 'Initiated Built in Test', 0)","IF EXISTS(SELECT TOP 1 * FROM [AuditData] WHERE [AuditDataId] = 1278 AND [AuditEventId] = 0x0D00) UPDATE [AuditData] SET [Key] = 'Timeout : External Memory Check', [Value] = 'Timeout : External Memory Check', [IsAlert] = 0 WHERE [AuditDataId] = 1278 AND [AuditEventId] = 0x0D00 ELSE INSERT INTO [AuditData] ([AuditDataId], [AuditEventId], [Key], [Value], [IsAlert]) VALUES (1278, 0x0D00, 'Timeout : External Memory Check', 'Timeout : External Memory Check', 0)"]
[null,"Audit","IBIT_RESULT   ","Initiated Built in Test","Timeout : Battery Health",23,24,"0x0D00","06FE",null,null,null,null,"IF EXISTS(SELECT TOP 1 * FROM [AuditEvent] WHERE [AuditEventId] = 0x0D00) UPDATE [AuditEvent] SET [Key] = 'Initiated Built in Test', [Value] = 'Initiated Built in Test', [IsAlert] = 0 WHERE [AuditEventId] = 0x0D00 ELSE INSERT INTO [AuditEvent] ([AuditEventId], [Key], [Value], [IsAlert]) VALUES (0x0D00, 'Initiated Built in Test', 'Initiated Built in Test', 0)","IF EXISTS(SELECT TOP 1 * FROM [AuditData] WHERE [AuditDataId] = 1790 AND [AuditEventId] = 0x0D00) UPDATE [AuditData] SET [Key] = 'Timeout : Battery Health', [Value] = 'Timeout : Battery Health', [IsAlert] = 0 WHERE [AuditDataId] = 1790 AND [AuditEventId] = 0x0D00 ELSE INSERT INTO [AuditData] ([AuditDataId], [AuditEventId], [Key], [Value], [IsAlert]) VALUES (1790, 0x0D00, 'Timeout : Battery Health', 'Timeout : Battery Health', 0)"]
[null,"Audit","IBIT_RESULT   ","Initiated Built in Test","Timeout : Sleep Current Meas",23,28,"0x0D00","07FE",null,null,null,null,"IF EXISTS(SELECT TOP 1 * FROM [AuditEvent] WHERE [AuditEventId] = 0x0D00) UPDATE [AuditEvent] SET [Key] = 'Initiated Built in Test', [Value] = 'Initiated Built in Test', [IsAlert] = 0 WHERE [AuditEventId] = 0x0D00 ELSE INSERT INTO [AuditEvent] ([AuditEventId], [Key], [Value], [IsAlert]) VALUES (0x0D00, 'Initiated Built in Test', 'Initiated Built in Test', 0)","IF EXISTS(SELECT TOP 1 * FROM [AuditData] WHERE [AuditDataId] = 2046 AND [AuditEventId] = 0x0D00) UPDATE [AuditData] SET [Key] = 'Timeout : Sleep Current Meas', [Value] = 'Timeout : Sleep Current Meas', [IsAlert] = 0 WHERE [AuditDataId] = 2046 AND [AuditEventId] = 0x0D00 ELSE INSERT INTO [AuditData] ([AuditDataId], [AuditEventId], [Key], [Value], [IsAlert]) VALUES (2046, 0x0D00, 'Timeout : Sleep Current Meas', 'Timeout : Sleep Current Meas', 0)"]
[null,"Audit","IBIT_RESULT   ","Initiated Built in Test","Timeout : Lock Configuration Check",23,34,"0x0D00","08FE",null,null,null,null,"IF EXISTS(SELECT TOP 1 * FROM [AuditEvent] WHERE [AuditEventId] = 0x0D00) UPDATE [AuditEvent] SET [Key] = 'Initiated Built in Test', [Value] = 'Initiated Built in Test', [IsAlert] = 0 WHERE [AuditEventId] = 0x0D00 ELSE INSERT INTO [AuditEvent] ([AuditEventId], [Key], [Value], [IsAlert]) VALUES (0x0D00, 'Initiated Built in Test', 'Initiated Built in Test', 0)","IF EXISTS(SELECT TOP 1 * FROM [AuditData] WHERE [AuditDataId] = 2302 AND [AuditEventId] = 0x0D00) UPDATE [AuditData] SET [Key] = 'Timeout : Lock Configuration Check', [Value] = 'Timeout : Lock Configuration Check', [IsAlert] = 0 WHERE [AuditDataId] = 2302 AND [AuditEventId] = 0x0D00 ELSE INSERT INTO [AuditData] ([AuditDataId], [AuditEventId], [Key], [Value], [IsAlert]) VALUES (2302, 0x0D00, 'Timeout : Lock Configuration Check', 'Timeout : Lock Configuration Check', 0)"]
[" ","Audit","IBIT_RESULT   ","Initiated Built in Test","Timeout : Lock State Machine",23,28,"0x0D00","09FE",null,null,null,null,"IF EXISTS(SELECT TOP 1 * FROM [AuditEvent] WHERE [AuditEventId] = 0x0D00) UPDATE [AuditEvent] SET [Key] = 'Initiated Built in Test', [Value] = 'Initiated Built in Test', [IsAlert] = 0 WHERE [AuditEventId] = 0x0D00 ELSE INSERT INTO [AuditEvent] ([AuditEventId], [Key], [Value], [IsAlert]) VALUES (0x0D00, 'Initiated Built in Test', 'Initiated Built in Test', 0)","IF EXISTS(SELECT TOP 1 * FROM [AuditData] WHERE [AuditDataId] = 2558 AND [AuditEventId] = 0x0D00) UPDATE [AuditData] SET [Key] = 'Timeout : Lock State Machine', [Value] = 'Timeout : Lock State Machine', [IsAlert] = 0 WHERE [AuditDataId] = 2558 AND [AuditEventId] = 0x0D00 ELSE INSERT INTO [AuditData] ([AuditDataId], [AuditEventId], [Key], [Value], [IsAlert]) VALUES (2558, 0x0D00, 'Timeout : Lock State Machine', 'Timeout : Lock State Machine', 0)"]
[null,"Audit","IBIT_RESULT   ","Initiated Built in Test","Timeout : Database Integrity",23,28,"0x0D00","0AFE",null,null,null,null,"IF EXISTS(SELECT TOP 1 * FROM [AuditEvent] WHERE [AuditEventId] = 0x0D00) UPDATE [AuditEvent] SET [Key] = 'Initiated Built in Test', [Value] = 'Initiated Built in Test', [IsAlert] = 0 WHERE [AuditEventId] = 0x0D00 ELSE INSERT INTO [AuditEvent] ([AuditEventId], [Key], [Value], [IsAlert]) VALUES (0x0D00, 'Initiated Built in Test', 'Initiated Built in Test', 0)","IF EXISTS(SELECT TOP 1 * FROM [AuditData] WHERE [AuditDataId] = 2814 AND [AuditEventId] = 0x0D00) UPDATE [AuditData] SET [Key] = 'Timeout : Database Integrity', [Value] = 'Timeout : Database Integrity', [IsAlert] = 0 WHERE [AuditDataId] = 2814 AND [AuditEventId] = 0x0D00 ELSE INSERT INTO [AuditData] ([AuditDataId], [AuditEventId], [Key], [Value], [IsAlert]) VALUES (2814, 0x0D00, 'Timeout : Database Integrity', 'Timeout : Database Integrity', 0)"]
[null,"Audit","IBIT_RESULT   ","Initiated Built in Test","Timeout: Wi-Fi Module",{"$f":"LEN(D496)","v":23},{"$f":"LEN(E496)","v":21},"0x0D00","0BFE",null,null,null,null,"IF EXISTS(SELECT TOP 1 * FROM [AuditEvent] WHERE [AuditEventId] = 0x0D00) UPDATE [AuditEvent] SET [Key] = 'Initiated Built in Test', [Value] = 'Initiated Built in Test', [IsAlert] = 0 WHERE [AuditEventId] = 0x0D00 ELSE INSERT INTO [AuditEvent] ([AuditEventId], [Key], [Value], [IsAlert]) VALUES (0x0D00, 'Initiated Built in Test', 'Initiated Built in Test', 0)","IF EXISTS(SELECT TOP 1 * FROM [AuditData] WHERE [AuditDataId] = 3070 AND [AuditEventId] = 0x0D00) UPDATE [AuditData] SET [Key] = 'Timeout: Wi-Fi Module', [Value] = 'Timeout: Wi-Fi Module', [IsAlert] = 0 WHERE [AuditDataId] = 3070 AND [AuditEventId] = 0x0D00 ELSE INSERT INTO [AuditData] ([AuditDataId], [AuditEventId], [Key], [Value], [IsAlert]) VALUES (3070, 0x0D00, 'Timeout: Wi-Fi Module', 'Timeout: Wi-Fi Module', 0)"]
[null,"Audit","IBIT_RESULT   ","Initiated Built in Test","Timeout: Perihperal HW",{"$f":"LEN(D497)","v":23},{"$f":"LEN(E497)","v":22},"0x0D00","0DFE",null,null,null,null,"IF EXISTS(SELECT TOP 1 * FROM [AuditEvent] WHERE [AuditEventId] = 0x0D00) UPDATE [AuditEvent] SET [Key] = 'Initiated Built in Test', [Value] = 'Initiated Built in Test', [IsAlert] = 0 WHERE [AuditEventId] = 0x0D00 ELSE INSERT INTO [AuditEvent] ([AuditEventId], [Key], [Value], [IsAlert]) VALUES (0x0D00, 'Initiated Built in Test', 'Initiated Built in Test', 0)","IF EXISTS(SELECT TOP 1 * FROM [AuditData] WHERE [AuditDataId] = 3582 AND [AuditEventId] = 0x0D00) UPDATE [AuditData] SET [Key] = 'Timeout: Perihperal HW', [Value] = 'Timeout: Perihperal HW', [IsAlert] = 0 WHERE [AuditDataId] = 3582 AND [AuditEventId] = 0x0D00 ELSE INSERT INTO [AuditData] ([AuditDataId], [AuditEventId], [Key], [Value], [IsAlert]) VALUES (3582, 0x0D00, 'Timeout: Perihperal HW', 'Timeout: Perihperal HW', 0)"]
[null,"Audit","IBIT_RESULT   ","Initiated Built in Test","Timeout: Ethernet Comms",null,null,"0x0D00","0EFE",null,null,null,null,"IF EXISTS(SELECT TOP 1 * FROM [AuditEvent] WHERE [AuditEventId] = 0x0D00) UPDATE [AuditEvent] SET [Key] = 'Initiated Built in Test', [Value] = 'Initiated Built in Test', [IsAlert] = 0 WHERE [AuditEventId] = 0x0D00 ELSE INSERT INTO [AuditEvent] ([AuditEventId], [Key], [Value], [IsAlert]) VALUES (0x0D00, 'Initiated Built in Test', 'Initiated Built in Test', 0)","IF EXISTS(SELECT TOP 1 * FROM [AuditData] WHERE [AuditDataId] = 3838 AND [AuditEventId] = 0x0D00) UPDATE [AuditData] SET [Key] = 'Timeout: Ethernet Comms', [Value] = 'Timeout: Ethernet Comms', [IsAlert] = 0 WHERE [AuditDataId] = 3838 AND [AuditEventId] = 0x0D00 ELSE INSERT INTO [AuditData] ([AuditDataId], [AuditEventId], [Key], [Value], [IsAlert]) VALUES (3838, 0x0D00, 'Timeout: Ethernet Comms', 'Timeout: Ethernet Comms', 0)"]
[null,"Audit","IBIT_RESULT   ","Initiated Built in Test","OK: RTC Passed",23,14,"0x0D00","0500",null,null,null,null,"IF EXISTS(SELECT TOP 1 * FROM [AuditEvent] WHERE [AuditEventId] = 0x0D00) UPDATE [AuditEvent] SET [Key] = 'Initiated Built in Test', [Value] = 'Initiated Built in Test', [IsAlert] = 0 WHERE [AuditEventId] = 0x0D00 ELSE INSERT INTO [AuditEvent] ([AuditEventId], [Key], [Value], [IsAlert]) VALUES (0x0D00, 'Initiated Built in Test', 'Initiated Built in Test', 0)","IF EXISTS(SELECT TOP 1 * FROM [AuditData] WHERE [AuditDataId] = 1280 AND [AuditEventId] = 0x0D00) UPDATE [AuditData] SET [Key] = 'OK: RTC Passed', [Value] = 'OK: RTC Passed', [IsAlert] = 0 WHERE [AuditDataId] = 1280 AND [AuditEventId] = 0x0D00 ELSE INSERT INTO [AuditData] ([AuditDataId], [AuditEventId], [Key], [Value], [IsAlert]) VALUES (1280, 0x0D00, 'OK: RTC Passed', 'OK: RTC Passed', 0)"]
[null,"Audit","IBIT_RESULT   ","Initiated Built in Test","ERROR : RTC Invalid Time Value",23,30,"0x0D00","0501",null,null,null,null,"IF EXISTS(SELECT TOP 1 * FROM [AuditEvent] WHERE [AuditEventId] = 0x0D00) UPDATE [AuditEvent] SET [Key] = 'Initiated Built in Test', [Value] = 'Initiated Built in Test', [IsAlert] = 0 WHERE [AuditEventId] = 0x0D00 ELSE INSERT INTO [AuditEvent] ([AuditEventId], [Key], [Value], [IsAlert]) VALUES (0x0D00, 'Initiated Built in Test', 'Initiated Built in Test', 0)","IF EXISTS(SELECT TOP 1 * FROM [AuditData] WHERE [AuditDataId] = 1281 AND [AuditEventId] = 0x0D00) UPDATE [AuditData] SET [Key] = 'ERROR : RTC Invalid Time Value', [Value] = 'ERROR : RTC Invalid Time Value', [IsAlert] = 0 WHERE [AuditDataId] = 1281 AND [AuditEventId] = 0x0D00 ELSE INSERT INTO [AuditData] ([AuditDataId], [AuditEventId], [Key], [Value], [IsAlert]) VALUES (1281, 0x0D00, 'ERROR : RTC Invalid Time Value', 'ERROR : RTC Invalid Time Value', 0)"]
[null,"Audit","IBIT_RESULT   ","Initiated Built in Test","ERROR : RTC Increment Value",23,27,"0x0D00","0502",null,null,null,null,"IF EXISTS(SELECT TOP 1 * FROM [AuditEvent] WHERE [AuditEventId] = 0x0D00) UPDATE [AuditEvent] SET [Key] = 'Initiated Built in Test', [Value] = 'Initiated Built in Test', [IsAlert] = 0 WHERE [AuditEventId] = 0x0D00 ELSE INSERT INTO [AuditEvent] ([AuditEventId], [Key], [Value], [IsAlert]) VALUES (0x0D00, 'Initiated Built in Test', 'Initiated Built in Test', 0)","IF EXISTS(SELECT TOP 1 * FROM [AuditData] WHERE [AuditDataId] = 1282 AND [AuditEventId] = 0x0D00) UPDATE [AuditData] SET [Key] = 'ERROR : RTC Increment Value', [Value] = 'ERROR : RTC Increment Value', [IsAlert] = 0 WHERE [AuditDataId] = 1282 AND [AuditEventId] = 0x0D00 ELSE INSERT INTO [AuditData] ([AuditDataId], [AuditEventId], [Key], [Value], [IsAlert]) VALUES (1282, 0x0D00, 'ERROR : RTC Increment Value', 'ERROR : RTC Increment Value', 0)"]
[null,"Audit","IBIT_RESULT   ","Initiated Built in Test","FAIL : Gyro Sensor Failed",{"$f":"LEN(D502)","v":23},{"$f":"LEN(E502)","v":25},"0x0D00","0D01",null,null,null,null,"IF EXISTS(SELECT TOP 1 * FROM [AuditEvent] WHERE [AuditEventId] = 0x0D00) UPDATE [AuditEvent] SET [Key] = 'Initiated Built in Test', [Value] = 'Initiated Built in Test', [IsAlert] = 0 WHERE [AuditEventId] = 0x0D00 ELSE INSERT INTO [AuditEvent] ([AuditEventId], [Key], [Value], [IsAlert]) VALUES (0x0D00, 'Initiated Built in Test', 'Initiated Built in Test', 0)","IF EXISTS(SELECT TOP 1 * FROM [AuditData] WHERE [AuditDataId] = 3329 AND [AuditEventId] = 0x0D00) UPDATE [AuditData] SET [Key] = 'FAIL : Gyro Sensor Failed', [Value] = 'FAIL : Gyro Sensor Failed', [IsAlert] = 0 WHERE [AuditDataId] = 3329 AND [AuditEventId] = 0x0D00 ELSE INSERT INTO [AuditData] ([AuditDataId], [AuditEventId], [Key], [Value], [IsAlert]) VALUES (3329, 0x0D00, 'FAIL : Gyro Sensor Failed', 'FAIL : Gyro Sensor Failed', 0)"]
[null,"Audit","IBIT_RESULT   ","Initiated Built in Test","FAIL : Security Chip Failed",{"$f":"LEN(D503)","v":23},{"$f":"LEN(E503)","v":27},"0x0D00","0D02",null,null,null,null,"IF EXISTS(SELECT TOP 1 * FROM [AuditEvent] WHERE [AuditEventId] = 0x0D00) UPDATE [AuditEvent] SET [Key] = 'Initiated Built in Test', [Value] = 'Initiated Built in Test', [IsAlert] = 0 WHERE [AuditEventId] = 0x0D00 ELSE INSERT INTO [AuditEvent] ([AuditEventId], [Key], [Value], [IsAlert]) VALUES (0x0D00, 'Initiated Built in Test', 'Initiated Built in Test', 0)","IF EXISTS(SELECT TOP 1 * FROM [AuditData] WHERE [AuditDataId] = 3330 AND [AuditEventId] = 0x0D00) UPDATE [AuditData] SET [Key] = 'FAIL : Security Chip Failed', [Value] = 'FAIL : Security Chip Failed', [IsAlert] = 0 WHERE [AuditDataId] = 3330 AND [AuditEventId] = 0x0D00 ELSE INSERT INTO [AuditData] ([AuditDataId], [AuditEventId], [Key], [Value], [IsAlert]) VALUES (3330, 0x0D00, 'FAIL : Security Chip Failed', 'FAIL : Security Chip Failed', 0)"]
[null,"Audit","IBIT_RESULT   ","Initiated Built in Test","FAIL: Accelerometer Sensor Failed",null,null,"0x0D00","0D03",null,null,null,null,"IF EXISTS(SELECT TOP 1 * FROM [AuditEvent] WHERE [AuditEventId] = 0x0D00) UPDATE [AuditEvent] SET [Key] = 'Initiated Built in Test', [Value] = 'Initiated Built in Test', [IsAlert] = 0 WHERE [AuditEventId] = 0x0D00 ELSE INSERT INTO [AuditEvent] ([AuditEventId], [Key], [Value], [IsAlert]) VALUES (0x0D00, 'Initiated Built in Test', 'Initiated Built in Test', 0)","IF EXISTS(SELECT TOP 1 * FROM [AuditData] WHERE [AuditDataId] = 3331 AND [AuditEventId] = 0x0D00) UPDATE [AuditData] SET [Key] = 'FAIL: Accelerometer Sensor Failed', [Value] = 'FAIL: Accelerometer Sensor Failed', [IsAlert] = 0 WHERE [AuditDataId] = 3331 AND [AuditEventId] = 0x0D00 ELSE INSERT INTO [AuditData] ([AuditDataId], [AuditEventId], [Key], [Value], [IsAlert]) VALUES (3331, 0x0D00, 'FAIL: Accelerometer Sensor Failed', 'FAIL: Accelerometer Sensor Failed', 0)"]
[null,"Audit","IBIT_RESULT   ","Initiated Built in Test","FAIL: BLE Credential Failed",null,null,"0x0D00","0D04",null,null,null,null,{"$f":"IF(LEFT(H505,2)=\"0x\",CONCATENATE(\"IF EXISTS(SELECT TOP 1 * FROM [AuditEvent] WHERE [AuditEventId] = \",H505,\") UPDATE [AuditEvent] SET [Key] = '\",TRIM(D505),\"', [Value] = '\",TRIM(D505),\"', [IsAlert] = \",IF(B505=\"Audit\",0,1),\" WHERE [AuditEventId] = \",H505,\" ELSE INSERT INTO [AuditEvent] ([AuditEventId], [Key], [Value], [IsAlert]) VALUES (\",H505,\", '\",TRIM(D505),\"', '\",TRIM(D505),\"', \",IF(B505=\"Audit\",0,1), \")\"),\"-- no value\")","v":"IF EXISTS(SELECT TOP 1 * FROM [AuditEvent] WHERE [AuditEventId] = 0x0D00) UPDATE [AuditEvent] SET [Key] = 'Initiated Built in Test', [Value] = 'Initiated Built in Test', [IsAlert] = 0 WHERE [AuditEventId] = 0x0D00 ELSE INSERT INTO [AuditEvent] ([AuditEventId], [Key], [Value], [IsAlert]) VALUES (0x0D00, 'Initiated Built in Test', 'Initiated Built in Test', 0)"},"IF EXISTS(SELECT TOP 1 * FROM [AuditData] WHERE [AuditDataId] = 3332 AND [AuditEventId] = 0x0D00) UPDATE [AuditData] SET [Key] = 'FAIL: BLE Credential Failed', [Value] = 'FAIL: BLE Credential Failed', [IsAlert] = 0 WHERE [AuditDataId] = 3332 AND [AuditEventId] = 0x0D00 ELSE INSERT INTO [AuditData] ([AuditDataId], [AuditEventId], [Key], [Value], [IsAlert]) VALUES (3332, 0x0D00, 'FAIL: BLE Credential Failed', 'FAIL: BLE Credential Failed', 0)"]
[null,"Audit","IB_COMM      ","Reader Comm Check ","OK : Reader Communications",18,26,"0x0D01","0000",null,null,null,null,"IF EXISTS(SELECT TOP 1 * FROM [AuditEvent] WHERE [AuditEventId] = 0x0D01) UPDATE [AuditEvent] SET [Key] = 'Reader Comm Check', [Value] = 'Reader Comm Check', [IsAlert] = 0 WHERE [AuditEventId] = 0x0D01 ELSE INSERT INTO [AuditEvent] ([AuditEventId], [Key], [Value], [IsAlert]) VALUES (0x0D01, 'Reader Comm Check', 'Reader Comm Check', 0)","IF EXISTS(SELECT TOP 1 * FROM [AuditData] WHERE [AuditDataId] = 0 AND [AuditEventId] = 0x0D01) UPDATE [AuditData] SET [Key] = 'OK : Reader Communications', [Value] = 'OK : Reader Communications', [IsAlert] = 0 WHERE [AuditDataId] = 0 AND [AuditEventId] = 0x0D01 ELSE INSERT INTO [AuditData] ([AuditDataId], [AuditEventId], [Key], [Value], [IsAlert]) VALUES (0, 0x0D01, 'OK : Reader Communications', 'OK : Reader Communications', 0)"]
[null,"Audit","IB_COMM      ","Reader Comm Check","FAIL : Reader Communications",17,28,"0x0D01","0001",null,null,null,null,"IF EXISTS(SELECT TOP 1 * FROM [AuditEvent] WHERE [AuditEventId] = 0x0D01) UPDATE [AuditEvent] SET [Key] = 'Reader Comm Check', [Value] = 'Reader Comm Check', [IsAlert] = 0 WHERE [AuditEventId] = 0x0D01 ELSE INSERT INTO [AuditEvent] ([AuditEventId], [Key], [Value], [IsAlert]) VALUES (0x0D01, 'Reader Comm Check', 'Reader Comm Check', 0)","IF EXISTS(SELECT TOP 1 * FROM [AuditData] WHERE [AuditDataId] = 1 AND [AuditEventId] = 0x0D01) UPDATE [AuditData] SET [Key] = 'FAIL : Reader Communications', [Value] = 'FAIL : Reader Communications', [IsAlert] = 0 WHERE [AuditDataId] = 1 AND [AuditEventId] = 0x0D01 ELSE INSERT INTO [AuditData] ([AuditDataId], [AuditEventId], [Key], [Value], [IsAlert]) VALUES (1, 0x0D01, 'FAIL : Reader Communications', 'FAIL : Reader Communications', 0)"]
[null,"Audit","IB_COMM      ","Reader Comm Check","Reader Reset",{"$f":"LEN(D508)","v":17},{"$f":"LEN(E508)","v":12},"0x0D01","0002",null,null,null,null,"IF EXISTS(SELECT TOP 1 * FROM [AuditEvent] WHERE [AuditEventId] = 0x0D01) UPDATE [AuditEvent] SET [Key] = 'Reader Comm Check', [Value] = 'Reader Comm Check', [IsAlert] = 0 WHERE [AuditEventId] = 0x0D01 ELSE INSERT INTO [AuditEvent] ([AuditEventId], [Key], [Value], [IsAlert]) VALUES (0x0D01, 'Reader Comm Check', 'Reader Comm Check', 0)","IF EXISTS(SELECT TOP 1 * FROM [AuditData] WHERE [AuditDataId] = 2 AND [AuditEventId] = 0x0D01) UPDATE [AuditData] SET [Key] = 'Reader Reset', [Value] = 'Reader Reset', [IsAlert] = 0 WHERE [AuditDataId] = 2 AND [AuditEventId] = 0x0D01 ELSE INSERT INTO [AuditData] ([AuditDataId], [AuditEventId], [Key], [Value], [IsAlert]) VALUES (2, 0x0D01, 'Reader Reset', 'Reader Reset', 0)"]
[null,"Audit","POST_RESULT  ","Power On Self Test","OK : BLE Module",18,15,"0x0D02","0000",null,null,null,null,"IF EXISTS(SELECT TOP 1 * FROM [AuditEvent] WHERE [AuditEventId] = 0x0D02) UPDATE [AuditEvent] SET [Key] = 'Power On Self Test', [Value] = 'Power On Self Test', [IsAlert] = 0 WHERE [AuditEventId] = 0x0D02 ELSE INSERT INTO [AuditEvent] ([AuditEventId], [Key], [Value], [IsAlert]) VALUES (0x0D02, 'Power On Self Test', 'Power On Self Test', 0)","IF EXISTS(SELECT TOP 1 * FROM [AuditData] WHERE [AuditDataId] = 0 AND [AuditEventId] = 0x0D02) UPDATE [AuditData] SET [Key] = 'OK : BLE Module', [Value] = 'OK : BLE Module', [IsAlert] = 0 WHERE [AuditDataId] = 0 AND [AuditEventId] = 0x0D02 ELSE INSERT INTO [AuditData] ([AuditDataId], [AuditEventId], [Key], [Value], [IsAlert]) VALUES (0, 0x0D02, 'OK : BLE Module', 'OK : BLE Module', 0)"]
[null,"Audit","POST_RESULT  ","Power On Self Test","OK : Reader Comms",18,17,"0x0D02","0100",null,null,null,null,"IF EXISTS(SELECT TOP 1 * FROM [AuditEvent] WHERE [AuditEventId] = 0x0D02) UPDATE [AuditEvent] SET [Key] = 'Power On Self Test', [Value] = 'Power On Self Test', [IsAlert] = 0 WHERE [AuditEventId] = 0x0D02 ELSE INSERT INTO [AuditEvent] ([AuditEventId], [Key], [Value], [IsAlert]) VALUES (0x0D02, 'Power On Self Test', 'Power On Self Test', 0)","IF EXISTS(SELECT TOP 1 * FROM [AuditData] WHERE [AuditDataId] = 256 AND [AuditEventId] = 0x0D02) UPDATE [AuditData] SET [Key] = 'OK : Reader Comms', [Value] = 'OK : Reader Comms', [IsAlert] = 0 WHERE [AuditDataId] = 256 AND [AuditEventId] = 0x0D02 ELSE INSERT INTO [AuditData] ([AuditDataId], [AuditEventId], [Key], [Value], [IsAlert]) VALUES (256, 0x0D02, 'OK : Reader Comms', 'OK : Reader Comms', 0)"]
[null,"Audit","POST_RESULT  ","Power On Self Test","OK : UI Alert Module",18,20,"0x0D02","0200",null,null,null,null,"IF EXISTS(SELECT TOP 1 * FROM [AuditEvent] WHERE [AuditEventId] = 0x0D02) UPDATE [AuditEvent] SET [Key] = 'Power On Self Test', [Value] = 'Power On Self Test', [IsAlert] = 0 WHERE [AuditEventId] = 0x0D02 ELSE INSERT INTO [AuditEvent] ([AuditEventId], [Key], [Value], [IsAlert]) VALUES (0x0D02, 'Power On Self Test', 'Power On Self Test', 0)","IF EXISTS(SELECT TOP 1 * FROM [AuditData] WHERE [AuditDataId] = 512 AND [AuditEventId] = 0x0D02) UPDATE [AuditData] SET [Key] = 'OK : UI Alert Module', [Value] = 'OK : UI Alert Module', [IsAlert] = 0 WHERE [AuditDataId] = 512 AND [AuditEventId] = 0x0D02 ELSE INSERT INTO [AuditData] ([AuditDataId], [AuditEventId], [Key], [Value], [IsAlert]) VALUES (512, 0x0D02, 'OK : UI Alert Module', 'OK : UI Alert Module', 0)"]
[null,"Audit","POST_RESULT  ","Power On Self Test","OK : DPS Module",18,15,"0x0D02","0300",null,null,null,null,"IF EXISTS(SELECT TOP 1 * FROM [AuditEvent] WHERE [AuditEventId] = 0x0D02) UPDATE [AuditEvent] SET [Key] = 'Power On Self Test', [Value] = 'Power On Self Test', [IsAlert] = 0 WHERE [AuditEventId] = 0x0D02 ELSE INSERT INTO [AuditEvent] ([AuditEventId], [Key], [Value], [IsAlert]) VALUES (0x0D02, 'Power On Self Test', 'Power On Self Test', 0)","IF EXISTS(SELECT TOP 1 * FROM [AuditData] WHERE [AuditDataId] = 768 AND [AuditEventId] = 0x0D02) UPDATE [AuditData] SET [Key] = 'OK : DPS Module', [Value] = 'OK : DPS Module', [IsAlert] = 0 WHERE [AuditDataId] = 768 AND [AuditEventId] = 0x0D02 ELSE INSERT INTO [AuditData] ([AuditDataId], [AuditEventId], [Key], [Value], [IsAlert]) VALUES (768, 0x0D02, 'OK : DPS Module', 'OK : DPS Module', 0)"]
[null,"Audit","POST_RESULT  ","Power On Self Test","OK : External Memory Check",18,26,"0x0D02","0400",null,null,null,null,"IF EXISTS(SELECT TOP 1 * FROM [AuditEvent] WHERE [AuditEventId] = 0x0D02) UPDATE [AuditEvent] SET [Key] = 'Power On Self Test', [Value] = 'Power On Self Test', [IsAlert] = 0 WHERE [AuditEventId] = 0x0D02 ELSE INSERT INTO [AuditEvent] ([AuditEventId], [Key], [Value], [IsAlert]) VALUES (0x0D02, 'Power On Self Test', 'Power On Self Test', 0)","IF EXISTS(SELECT TOP 1 * FROM [AuditData] WHERE [AuditDataId] = 1024 AND [AuditEventId] = 0x0D02) UPDATE [AuditData] SET [Key] = 'OK : External Memory Check', [Value] = 'OK : External Memory Check', [IsAlert] = 0 WHERE [AuditDataId] = 1024 AND [AuditEventId] = 0x0D02 ELSE INSERT INTO [AuditData] ([AuditDataId], [AuditEventId], [Key], [Value], [IsAlert]) VALUES (1024, 0x0D02, 'OK : External Memory Check', 'OK : External Memory Check', 0)"]
[null,"Audit","POST_RESULT  ","Power On Self Test","OK : Battery Health",18,19,"0x0D02","0600",null,null,null,null,"IF EXISTS(SELECT TOP 1 * FROM [AuditEvent] WHERE [AuditEventId] = 0x0D02) UPDATE [AuditEvent] SET [Key] = 'Power On Self Test', [Value] = 'Power On Self Test', [IsAlert] = 0 WHERE [AuditEventId] = 0x0D02 ELSE INSERT INTO [AuditEvent] ([AuditEventId], [Key], [Value], [IsAlert]) VALUES (0x0D02, 'Power On Self Test', 'Power On Self Test', 0)","IF EXISTS(SELECT TOP 1 * FROM [AuditData] WHERE [AuditDataId] = 1536 AND [AuditEventId] = 0x0D02) UPDATE [AuditData] SET [Key] = 'OK : Battery Health', [Value] = 'OK : Battery Health', [IsAlert] = 0 WHERE [AuditDataId] = 1536 AND [AuditEventId] = 0x0D02 ELSE INSERT INTO [AuditData] ([AuditDataId], [AuditEventId], [Key], [Value], [IsAlert]) VALUES (1536, 0x0D02, 'OK : Battery Health', 'OK : Battery Health', 0)"]
[null,"Audit","POST_RESULT  ","Power On Self Test","OK : Sleep Current Meas",18,23,"0x0D02","0700",null,null,null,null,"IF EXISTS(SELECT TOP 1 * FROM [AuditEvent] WHERE [AuditEventId] = 0x0D02) UPDATE [AuditEvent] SET [Key] = 'Power On Self Test', [Value] = 'Power On Self Test', [IsAlert] = 0 WHERE [AuditEventId] = 0x0D02 ELSE INSERT INTO [AuditEvent] ([AuditEventId], [Key], [Value], [IsAlert]) VALUES (0x0D02, 'Power On Self Test', 'Power On Self Test', 0)","IF EXISTS(SELECT TOP 1 * FROM [AuditData] WHERE [AuditDataId] = 1792 AND [AuditEventId] = 0x0D02) UPDATE [AuditData] SET [Key] = 'OK : Sleep Current Meas', [Value] = 'OK : Sleep Current Meas', [IsAlert] = 0 WHERE [AuditDataId] = 1792 AND [AuditEventId] = 0x0D02 ELSE INSERT INTO [AuditData] ([AuditDataId], [AuditEventId], [Key], [Value], [IsAlert]) VALUES (1792, 0x0D02, 'OK : Sleep Current Meas', 'OK : Sleep Current Meas', 0)"]
[null,"Audit","POST_RESULT  ","Power On Self Test","OK : Lock Configuration Check",18,29,"0x0D02","0800",null,null,null,null,"IF EXISTS(SELECT TOP 1 * FROM [AuditEvent] WHERE [AuditEventId] = 0x0D02) UPDATE [AuditEvent] SET [Key] = 'Power On Self Test', [Value] = 'Power On Self Test', [IsAlert] = 0 WHERE [AuditEventId] = 0x0D02 ELSE INSERT INTO [AuditEvent] ([AuditEventId], [Key], [Value], [IsAlert]) VALUES (0x0D02, 'Power On Self Test', 'Power On Self Test', 0)","IF EXISTS(SELECT TOP 1 * FROM [AuditData] WHERE [AuditDataId] = 2048 AND [AuditEventId] = 0x0D02) UPDATE [AuditData] SET [Key] = 'OK : Lock Configuration Check', [Value] = 'OK : Lock Configuration Check', [IsAlert] = 0 WHERE [AuditDataId] = 2048 AND [AuditEventId] = 0x0D02 ELSE INSERT INTO [AuditData] ([AuditDataId], [AuditEventId], [Key], [Value], [IsAlert]) VALUES (2048, 0x0D02, 'OK : Lock Configuration Check', 'OK : Lock Configuration Check', 0)"]
[null,"Audit","POST_RESULT  ","Power On Self Test","OK : Lock State Machine",18,23,"0x0D02","0900",null,null,null,null,"IF EXISTS(SELECT TOP 1 * FROM [AuditEvent] WHERE [AuditEventId] = 0x0D02) UPDATE [AuditEvent] SET [Key] = 'Power On Self Test', [Value] = 'Power On Self Test', [IsAlert] = 0 WHERE [AuditEventId] = 0x0D02 ELSE INSERT INTO [AuditEvent] ([AuditEventId], [Key], [Value], [IsAlert]) VALUES (0x0D02, 'Power On Self Test', 'Power On Self Test', 0)","IF EXISTS(SELECT TOP 1 * FROM [AuditData] WHERE [AuditDataId] = 2304 AND [AuditEventId] = 0x0D02) UPDATE [AuditData] SET [Key] = 'OK : Lock State Machine', [Value] = 'OK : Lock State Machine', [IsAlert] = 0 WHERE [AuditDataId] = 2304 AND [AuditEventId] = 0x0D02 ELSE INSERT INTO [AuditData] ([AuditDataId], [AuditEventId], [Key], [Value], [IsAlert]) VALUES (2304, 0x0D02, 'OK : Lock State Machine', 'OK : Lock State Machine', 0)"]
[null,"Audit","POST_RESULT  ","Power On Self Test","OK : Database Integrity",18,23,"0x0D02","0A00",null,null,null,null,"IF EXISTS(SELECT TOP 1 * FROM [AuditEvent] WHERE [AuditEventId] = 0x0D02) UPDATE [AuditEvent] SET [Key] = 'Power On Self Test', [Value] = 'Power On Self Test', [IsAlert] = 0 WHERE [AuditEventId] = 0x0D02 ELSE INSERT INTO [AuditEvent] ([AuditEventId], [Key], [Value], [IsAlert]) VALUES (0x0D02, 'Power On Self Test', 'Power On Self Test', 0)","IF EXISTS(SELECT TOP 1 * FROM [AuditData] WHERE [AuditDataId] = 2560 AND [AuditEventId] = 0x0D02) UPDATE [AuditData] SET [Key] = 'OK : Database Integrity', [Value] = 'OK : Database Integrity', [IsAlert] = 0 WHERE [AuditDataId] = 2560 AND [AuditEventId] = 0x0D02 ELSE INSERT INTO [AuditData] ([AuditDataId], [AuditEventId], [Key], [Value], [IsAlert]) VALUES (2560, 0x0D02, 'OK : Database Integrity', 'OK : Database Integrity', 0)"]
[null,"Audit","POST_RESULT  ","Power On Self Test","OK : Wi-Fi Module",18,17,"0x0D02","0B00",null,null,null,null,"IF EXISTS(SELECT TOP 1 * FROM [AuditEvent] WHERE [AuditEventId] = 0x0D02) UPDATE [AuditEvent] SET [Key] = 'Power On Self Test', [Value] = 'Power On Self Test', [IsAlert] = 0 WHERE [AuditEventId] = 0x0D02 ELSE INSERT INTO [AuditEvent] ([AuditEventId], [Key], [Value], [IsAlert]) VALUES (0x0D02, 'Power On Self Test', 'Power On Self Test', 0)","IF EXISTS(SELECT TOP 1 * FROM [AuditData] WHERE [AuditDataId] = 2816 AND [AuditEventId] = 0x0D02) UPDATE [AuditData] SET [Key] = 'OK : Wi-Fi Module', [Value] = 'OK : Wi-Fi Module', [IsAlert] = 0 WHERE [AuditDataId] = 2816 AND [AuditEventId] = 0x0D02 ELSE INSERT INTO [AuditData] ([AuditDataId], [AuditEventId], [Key], [Value], [IsAlert]) VALUES (2816, 0x0D02, 'OK : Wi-Fi Module', 'OK : Wi-Fi Module', 0)"]
[null,"Audit","POST_RESULT  ","Power On Self Test","OK: Post Test Results",null,{"$f":"LEN(E520)","v":21},"0x0D02","0C00",null,null,null,null,"IF EXISTS(SELECT TOP 1 * FROM [AuditEvent] WHERE [AuditEventId] = 0x0D02) UPDATE [AuditEvent] SET [Key] = 'Power On Self Test', [Value] = 'Power On Self Test', [IsAlert] = 0 WHERE [AuditEventId] = 0x0D02 ELSE INSERT INTO [AuditEvent] ([AuditEventId], [Key], [Value], [IsAlert]) VALUES (0x0D02, 'Power On Self Test', 'Power On Self Test', 0)","IF EXISTS(SELECT TOP 1 * FROM [AuditData] WHERE [AuditDataId] = 3072 AND [AuditEventId] = 0x0D02) UPDATE [AuditData] SET [Key] = 'OK: Post Test Results', [Value] = 'OK: Post Test Results', [IsAlert] = 0 WHERE [AuditDataId] = 3072 AND [AuditEventId] = 0x0D02 ELSE INSERT INTO [AuditData] ([AuditDataId], [AuditEventId], [Key], [Value], [IsAlert]) VALUES (3072, 0x0D02, 'OK: Post Test Results', 'OK: Post Test Results', 0)"]
[null,"Audit","POST_RESULT  ","Power On Self Test","OK: Peripheral HW",null,{"$f":"LEN(E521)","v":17},"0x0D02","0D00",null,null,null,null,"IF EXISTS(SELECT TOP 1 * FROM [AuditEvent] WHERE [AuditEventId] = 0x0D02) UPDATE [AuditEvent] SET [Key] = 'Power On Self Test', [Value] = 'Power On Self Test', [IsAlert] = 0 WHERE [AuditEventId] = 0x0D02 ELSE INSERT INTO [AuditEvent] ([AuditEventId], [Key], [Value], [IsAlert]) VALUES (0x0D02, 'Power On Self Test', 'Power On Self Test', 0)","IF EXISTS(SELECT TOP 1 * FROM [AuditData] WHERE [AuditDataId] = 3328 AND [AuditEventId] = 0x0D02) UPDATE [AuditData] SET [Key] = 'OK: Peripheral HW', [Value] = 'OK: Peripheral HW', [IsAlert] = 0 WHERE [AuditDataId] = 3328 AND [AuditEventId] = 0x0D02 ELSE INSERT INTO [AuditData] ([AuditDataId], [AuditEventId], [Key], [Value], [IsAlert]) VALUES (3328, 0x0D02, 'OK: Peripheral HW', 'OK: Peripheral HW', 0)"]
[null,"Audit","POST_RESULT  ","Power On Self Test","OK: Ethernet Comms",null,null,"0x0D02","0E00",null,null,null,null,"IF EXISTS(SELECT TOP 1 * FROM [AuditEvent] WHERE [AuditEventId] = 0x0D02) UPDATE [AuditEvent] SET [Key] = 'Power On Self Test', [Value] = 'Power On Self Test', [IsAlert] = 0 WHERE [AuditEventId] = 0x0D02 ELSE INSERT INTO [AuditEvent] ([AuditEventId], [Key], [Value], [IsAlert]) VALUES (0x0D02, 'Power On Self Test', 'Power On Self Test', 0)","IF EXISTS(SELECT TOP 1 * FROM [AuditData] WHERE [AuditDataId] = 3584 AND [AuditEventId] = 0x0D02) UPDATE [AuditData] SET [Key] = 'OK: Ethernet Comms', [Value] = 'OK: Ethernet Comms', [IsAlert] = 0 WHERE [AuditDataId] = 3584 AND [AuditEventId] = 0x0D02 ELSE INSERT INTO [AuditData] ([AuditDataId], [AuditEventId], [Key], [Value], [IsAlert]) VALUES (3584, 0x0D02, 'OK: Ethernet Comms', 'OK: Ethernet Comms', 0)"]
[null,"Audit","POST_RESULT  ","Power On Self Test","FAIL : BLE Module",{"$f":"LEN(D523)","v":18},17,"0x0D02","0001",null,null,null,null,"IF EXISTS(SELECT TOP 1 * FROM [AuditEvent] WHERE [AuditEventId] = 0x0D02) UPDATE [AuditEvent] SET [Key] = 'Power On Self Test', [Value] = 'Power On Self Test', [IsAlert] = 0 WHERE [AuditEventId] = 0x0D02 ELSE INSERT INTO [AuditEvent] ([AuditEventId], [Key], [Value], [IsAlert]) VALUES (0x0D02, 'Power On Self Test', 'Power On Self Test', 0)","IF EXISTS(SELECT TOP 1 * FROM [AuditData] WHERE [AuditDataId] = 1 AND [AuditEventId] = 0x0D02) UPDATE [AuditData] SET [Key] = 'FAIL : BLE Module', [Value] = 'FAIL : BLE Module', [IsAlert] = 0 WHERE [AuditDataId] = 1 AND [AuditEventId] = 0x0D02 ELSE INSERT INTO [AuditData] ([AuditDataId], [AuditEventId], [Key], [Value], [IsAlert]) VALUES (1, 0x0D02, 'FAIL : BLE Module', 'FAIL : BLE Module', 0)"]
[null,"Audit","POST_RESULT  ","Power On Self Test","FAIL : Reader Comms",18,19,"0x0D02","01FF",null,null,null,null,"IF EXISTS(SELECT TOP 1 * FROM [AuditEvent] WHERE [AuditEventId] = 0x0D02) UPDATE [AuditEvent] SET [Key] = 'Power On Self Test', [Value] = 'Power On Self Test', [IsAlert] = 0 WHERE [AuditEventId] = 0x0D02 ELSE INSERT INTO [AuditEvent] ([AuditEventId], [Key], [Value], [IsAlert]) VALUES (0x0D02, 'Power On Self Test', 'Power On Self Test', 0)","IF EXISTS(SELECT TOP 1 * FROM [AuditData] WHERE [AuditDataId] = 511 AND [AuditEventId] = 0x0D02) UPDATE [AuditData] SET [Key] = 'FAIL : Reader Comms', [Value] = 'FAIL : Reader Comms', [IsAlert] = 0 WHERE [AuditDataId] = 511 AND [AuditEventId] = 0x0D02 ELSE INSERT INTO [AuditData] ([AuditDataId], [AuditEventId], [Key], [Value], [IsAlert]) VALUES (511, 0x0D02, 'FAIL : Reader Comms', 'FAIL : Reader Comms', 0)"]
[null,"Audit","POST_RESULT  ","Power On Self Test","FAIL : Motor Power",18,18,"0x0D02","0201",null,null,null,null,"IF EXISTS(SELECT TOP 1 * FROM [AuditEvent] WHERE [AuditEventId] = 0x0D02) UPDATE [AuditEvent] SET [Key] = 'Power On Self Test', [Value] = 'Power On Self Test', [IsAlert] = 0 WHERE [AuditEventId] = 0x0D02 ELSE INSERT INTO [AuditEvent] ([AuditEventId], [Key], [Value], [IsAlert]) VALUES (0x0D02, 'Power On Self Test', 'Power On Self Test', 0)","IF EXISTS(SELECT TOP 1 * FROM [AuditData] WHERE [AuditDataId] = 513 AND [AuditEventId] = 0x0D02) UPDATE [AuditData] SET [Key] = 'FAIL : Motor Power', [Value] = 'FAIL : Motor Power', [IsAlert] = 0 WHERE [AuditDataId] = 513 AND [AuditEventId] = 0x0D02 ELSE INSERT INTO [AuditData] ([AuditDataId], [AuditEventId], [Key], [Value], [IsAlert]) VALUES (513, 0x0D02, 'FAIL : Motor Power', 'FAIL : Motor Power', 0)"]
[null,"Audit","POST_RESULT  ","Power On Self Test","FAIL : DPS Module",18,17,"0x0D02","03FF",null,null,null,null,"IF EXISTS(SELECT TOP 1 * FROM [AuditEvent] WHERE [AuditEventId] = 0x0D02) UPDATE [AuditEvent] SET [Key] = 'Power On Self Test', [Value] = 'Power On Self Test', [IsAlert] = 0 WHERE [AuditEventId] = 0x0D02 ELSE INSERT INTO [AuditEvent] ([AuditEventId], [Key], [Value], [IsAlert]) VALUES (0x0D02, 'Power On Self Test', 'Power On Self Test', 0)","IF EXISTS(SELECT TOP 1 * FROM [AuditData] WHERE [AuditDataId] = 1023 AND [AuditEventId] = 0x0D02) UPDATE [AuditData] SET [Key] = 'FAIL : DPS Module', [Value] = 'FAIL : DPS Module', [IsAlert] = 0 WHERE [AuditDataId] = 1023 AND [AuditEventId] = 0x0D02 ELSE INSERT INTO [AuditData] ([AuditDataId], [AuditEventId], [Key], [Value], [IsAlert]) VALUES (1023, 0x0D02, 'FAIL : DPS Module', 'FAIL : DPS Module', 0)"]
[null,"Audit","POST_RESULT  ","Power On Self Test","FAIL : External Memory Check",18,28,"0x0D02","04FF",null,null,null,null,"IF EXISTS(SELECT TOP 1 * FROM [AuditEvent] WHERE [AuditEventId] = 0x0D02) UPDATE [AuditEvent] SET [Key] = 'Power On Self Test', [Value] = 'Power On Self Test', [IsAlert] = 0 WHERE [AuditEventId] = 0x0D02 ELSE INSERT INTO [AuditEvent] ([AuditEventId], [Key], [Value], [IsAlert]) VALUES (0x0D02, 'Power On Self Test', 'Power On Self Test', 0)","IF EXISTS(SELECT TOP 1 * FROM [AuditData] WHERE [AuditDataId] = 1279 AND [AuditEventId] = 0x0D02) UPDATE [AuditData] SET [Key] = 'FAIL : External Memory Check', [Value] = 'FAIL : External Memory Check', [IsAlert] = 0 WHERE [AuditDataId] = 1279 AND [AuditEventId] = 0x0D02 ELSE INSERT INTO [AuditData] ([AuditDataId], [AuditEventId], [Key], [Value], [IsAlert]) VALUES (1279, 0x0D02, 'FAIL : External Memory Check', 'FAIL : External Memory Check', 0)"]
[null,"Audit","POST_RESULT  ","Power On Self Test","FAIL : Battery Health",18,21,"0x0D02","06FF",null,null,null,null,"IF EXISTS(SELECT TOP 1 * FROM [AuditEvent] WHERE [AuditEventId] = 0x0D02) UPDATE [AuditEvent] SET [Key] = 'Power On Self Test', [Value] = 'Power On Self Test', [IsAlert] = 0 WHERE [AuditEventId] = 0x0D02 ELSE INSERT INTO [AuditEvent] ([AuditEventId], [Key], [Value], [IsAlert]) VALUES (0x0D02, 'Power On Self Test', 'Power On Self Test', 0)","IF EXISTS(SELECT TOP 1 * FROM [AuditData] WHERE [AuditDataId] = 1791 AND [AuditEventId] = 0x0D02) UPDATE [AuditData] SET [Key] = 'FAIL : Battery Health', [Value] = 'FAIL : Battery Health', [IsAlert] = 0 WHERE [AuditDataId] = 1791 AND [AuditEventId] = 0x0D02 ELSE INSERT INTO [AuditData] ([AuditDataId], [AuditEventId], [Key], [Value], [IsAlert]) VALUES (1791, 0x0D02, 'FAIL : Battery Health', 'FAIL : Battery Health', 0)"]
[null,"Audit","POST_RESULT  ","Power On Self Test","FAIL : Sleep Current Meas",18,25,"0x0D02","07FF",null,null,null,null,"IF EXISTS(SELECT TOP 1 * FROM [AuditEvent] WHERE [AuditEventId] = 0x0D02) UPDATE [AuditEvent] SET [Key] = 'Power On Self Test', [Value] = 'Power On Self Test', [IsAlert] = 0 WHERE [AuditEventId] = 0x0D02 ELSE INSERT INTO [AuditEvent] ([AuditEventId], [Key], [Value], [IsAlert]) VALUES (0x0D02, 'Power On Self Test', 'Power On Self Test', 0)","IF EXISTS(SELECT TOP 1 * FROM [AuditData] WHERE [AuditDataId] = 2047 AND [AuditEventId] = 0x0D02) UPDATE [AuditData] SET [Key] = 'FAIL : Sleep Current Meas', [Value] = 'FAIL : Sleep Current Meas', [IsAlert] = 0 WHERE [AuditDataId] = 2047 AND [AuditEventId] = 0x0D02 ELSE INSERT INTO [AuditData] ([AuditDataId], [AuditEventId], [Key], [Value], [IsAlert]) VALUES (2047, 0x0D02, 'FAIL : Sleep Current Meas', 'FAIL : Sleep Current Meas', 0)"]
[null,"Audit","POST_RESULT  ","Power On Self Test","FAIL : Lock Configuration Check",18,31,"0x0D02","08FF",null,null,null,null,"IF EXISTS(SELECT TOP 1 * FROM [AuditEvent] WHERE [AuditEventId] = 0x0D02) UPDATE [AuditEvent] SET [Key] = 'Power On Self Test', [Value] = 'Power On Self Test', [IsAlert] = 0 WHERE [AuditEventId] = 0x0D02 ELSE INSERT INTO [AuditEvent] ([AuditEventId], [Key], [Value], [IsAlert]) VALUES (0x0D02, 'Power On Self Test', 'Power On Self Test', 0)","IF EXISTS(SELECT TOP 1 * FROM [AuditData] WHERE [AuditDataId] = 2303 AND [AuditEventId] = 0x0D02) UPDATE [AuditData] SET [Key] = 'FAIL : Lock Configuration Check', [Value] = 'FAIL : Lock Configuration Check', [IsAlert] = 0 WHERE [AuditDataId] = 2303 AND [AuditEventId] = 0x0D02 ELSE INSERT INTO [AuditData] ([AuditDataId], [AuditEventId], [Key], [Value], [IsAlert]) VALUES (2303, 0x0D02, 'FAIL : Lock Configuration Check', 'FAIL : Lock Configuration Check', 0)"]
[null,"Audit","POST_RESULT  ","Power On Self Test","FAIL : Lock State Machine",18,25,"0x0D02","09FF",null,null,null,null,"IF EXISTS(SELECT TOP 1 * FROM [AuditEvent] WHERE [AuditEventId] = 0x0D02) UPDATE [AuditEvent] SET [Key] = 'Power On Self Test', [Value] = 'Power On Self Test', [IsAlert] = 0 WHERE [AuditEventId] = 0x0D02 ELSE INSERT INTO [AuditEvent] ([AuditEventId], [Key], [Value], [IsAlert]) VALUES (0x0D02, 'Power On Self Test', 'Power On Self Test', 0)","IF EXISTS(SELECT TOP 1 * FROM [AuditData] WHERE [AuditDataId] = 2559 AND [AuditEventId] = 0x0D02) UPDATE [AuditData] SET [Key] = 'FAIL : Lock State Machine', [Value] = 'FAIL : Lock State Machine', [IsAlert] = 0 WHERE [AuditDataId] = 2559 AND [AuditEventId] = 0x0D02 ELSE INSERT INTO [AuditData] ([AuditDataId], [AuditEventId], [Key], [Value], [IsAlert]) VALUES (2559, 0x0D02, 'FAIL : Lock State Machine', 'FAIL : Lock State Machine', 0)"]
[null,"Audit","POST_RESULT  ","Power On Self Test","FAIL : Database Integrity",18,25,"0x0D02","0AFF",null,null,null,null,"IF EXISTS(SELECT TOP 1 * FROM [AuditEvent] WHERE [AuditEventId] = 0x0D02) UPDATE [AuditEvent] SET [Key] = 'Power On Self Test', [Value] = 'Power On Self Test', [IsAlert] = 0 WHERE [AuditEventId] = 0x0D02 ELSE INSERT INTO [AuditEvent] ([AuditEventId], [Key], [Value], [IsAlert]) VALUES (0x0D02, 'Power On Self Test', 'Power On Self Test', 0)","IF EXISTS(SELECT TOP 1 * FROM [AuditData] WHERE [AuditDataId] = 2815 AND [AuditEventId] = 0x0D02) UPDATE [AuditData] SET [Key] = 'FAIL : Database Integrity', [Value] = 'FAIL : Database Integrity', [IsAlert] = 0 WHERE [AuditDataId] = 2815 AND [AuditEventId] = 0x0D02 ELSE INSERT INTO [AuditData] ([AuditDataId], [AuditEventId], [Key], [Value], [IsAlert]) VALUES (2815, 0x0D02, 'FAIL : Database Integrity', 'FAIL : Database Integrity', 0)"]
[null,"Audit","POST_RESULT  ","Power On Self Test","FAIL : Wi-Fi Module",18,19,"0x0D02","0BFF",null,null,null,null,"IF EXISTS(SELECT TOP 1 * FROM [AuditEvent] WHERE [AuditEventId] = 0x0D02) UPDATE [AuditEvent] SET [Key] = 'Power On Self Test', [Value] = 'Power On Self Test', [IsAlert] = 0 WHERE [AuditEventId] = 0x0D02 ELSE INSERT INTO [AuditEvent] ([AuditEventId], [Key], [Value], [IsAlert]) VALUES (0x0D02, 'Power On Self Test', 'Power On Self Test', 0)","IF EXISTS(SELECT TOP 1 * FROM [AuditData] WHERE [AuditDataId] = 3071 AND [AuditEventId] = 0x0D02) UPDATE [AuditData] SET [Key] = 'FAIL : Wi-Fi Module', [Value] = 'FAIL : Wi-Fi Module', [IsAlert] = 0 WHERE [AuditDataId] = 3071 AND [AuditEventId] = 0x0D02 ELSE INSERT INTO [AuditData] ([AuditDataId], [AuditEventId], [Key], [Value], [IsAlert]) VALUES (3071, 0x0D02, 'FAIL : Wi-Fi Module', 'FAIL : Wi-Fi Module', 0)"]
[null,"Audit","POST_RESULT  ","Power On Self Test","FAIL: Post Test Results",null,23,"0x0D02","0CFF",null,null,null,null,"IF EXISTS(SELECT TOP 1 * FROM [AuditEvent] WHERE [AuditEventId] = 0x0D02) UPDATE [AuditEvent] SET [Key] = 'Power On Self Test', [Value] = 'Power On Self Test', [IsAlert] = 0 WHERE [AuditEventId] = 0x0D02 ELSE INSERT INTO [AuditEvent] ([AuditEventId], [Key], [Value], [IsAlert]) VALUES (0x0D02, 'Power On Self Test', 'Power On Self Test', 0)","IF EXISTS(SELECT TOP 1 * FROM [AuditData] WHERE [AuditDataId] = 3327 AND [AuditEventId] = 0x0D02) UPDATE [AuditData] SET [Key] = 'FAIL: Post Test Results', [Value] = 'FAIL: Post Test Results', [IsAlert] = 0 WHERE [AuditDataId] = 3327 AND [AuditEventId] = 0x0D02 ELSE INSERT INTO [AuditData] ([AuditDataId], [AuditEventId], [Key], [Value], [IsAlert]) VALUES (3327, 0x0D02, 'FAIL: Post Test Results', 'FAIL: Post Test Results', 0)"]
[null,"Audit","POST_RESULT  ","Power On Self Test","FAIL: Peripheral HW",null,{"$f":"LEN(E535)","v":19},"0x0D02","0DFF",null,null,null,null,"IF EXISTS(SELECT TOP 1 * FROM [AuditEvent] WHERE [AuditEventId] = 0x0D02) UPDATE [AuditEvent] SET [Key] = 'Power On Self Test', [Value] = 'Power On Self Test', [IsAlert] = 0 WHERE [AuditEventId] = 0x0D02 ELSE INSERT INTO [AuditEvent] ([AuditEventId], [Key], [Value], [IsAlert]) VALUES (0x0D02, 'Power On Self Test', 'Power On Self Test', 0)","IF EXISTS(SELECT TOP 1 * FROM [AuditData] WHERE [AuditDataId] = 3583 AND [AuditEventId] = 0x0D02) UPDATE [AuditData] SET [Key] = 'FAIL: Peripheral HW', [Value] = 'FAIL: Peripheral HW', [IsAlert] = 0 WHERE [AuditDataId] = 3583 AND [AuditEventId] = 0x0D02 ELSE INSERT INTO [AuditData] ([AuditDataId], [AuditEventId], [Key], [Value], [IsAlert]) VALUES (3583, 0x0D02, 'FAIL: Peripheral HW', 'FAIL: Peripheral HW', 0)"]
[null,"Audit","POST_RESULT  ","Power On Self Test","FAIL: Ethernet Comms",null,null,"0x0D02","0EFF",null,null,null,null,"IF EXISTS(SELECT TOP 1 * FROM [AuditEvent] WHERE [AuditEventId] = 0x0D02) UPDATE [AuditEvent] SET [Key] = 'Power On Self Test', [Value] = 'Power On Self Test', [IsAlert] = 0 WHERE [AuditEventId] = 0x0D02 ELSE INSERT INTO [AuditEvent] ([AuditEventId], [Key], [Value], [IsAlert]) VALUES (0x0D02, 'Power On Self Test', 'Power On Self Test', 0)","IF EXISTS(SELECT TOP 1 * FROM [AuditData] WHERE [AuditDataId] = 3839 AND [AuditEventId] = 0x0D02) UPDATE [AuditData] SET [Key] = 'FAIL: Ethernet Comms', [Value] = 'FAIL: Ethernet Comms', [IsAlert] = 0 WHERE [AuditDataId] = 3839 AND [AuditEventId] = 0x0D02 ELSE INSERT INTO [AuditData] ([AuditDataId], [AuditEventId], [Key], [Value], [IsAlert]) VALUES (3839, 0x0D02, 'FAIL: Ethernet Comms', 'FAIL: Ethernet Comms', 0)"]
[null,"Audit","POST_RESULT  ","Power On Self Test","Timeout : BLE Module",{"$f":"LEN(D537)","v":18},20,"0x0D02","00FE",null,null,null,null,"IF EXISTS(SELECT TOP 1 * FROM [AuditEvent] WHERE [AuditEventId] = 0x0D02) UPDATE [AuditEvent] SET [Key] = 'Power On Self Test', [Value] = 'Power On Self Test', [IsAlert] = 0 WHERE [AuditEventId] = 0x0D02 ELSE INSERT INTO [AuditEvent] ([AuditEventId], [Key], [Value], [IsAlert]) VALUES (0x0D02, 'Power On Self Test', 'Power On Self Test', 0)","IF EXISTS(SELECT TOP 1 * FROM [AuditData] WHERE [AuditDataId] = 254 AND [AuditEventId] = 0x0D02) UPDATE [AuditData] SET [Key] = 'Timeout : BLE Module', [Value] = 'Timeout : BLE Module', [IsAlert] = 0 WHERE [AuditDataId] = 254 AND [AuditEventId] = 0x0D02 ELSE INSERT INTO [AuditData] ([AuditDataId], [AuditEventId], [Key], [Value], [IsAlert]) VALUES (254, 0x0D02, 'Timeout : BLE Module', 'Timeout : BLE Module', 0)"]
[null,"Audit","POST_RESULT  ","Power On Self Test","Timeout : Reader Comms",18,22,"0x0D02","01FE",null,null,null,null,"IF EXISTS(SELECT TOP 1 * FROM [AuditEvent] WHERE [AuditEventId] = 0x0D02) UPDATE [AuditEvent] SET [Key] = 'Power On Self Test', [Value] = 'Power On Self Test', [IsAlert] = 0 WHERE [AuditEventId] = 0x0D02 ELSE INSERT INTO [AuditEvent] ([AuditEventId], [Key], [Value], [IsAlert]) VALUES (0x0D02, 'Power On Self Test', 'Power On Self Test', 0)","IF EXISTS(SELECT TOP 1 * FROM [AuditData] WHERE [AuditDataId] = 510 AND [AuditEventId] = 0x0D02) UPDATE [AuditData] SET [Key] = 'Timeout : Reader Comms', [Value] = 'Timeout : Reader Comms', [IsAlert] = 0 WHERE [AuditDataId] = 510 AND [AuditEventId] = 0x0D02 ELSE INSERT INTO [AuditData] ([AuditDataId], [AuditEventId], [Key], [Value], [IsAlert]) VALUES (510, 0x0D02, 'Timeout : Reader Comms', 'Timeout : Reader Comms', 0)"]
[null,"Audit","POST_RESULT  ","Power On Self Test","Timeout : UI Alert Module",18,25,"0x0D02","02FE",null,null,null,null,"IF EXISTS(SELECT TOP 1 * FROM [AuditEvent] WHERE [AuditEventId] = 0x0D02) UPDATE [AuditEvent] SET [Key] = 'Power On Self Test', [Value] = 'Power On Self Test', [IsAlert] = 0 WHERE [AuditEventId] = 0x0D02 ELSE INSERT INTO [AuditEvent] ([AuditEventId], [Key], [Value], [IsAlert]) VALUES (0x0D02, 'Power On Self Test', 'Power On Self Test', 0)","IF EXISTS(SELECT TOP 1 * FROM [AuditData] WHERE [AuditDataId] = 766 AND [AuditEventId] = 0x0D02) UPDATE [AuditData] SET [Key] = 'Timeout : UI Alert Module', [Value] = 'Timeout : UI Alert Module', [IsAlert] = 0 WHERE [AuditDataId] = 766 AND [AuditEventId] = 0x0D02 ELSE INSERT INTO [AuditData] ([AuditDataId], [AuditEventId], [Key], [Value], [IsAlert]) VALUES (766, 0x0D02, 'Timeout : UI Alert Module', 'Timeout : UI Alert Module', 0)"]
[null,"Audit","POST_RESULT  ","Power On Self Test","Timeout : DPS Module",18,20,"0x0D02","03FE",null,null,null,null,"IF EXISTS(SELECT TOP 1 * FROM [AuditEvent] WHERE [AuditEventId] = 0x0D02) UPDATE [AuditEvent] SET [Key] = 'Power On Self Test', [Value] = 'Power On Self Test', [IsAlert] = 0 WHERE [AuditEventId] = 0x0D02 ELSE INSERT INTO [AuditEvent] ([AuditEventId], [Key], [Value], [IsAlert]) VALUES (0x0D02, 'Power On Self Test', 'Power On Self Test', 0)","IF EXISTS(SELECT TOP 1 * FROM [AuditData] WHERE [AuditDataId] = 1022 AND [AuditEventId] = 0x0D02) UPDATE [AuditData] SET [Key] = 'Timeout : DPS Module', [Value] = 'Timeout : DPS Module', [IsAlert] = 0 WHERE [AuditDataId] = 1022 AND [AuditEventId] = 0x0D02 ELSE INSERT INTO [AuditData] ([AuditDataId], [AuditEventId], [Key], [Value], [IsAlert]) VALUES (1022, 0x0D02, 'Timeout : DPS Module', 'Timeout : DPS Module', 0)"]
[null,"Audit","POST_RESULT  ","Power On Self Test","Timeout : External Memory Check",18,31,"0x0D02","04FE",null,null,null,null,"IF EXISTS(SELECT TOP 1 * FROM [AuditEvent] WHERE [AuditEventId] = 0x0D02) UPDATE [AuditEvent] SET [Key] = 'Power On Self Test', [Value] = 'Power On Self Test', [IsAlert] = 0 WHERE [AuditEventId] = 0x0D02 ELSE INSERT INTO [AuditEvent] ([AuditEventId], [Key], [Value], [IsAlert]) VALUES (0x0D02, 'Power On Self Test', 'Power On Self Test', 0)","IF EXISTS(SELECT TOP 1 * FROM [AuditData] WHERE [AuditDataId] = 1278 AND [AuditEventId] = 0x0D02) UPDATE [AuditData] SET [Key] = 'Timeout : External Memory Check', [Value] = 'Timeout : External Memory Check', [IsAlert] = 0 WHERE [AuditDataId] = 1278 AND [AuditEventId] = 0x0D02 ELSE INSERT INTO [AuditData] ([AuditDataId], [AuditEventId], [Key], [Value], [IsAlert]) VALUES (1278, 0x0D02, 'Timeout : External Memory Check', 'Timeout : External Memory Check', 0)"]
[null,"Audit","POST_RESULT  ","Power On Self Test","Timeout : Battery Health",18,24,"0x0D02","06FE",null,null,null,null,"IF EXISTS(SELECT TOP 1 * FROM [AuditEvent] WHERE [AuditEventId] = 0x0D02) UPDATE [AuditEvent] SET [Key] = 'Power On Self Test', [Value] = 'Power On Self Test', [IsAlert] = 0 WHERE [AuditEventId] = 0x0D02 ELSE INSERT INTO [AuditEvent] ([AuditEventId], [Key], [Value], [IsAlert]) VALUES (0x0D02, 'Power On Self Test', 'Power On Self Test', 0)","IF EXISTS(SELECT TOP 1 * FROM [AuditData] WHERE [AuditDataId] = 1790 AND [AuditEventId] = 0x0D02) UPDATE [AuditData] SET [Key] = 'Timeout : Battery Health', [Value] = 'Timeout : Battery Health', [IsAlert] = 0 WHERE [AuditDataId] = 1790 AND [AuditEventId] = 0x0D02 ELSE INSERT INTO [AuditData] ([AuditDataId], [AuditEventId], [Key], [Value], [IsAlert]) VALUES (1790, 0x0D02, 'Timeout : Battery Health', 'Timeout : Battery Health', 0)"]
[null,"Audit","POST_RESULT  ","Power On Self Test","Timeout : Sleep Current Meas",18,28,"0x0D02","07FE",null,null,null,null,"IF EXISTS(SELECT TOP 1 * FROM [AuditEvent] WHERE [AuditEventId] = 0x0D02) UPDATE [AuditEvent] SET [Key] = 'Power On Self Test', [Value] = 'Power On Self Test', [IsAlert] = 0 WHERE [AuditEventId] = 0x0D02 ELSE INSERT INTO [AuditEvent] ([AuditEventId], [Key], [Value], [IsAlert]) VALUES (0x0D02, 'Power On Self Test', 'Power On Self Test', 0)","IF EXISTS(SELECT TOP 1 * FROM [AuditData] WHERE [AuditDataId] = 2046 AND [AuditEventId] = 0x0D02) UPDATE [AuditData] SET [Key] = 'Timeout : Sleep Current Meas', [Value] = 'Timeout : Sleep Current Meas', [IsAlert] = 0 WHERE [AuditDataId] = 2046 AND [AuditEventId] = 0x0D02 ELSE INSERT INTO [AuditData] ([AuditDataId], [AuditEventId], [Key], [Value], [IsAlert]) VALUES (2046, 0x0D02, 'Timeout : Sleep Current Meas', 'Timeout : Sleep Current Meas', 0)"]
[null,"Audit","POST_RESULT  ","Power On Self Test","Timeout : Lock Configuration Check",18,34,"0x0D02","08FE",null,null,null,null,"IF EXISTS(SELECT TOP 1 * FROM [AuditEvent] WHERE [AuditEventId] = 0x0D02) UPDATE [AuditEvent] SET [Key] = 'Power On Self Test', [Value] = 'Power On Self Test', [IsAlert] = 0 WHERE [AuditEventId] = 0x0D02 ELSE INSERT INTO [AuditEvent] ([AuditEventId], [Key], [Value], [IsAlert]) VALUES (0x0D02, 'Power On Self Test', 'Power On Self Test', 0)","IF EXISTS(SELECT TOP 1 * FROM [AuditData] WHERE [AuditDataId] = 2302 AND [AuditEventId] = 0x0D02) UPDATE [AuditData] SET [Key] = 'Timeout : Lock Configuration Check', [Value] = 'Timeout : Lock Configuration Check', [IsAlert] = 0 WHERE [AuditDataId] = 2302 AND [AuditEventId] = 0x0D02 ELSE INSERT INTO [AuditData] ([AuditDataId], [AuditEventId], [Key], [Value], [IsAlert]) VALUES (2302, 0x0D02, 'Timeout : Lock Configuration Check', 'Timeout : Lock Configuration Check', 0)"]
[null,"Audit","POST_RESULT  ","Power On Self Test","Timeout : Lock State Machine",18,28,"0x0D02","09FE",null,null,null,null,"IF EXISTS(SELECT TOP 1 * FROM [AuditEvent] WHERE [AuditEventId] = 0x0D02) UPDATE [AuditEvent] SET [Key] = 'Power On Self Test', [Value] = 'Power On Self Test', [IsAlert] = 0 WHERE [AuditEventId] = 0x0D02 ELSE INSERT INTO [AuditEvent] ([AuditEventId], [Key], [Value], [IsAlert]) VALUES (0x0D02, 'Power On Self Test', 'Power On Self Test', 0)",{"$f":"IF(AND(LEFT(H545,2)=\"0x\",ISNUMBER(HEX2DEC(TRIM(I545))*1)),CONCATENATE(\"IF EXISTS(SELECT TOP 1 * FROM [AuditData] WHERE [AuditDataId] = \",HEX2DEC(I545),\" AND [AuditEventId] = \",H545,\") UPDATE [AuditData] SET [Key] = '\",E545,\"', [Value] = '\",E545,\"', [IsAlert] = 0 WHERE [AuditDataId] = \",HEX2DEC(I545),\" AND [AuditEventId] = \",H545,\" ELSE INSERT INTO [AuditData] ([AuditDataId], [AuditEventId], [Key], [Value], [IsAlert]) VALUES (\",HEX2DEC(I545),\", \",H545,\", '\",E545,\"', '\",E545,\"', 0)\"),\"-- no value\")","v":"IF EXISTS(SELECT TOP 1 * FROM [AuditData] WHERE [AuditDataId] = 2558 AND [AuditEventId] = 0x0D02) UPDATE [AuditData] SET [Key] = 'Timeout : Lock State Machine', [Value] = 'Timeout : Lock State Machine', [IsAlert] = 0 WHERE [AuditDataId] = 2558 AND [AuditEventId] = 0x0D02 ELSE INSERT INTO [AuditData] ([AuditDataId], [AuditEventId], [Key], [Value], [IsAlert]) VALUES (2558, 0x0D02, 'Timeout : Lock State Machine', 'Timeout : Lock State Machine', 0)"}]
[null,"Audit","POST_RESULT  ","Power On Self Test","Timeout : Database Integrity",18,28,"0x0D02","0AFE",null,null,null,null,"IF EXISTS(SELECT TOP 1 * FROM [AuditEvent] WHERE [AuditEventId] = 0x0D02) UPDATE [AuditEvent] SET [Key] = 'Power On Self Test', [Value] = 'Power On Self Test', [IsAlert] = 0 WHERE [AuditEventId] = 0x0D02 ELSE INSERT INTO [AuditEvent] ([AuditEventId], [Key], [Value], [IsAlert]) VALUES (0x0D02, 'Power On Self Test', 'Power On Self Test', 0)","IF EXISTS(SELECT TOP 1 * FROM [AuditData] WHERE [AuditDataId] = 2814 AND [AuditEventId] = 0x0D02) UPDATE [AuditData] SET [Key] = 'Timeout : Database Integrity', [Value] = 'Timeout : Database Integrity', [IsAlert] = 0 WHERE [AuditDataId] = 2814 AND [AuditEventId] = 0x0D02 ELSE INSERT INTO [AuditData] ([AuditDataId], [AuditEventId], [Key], [Value], [IsAlert]) VALUES (2814, 0x0D02, 'Timeout : Database Integrity', 'Timeout : Database Integrity', 0)"]
[null,"Audit","POST_RESULT  ","Power On Self Test","Timeout : Wi-Fi Module",18,22,"0x0D02","0BFE",null,null,null,null,"IF EXISTS(SELECT TOP 1 * FROM [AuditEvent] WHERE [AuditEventId] = 0x0D02) UPDATE [AuditEvent] SET [Key] = 'Power On Self Test', [Value] = 'Power On Self Test', [IsAlert] = 0 WHERE [AuditEventId] = 0x0D02 ELSE INSERT INTO [AuditEvent] ([AuditEventId], [Key], [Value], [IsAlert]) VALUES (0x0D02, 'Power On Self Test', 'Power On Self Test', 0)","IF EXISTS(SELECT TOP 1 * FROM [AuditData] WHERE [AuditDataId] = 3070 AND [AuditEventId] = 0x0D02) UPDATE [AuditData] SET [Key] = 'Timeout : Wi-Fi Module', [Value] = 'Timeout : Wi-Fi Module', [IsAlert] = 0 WHERE [AuditDataId] = 3070 AND [AuditEventId] = 0x0D02 ELSE INSERT INTO [AuditData] ([AuditDataId], [AuditEventId], [Key], [Value], [IsAlert]) VALUES (3070, 0x0D02, 'Timeout : Wi-Fi Module', 'Timeout : Wi-Fi Module', 0)"]
[null,"Audit","POST_RESULT  ","Power On Self Test","Timeout : Peripheral HW",{"$f":"LEN(D548)","v":18},{"$f":"LEN(E548)","v":23},"0x0D02","0DFE",null,null,null,null,"IF EXISTS(SELECT TOP 1 * FROM [AuditEvent] WHERE [AuditEventId] = 0x0D02) UPDATE [AuditEvent] SET [Key] = 'Power On Self Test', [Value] = 'Power On Self Test', [IsAlert] = 0 WHERE [AuditEventId] = 0x0D02 ELSE INSERT INTO [AuditEvent] ([AuditEventId], [Key], [Value], [IsAlert]) VALUES (0x0D02, 'Power On Self Test', 'Power On Self Test', 0)","IF EXISTS(SELECT TOP 1 * FROM [AuditData] WHERE [AuditDataId] = 3582 AND [AuditEventId] = 0x0D02) UPDATE [AuditData] SET [Key] = 'Timeout : Peripheral HW', [Value] = 'Timeout : Peripheral HW', [IsAlert] = 0 WHERE [AuditDataId] = 3582 AND [AuditEventId] = 0x0D02 ELSE INSERT INTO [AuditData] ([AuditDataId], [AuditEventId], [Key], [Value], [IsAlert]) VALUES (3582, 0x0D02, 'Timeout : Peripheral HW', 'Timeout : Peripheral HW', 0)"]
[null,"Audit","POST_RESULT  ","Power On Self Test","Timeout : Ethernet Comms",null,null,"0x0D02","0EFE",null,null,null,null,{"$f":"IF(LEFT(H549,2)=\"0x\",CONCATENATE(\"IF EXISTS(SELECT TOP 1 * FROM [AuditEvent] WHERE [AuditEventId] = \",H549,\") UPDATE [AuditEvent] SET [Key] = '\",TRIM(D549),\"', [Value] = '\",TRIM(D549),\"', [IsAlert] = \",IF(B549=\"Audit\",0,1),\" WHERE [AuditEventId] = \",H549,\" ELSE INSERT INTO [AuditEvent] ([AuditEventId], [Key], [Value], [IsAlert]) VALUES (\",H549,\", '\",TRIM(D549),\"', '\",TRIM(D549),\"', \",IF(B549=\"Audit\",0,1), \")\"),\"-- no value\")","v":"IF EXISTS(SELECT TOP 1 * FROM [AuditEvent] WHERE [AuditEventId] = 0x0D02) UPDATE [AuditEvent] SET [Key] = 'Power On Self Test', [Value] = 'Power On Self Test', [IsAlert] = 0 WHERE [AuditEventId] = 0x0D02 ELSE INSERT INTO [AuditEvent] ([AuditEventId], [Key], [Value], [IsAlert]) VALUES (0x0D02, 'Power On Self Test', 'Power On Self Test', 0)"},"IF EXISTS(SELECT TOP 1 * FROM [AuditData] WHERE [AuditDataId] = 3838 AND [AuditEventId] = 0x0D02) UPDATE [AuditData] SET [Key] = 'Timeout : Ethernet Comms', [Value] = 'Timeout : Ethernet Comms', [IsAlert] = 0 WHERE [AuditDataId] = 3838 AND [AuditEventId] = 0x0D02 ELSE INSERT INTO [AuditData] ([AuditDataId], [AuditEventId], [Key], [Value], [IsAlert]) VALUES (3838, 0x0D02, 'Timeout : Ethernet Comms', 'Timeout : Ethernet Comms', 0)"]
[null,"Audit","POST_RESULT  ","Power On Self Test","OK:  Success",18,12,"0x0D02","0500",null,null,null,null,"IF EXISTS(SELECT TOP 1 * FROM [AuditEvent] WHERE [AuditEventId] = 0x0D02) UPDATE [AuditEvent] SET [Key] = 'Power On Self Test', [Value] = 'Power On Self Test', [IsAlert] = 0 WHERE [AuditEventId] = 0x0D02 ELSE INSERT INTO [AuditEvent] ([AuditEventId], [Key], [Value], [IsAlert]) VALUES (0x0D02, 'Power On Self Test', 'Power On Self Test', 0)","IF EXISTS(SELECT TOP 1 * FROM [AuditData] WHERE [AuditDataId] = 1280 AND [AuditEventId] = 0x0D02) UPDATE [AuditData] SET [Key] = 'OK:  Success', [Value] = 'OK:  Success', [IsAlert] = 0 WHERE [AuditDataId] = 1280 AND [AuditEventId] = 0x0D02 ELSE INSERT INTO [AuditData] ([AuditDataId], [AuditEventId], [Key], [Value], [IsAlert]) VALUES (1280, 0x0D02, 'OK:  Success', 'OK:  Success', 0)"]
[null,"Audit","POST_RESULT  ","Power On Self Test","ERROR : RTC Invalid Time Value",18,30,"0x0D02","0501",null,null,null,null,"IF EXISTS(SELECT TOP 1 * FROM [AuditEvent] WHERE [AuditEventId] = 0x0D02) UPDATE [AuditEvent] SET [Key] = 'Power On Self Test', [Value] = 'Power On Self Test', [IsAlert] = 0 WHERE [AuditEventId] = 0x0D02 ELSE INSERT INTO [AuditEvent] ([AuditEventId], [Key], [Value], [IsAlert]) VALUES (0x0D02, 'Power On Self Test', 'Power On Self Test', 0)","IF EXISTS(SELECT TOP 1 * FROM [AuditData] WHERE [AuditDataId] = 1281 AND [AuditEventId] = 0x0D02) UPDATE [AuditData] SET [Key] = 'ERROR : RTC Invalid Time Value', [Value] = 'ERROR : RTC Invalid Time Value', [IsAlert] = 0 WHERE [AuditDataId] = 1281 AND [AuditEventId] = 0x0D02 ELSE INSERT INTO [AuditData] ([AuditDataId], [AuditEventId], [Key], [Value], [IsAlert]) VALUES (1281, 0x0D02, 'ERROR : RTC Invalid Time Value', 'ERROR : RTC Invalid Time Value', 0)"]
[null,"Audit","POST_RESULT  ","Power On Self Test","ERROR : RTC Increment Value",18,27,"0x0D02","0502",null,null,null,null,"IF EXISTS(SELECT TOP 1 * FROM [AuditEvent] WHERE [AuditEventId] = 0x0D02) UPDATE [AuditEvent] SET [Key] = 'Power On Self Test', [Value] = 'Power On Self Test', [IsAlert] = 0 WHERE [AuditEventId] = 0x0D02 ELSE INSERT INTO [AuditEvent] ([AuditEventId], [Key], [Value], [IsAlert]) VALUES (0x0D02, 'Power On Self Test', 'Power On Self Test', 0)","IF EXISTS(SELECT TOP 1 * FROM [AuditData] WHERE [AuditDataId] = 1282 AND [AuditEventId] = 0x0D02) UPDATE [AuditData] SET [Key] = 'ERROR : RTC Increment Value', [Value] = 'ERROR : RTC Increment Value', [IsAlert] = 0 WHERE [AuditDataId] = 1282 AND [AuditEventId] = 0x0D02 ELSE INSERT INTO [AuditData] ([AuditDataId], [AuditEventId], [Key], [Value], [IsAlert]) VALUES (1282, 0x0D02, 'ERROR : RTC Increment Value', 'ERROR : RTC Increment Value', 0)"]
[null,"Audit","POST_RESULT  ","Power On Self Test","Failed: Not Initialized",null,null,"0x0D02","0B01",null,null,null,null,"IF EXISTS(SELECT TOP 1 * FROM [AuditEvent] WHERE [AuditEventId] = 0x0D02) UPDATE [AuditEvent] SET [Key] = 'Power On Self Test', [Value] = 'Power On Self Test', [IsAlert] = 0 WHERE [AuditEventId] = 0x0D02 ELSE INSERT INTO [AuditEvent] ([AuditEventId], [Key], [Value], [IsAlert]) VALUES (0x0D02, 'Power On Self Test', 'Power On Self Test', 0)","IF EXISTS(SELECT TOP 1 * FROM [AuditData] WHERE [AuditDataId] = 2817 AND [AuditEventId] = 0x0D02) UPDATE [AuditData] SET [Key] = 'Failed: Not Initialized', [Value] = 'Failed: Not Initialized', [IsAlert] = 0 WHERE [AuditDataId] = 2817 AND [AuditEventId] = 0x0D02 ELSE INSERT INTO [AuditData] ([AuditDataId], [AuditEventId], [Key], [Value], [IsAlert]) VALUES (2817, 0x0D02, 'Failed: Not Initialized', 'Failed: Not Initialized', 0)"]
[null,"Audit","POST_RESULT  ","Power On Self Test","Failed: Self Test",null,null,"0x0D02","0B02",null,null,null,null,"IF EXISTS(SELECT TOP 1 * FROM [AuditEvent] WHERE [AuditEventId] = 0x0D02) UPDATE [AuditEvent] SET [Key] = 'Power On Self Test', [Value] = 'Power On Self Test', [IsAlert] = 0 WHERE [AuditEventId] = 0x0D02 ELSE INSERT INTO [AuditEvent] ([AuditEventId], [Key], [Value], [IsAlert]) VALUES (0x0D02, 'Power On Self Test', 'Power On Self Test', 0)","IF EXISTS(SELECT TOP 1 * FROM [AuditData] WHERE [AuditDataId] = 2818 AND [AuditEventId] = 0x0D02) UPDATE [AuditData] SET [Key] = 'Failed: Self Test', [Value] = 'Failed: Self Test', [IsAlert] = 0 WHERE [AuditDataId] = 2818 AND [AuditEventId] = 0x0D02 ELSE INSERT INTO [AuditData] ([AuditDataId], [AuditEventId], [Key], [Value], [IsAlert]) VALUES (2818, 0x0D02, 'Failed: Self Test', 'Failed: Self Test', 0)"]
[null,"Audit","POST_RESULT  ","Power On Self Test","Failed: Gyro Sensor Failed",null,null,"0x0D02","0D01",null,null,null,null,"IF EXISTS(SELECT TOP 1 * FROM [AuditEvent] WHERE [AuditEventId] = 0x0D02) UPDATE [AuditEvent] SET [Key] = 'Power On Self Test', [Value] = 'Power On Self Test', [IsAlert] = 0 WHERE [AuditEventId] = 0x0D02 ELSE INSERT INTO [AuditEvent] ([AuditEventId], [Key], [Value], [IsAlert]) VALUES (0x0D02, 'Power On Self Test', 'Power On Self Test', 0)","IF EXISTS(SELECT TOP 1 * FROM [AuditData] WHERE [AuditDataId] = 3329 AND [AuditEventId] = 0x0D02) UPDATE [AuditData] SET [Key] = 'Failed: Gyro Sensor Failed', [Value] = 'Failed: Gyro Sensor Failed', [IsAlert] = 0 WHERE [AuditDataId] = 3329 AND [AuditEventId] = 0x0D02 ELSE INSERT INTO [AuditData] ([AuditDataId], [AuditEventId], [Key], [Value], [IsAlert]) VALUES (3329, 0x0D02, 'Failed: Gyro Sensor Failed', 'Failed: Gyro Sensor Failed', 0)"]
[null,"Audit","POST_RESULT  ","Power On Self Test","Failed: Security Chip Failed",null,null,"0x0D02","0D02",null,null,null,null,"IF EXISTS(SELECT TOP 1 * FROM [AuditEvent] WHERE [AuditEventId] = 0x0D02) UPDATE [AuditEvent] SET [Key] = 'Power On Self Test', [Value] = 'Power On Self Test', [IsAlert] = 0 WHERE [AuditEventId] = 0x0D02 ELSE INSERT INTO [AuditEvent] ([AuditEventId], [Key], [Value], [IsAlert]) VALUES (0x0D02, 'Power On Self Test', 'Power On Self Test', 0)","IF EXISTS(SELECT TOP 1 * FROM [AuditData] WHERE [AuditDataId] = 3330 AND [AuditEventId] = 0x0D02) UPDATE [AuditData] SET [Key] = 'Failed: Security Chip Failed', [Value] = 'Failed: Security Chip Failed', [IsAlert] = 0 WHERE [AuditDataId] = 3330 AND [AuditEventId] = 0x0D02 ELSE INSERT INTO [AuditData] ([AuditDataId], [AuditEventId], [Key], [Value], [IsAlert]) VALUES (3330, 0x0D02, 'Failed: Security Chip Failed', 'Failed: Security Chip Failed', 0)"]
[null,"Audit","POST_RESULT  ","Power On Self Test","Failed: Accelerometer Sensor Failed",null,null,"0x0D02","0D03",null,null,null,null,"IF EXISTS(SELECT TOP 1 * FROM [AuditEvent] WHERE [AuditEventId] = 0x0D02) UPDATE [AuditEvent] SET [Key] = 'Power On Self Test', [Value] = 'Power On Self Test', [IsAlert] = 0 WHERE [AuditEventId] = 0x0D02 ELSE INSERT INTO [AuditEvent] ([AuditEventId], [Key], [Value], [IsAlert]) VALUES (0x0D02, 'Power On Self Test', 'Power On Self Test', 0)","IF EXISTS(SELECT TOP 1 * FROM [AuditData] WHERE [AuditDataId] = 3331 AND [AuditEventId] = 0x0D02) UPDATE [AuditData] SET [Key] = 'Failed: Accelerometer Sensor Failed', [Value] = 'Failed: Accelerometer Sensor Failed', [IsAlert] = 0 WHERE [AuditDataId] = 3331 AND [AuditEventId] = 0x0D02 ELSE INSERT INTO [AuditData] ([AuditDataId], [AuditEventId], [Key], [Value], [IsAlert]) VALUES (3331, 0x0D02, 'Failed: Accelerometer Sensor Failed', 'Failed: Accelerometer Sensor Failed', 0)"]
[null,"Audit","POST_RESULT  ","Power On Self Test","Failed: BLE Credential Failed",null,null,"0x0D02","0D04",null,null,null,null,{"$f":"IF(LEFT(H558,2)=\"0x\",CONCATENATE(\"IF EXISTS(SELECT TOP 1 * FROM [AuditEvent] WHERE [AuditEventId] = \",H558,\") UPDATE [AuditEvent] SET [Key] = '\",TRIM(D558),\"', [Value] = '\",TRIM(D558),\"', [IsAlert] = \",IF(B558=\"Audit\",0,1),\" WHERE [AuditEventId] = \",H558,\" ELSE INSERT INTO [AuditEvent] ([AuditEventId], [Key], [Value], [IsAlert]) VALUES (\",H558,\", '\",TRIM(D558),\"', '\",TRIM(D558),\"', \",IF(B558=\"Audit\",0,1), \")\"),\"-- no value\")","v":"IF EXISTS(SELECT TOP 1 * FROM [AuditEvent] WHERE [AuditEventId] = 0x0D02) UPDATE [AuditEvent] SET [Key] = 'Power On Self Test', [Value] = 'Power On Self Test', [IsAlert] = 0 WHERE [AuditEventId] = 0x0D02 ELSE INSERT INTO [AuditEvent] ([AuditEventId], [Key], [Value], [IsAlert]) VALUES (0x0D02, 'Power On Self Test', 'Power On Self Test', 0)"},"IF EXISTS(SELECT TOP 1 * FROM [AuditData] WHERE [AuditDataId] = 3332 AND [AuditEventId] = 0x0D02) UPDATE [AuditData] SET [Key] = 'Failed: BLE Credential Failed', [Value] = 'Failed: BLE Credential Failed', [IsAlert] = 0 WHERE [AuditDataId] = 3332 AND [AuditEventId] = 0x0D02 ELSE INSERT INTO [AuditData] ([AuditDataId], [AuditEventId], [Key], [Value], [IsAlert]) VALUES (3332, 0x0D02, 'Failed: BLE Credential Failed', 'Failed: BLE Credential Failed', 0)"]
[null,"Audit","POST_RESULT  ","Power On Self Test","Failed: SAM Chip Failed",null,null,"0x0D02","0D05",null,null,null,null,"IF EXISTS(SELECT TOP 1 * FROM [AuditEvent] WHERE [AuditEventId] = 0x0D02) UPDATE [AuditEvent] SET [Key] = 'Power On Self Test', [Value] = 'Power On Self Test', [IsAlert] = 0 WHERE [AuditEventId] = 0x0D02 ELSE INSERT INTO [AuditEvent] ([AuditEventId], [Key], [Value], [IsAlert]) VALUES (0x0D02, 'Power On Self Test', 'Power On Self Test', 0)","IF EXISTS(SELECT TOP 1 * FROM [AuditData] WHERE [AuditDataId] = 3333 AND [AuditEventId] = 0x0D02) UPDATE [AuditData] SET [Key] = 'Failed: SAM Chip Failure', [Value] = 'Failed: SAM Chip Failure', [IsAlert] = 0 WHERE [AuditDataId] = 3333 AND [AuditEventId] = 0x0D02 ELSE INSERT INTO [AuditData] ([AuditDataId], [AuditEventId], [Key], [Value], [IsAlert]) VALUES (3333, 0x0D02, 'Failed: SAM Chip Failure', 'Failed: SAM Chip Failure', 0)"]
[null,"Audit","POST_RESULT  ","Power On Self Test","Failed: 663 Chip Failed",null,null,"0x0D02","0D06",null,null,null,null,"IF EXISTS(SELECT TOP 1 * FROM [AuditEvent] WHERE [AuditEventId] = 0x0D02) UPDATE [AuditEvent] SET [Key] = 'Power On Self Test', [Value] = 'Power On Self Test', [IsAlert] = 0 WHERE [AuditEventId] = 0x0D02 ELSE INSERT INTO [AuditEvent] ([AuditEventId], [Key], [Value], [IsAlert]) VALUES (0x0D02, 'Power On Self Test', 'Power On Self Test', 0)","IF EXISTS(SELECT TOP 1 * FROM [AuditData] WHERE [AuditDataId] = 3334 AND [AuditEventId] = 0x0D02) UPDATE [AuditData] SET [Key] = 'Failed: 663 Chip Failure', [Value] = 'Failed: 663 Chip Failure', [IsAlert] = 0 WHERE [AuditDataId] = 3334 AND [AuditEventId] = 0x0D02 ELSE INSERT INTO [AuditData] ([AuditDataId], [AuditEventId], [Key], [Value], [IsAlert]) VALUES (3334, 0x0D02, 'Failed: 663 Chip Failure', 'Failed: 663 Chip Failure', 0)"]
[null,"Audit","RDR_FALSE_DETECT","Reader Activity","Power Up Counter",null,null,"0x0D03","XXXX","0 to 65535","Number of occurrences",null,null,"IF EXISTS(SELECT TOP 1 * FROM [AuditEvent] WHERE [AuditEventId] = 0x0D03) UPDATE [AuditEvent] SET [Key] = 'Reader Activity', [Value] = 'Reader Activity', [IsAlert] = 0 WHERE [AuditEventId] = 0x0D03 ELSE INSERT INTO [AuditEvent] ([AuditEventId], [Key], [Value], [IsAlert]) VALUES (0x0D03, 'Reader Activity', 'Reader Activity', 0)","-- no value"]
[null,"Audit","RDR_DIAG_INFO_RDR_MODE","Reader Power Mode","Normal Mode",null,null,"0x0D04","0000",null,null,null,null,"IF EXISTS(SELECT TOP 1 * FROM [AuditEvent] WHERE [AuditEventId] = 0x0D04) UPDATE [AuditEvent] SET [Key] = 'Reader Power Mode', [Value] = 'Reader Power Mode', [IsAlert] = 0 WHERE [AuditEventId] = 0x0D04 ELSE INSERT INTO [AuditEvent] ([AuditEventId], [Key], [Value], [IsAlert]) VALUES (0x0D04, 'Reader Power Mode', 'Reader Power Mode', 0)","IF EXISTS(SELECT TOP 1 * FROM [AuditData] WHERE [AuditDataId] = 0 AND [AuditEventId] = 0x0D04) UPDATE [AuditData] SET [Key] = 'Normal Mode', [Value] = 'Normal Mode', [IsAlert] = 0 WHERE [AuditDataId] = 0 AND [AuditEventId] = 0x0D04 ELSE INSERT INTO [AuditData] ([AuditDataId], [AuditEventId], [Key], [Value], [IsAlert]) VALUES (0, 0x0D04, 'Normal Mode', 'Normal Mode', 0)"]
[null,"Audit","RDR_DIAG_INFO_RDR_MODE","Reader Power Mode","TSI disabled",null,null,"0x0D04","0001",null,null,null,null,"IF EXISTS(SELECT TOP 1 * FROM [AuditEvent] WHERE [AuditEventId] = 0x0D04) UPDATE [AuditEvent] SET [Key] = 'Reader Power Mode', [Value] = 'Reader Power Mode', [IsAlert] = 0 WHERE [AuditEventId] = 0x0D04 ELSE INSERT INTO [AuditEvent] ([AuditEventId], [Key], [Value], [IsAlert]) VALUES (0x0D04, 'Reader Power Mode', 'Reader Power Mode', 0)","IF EXISTS(SELECT TOP 1 * FROM [AuditData] WHERE [AuditDataId] = 1 AND [AuditEventId] = 0x0D04) UPDATE [AuditData] SET [Key] = 'TSI disabled', [Value] = 'TSI disabled', [IsAlert] = 0 WHERE [AuditDataId] = 1 AND [AuditEventId] = 0x0D04 ELSE INSERT INTO [AuditData] ([AuditDataId], [AuditEventId], [Key], [Value], [IsAlert]) VALUES (1, 0x0D04, 'TSI disabled', 'TSI disabled', 0)"]
[null,"Audit","RDR_DIAG_INFO_RDR_MODE","Reader Power Mode","HF disabled",null,null,"0x0D04","0002",null,null,null,null,"IF EXISTS(SELECT TOP 1 * FROM [AuditEvent] WHERE [AuditEventId] = 0x0D04) UPDATE [AuditEvent] SET [Key] = 'Reader Power Mode', [Value] = 'Reader Power Mode', [IsAlert] = 0 WHERE [AuditEventId] = 0x0D04 ELSE INSERT INTO [AuditEvent] ([AuditEventId], [Key], [Value], [IsAlert]) VALUES (0x0D04, 'Reader Power Mode', 'Reader Power Mode', 0)","IF EXISTS(SELECT TOP 1 * FROM [AuditData] WHERE [AuditDataId] = 2 AND [AuditEventId] = 0x0D04) UPDATE [AuditData] SET [Key] = 'HF disabled', [Value] = 'HF disabled', [IsAlert] = 0 WHERE [AuditDataId] = 2 AND [AuditEventId] = 0x0D04 ELSE INSERT INTO [AuditData] ([AuditDataId], [AuditEventId], [Key], [Value], [IsAlert]) VALUES (2, 0x0D04, 'HF disabled', 'HF disabled', 0)"]
[null,"Audit","RDR_DIAG_INFO_RDR_MODE","Reader Power Mode","TSI, HF disabled",null,null,"0x0D04","0003",null,null,null,null,"IF EXISTS(SELECT TOP 1 * FROM [AuditEvent] WHERE [AuditEventId] = 0x0D04) UPDATE [AuditEvent] SET [Key] = 'Reader Power Mode', [Value] = 'Reader Power Mode', [IsAlert] = 0 WHERE [AuditEventId] = 0x0D04 ELSE INSERT INTO [AuditEvent] ([AuditEventId], [Key], [Value], [IsAlert]) VALUES (0x0D04, 'Reader Power Mode', 'Reader Power Mode', 0)","IF EXISTS(SELECT TOP 1 * FROM [AuditData] WHERE [AuditDataId] = 3 AND [AuditEventId] = 0x0D04) UPDATE [AuditData] SET [Key] = 'TSI, HF disabled', [Value] = 'TSI, HF disabled', [IsAlert] = 0 WHERE [AuditDataId] = 3 AND [AuditEventId] = 0x0D04 ELSE INSERT INTO [AuditData] ([AuditDataId], [AuditEventId], [Key], [Value], [IsAlert]) VALUES (3, 0x0D04, 'TSI, HF disabled', 'TSI, HF disabled', 0)"]
[null,"Audit","RDR_DIAG_INFO_RDR_MODE","Reader Power Mode","FSK disabled",null,null,"0x0D04","0004",null,null,null,null,"IF EXISTS(SELECT TOP 1 * FROM [AuditEvent] WHERE [AuditEventId] = 0x0D04) UPDATE [AuditEvent] SET [Key] = 'Reader Power Mode', [Value] = 'Reader Power Mode', [IsAlert] = 0 WHERE [AuditEventId] = 0x0D04 ELSE INSERT INTO [AuditEvent] ([AuditEventId], [Key], [Value], [IsAlert]) VALUES (0x0D04, 'Reader Power Mode', 'Reader Power Mode', 0)","IF EXISTS(SELECT TOP 1 * FROM [AuditData] WHERE [AuditDataId] = 4 AND [AuditEventId] = 0x0D04) UPDATE [AuditData] SET [Key] = 'FSK disabled', [Value] = 'FSK disabled', [IsAlert] = 0 WHERE [AuditDataId] = 4 AND [AuditEventId] = 0x0D04 ELSE INSERT INTO [AuditData] ([AuditDataId], [AuditEventId], [Key], [Value], [IsAlert]) VALUES (4, 0x0D04, 'FSK disabled', 'FSK disabled', 0)"]
[null,"Audit","RDR_DIAG_INFO_RDR_MODE","Reader Power Mode","FSK, TSI disabled",null,null,"0x0D04","0005",null,null,null,null,"IF EXISTS(SELECT TOP 1 * FROM [AuditEvent] WHERE [AuditEventId] = 0x0D04) UPDATE [AuditEvent] SET [Key] = 'Reader Power Mode', [Value] = 'Reader Power Mode', [IsAlert] = 0 WHERE [AuditEventId] = 0x0D04 ELSE INSERT INTO [AuditEvent] ([AuditEventId], [Key], [Value], [IsAlert]) VALUES (0x0D04, 'Reader Power Mode', 'Reader Power Mode', 0)","IF EXISTS(SELECT TOP 1 * FROM [AuditData] WHERE [AuditDataId] = 5 AND [AuditEventId] = 0x0D04) UPDATE [AuditData] SET [Key] = 'FSK, TSI disabled', [Value] = 'FSK, TSI disabled', [IsAlert] = 0 WHERE [AuditDataId] = 5 AND [AuditEventId] = 0x0D04 ELSE INSERT INTO [AuditData] ([AuditDataId], [AuditEventId], [Key], [Value], [IsAlert]) VALUES (5, 0x0D04, 'FSK, TSI disabled', 'FSK, TSI disabled', 0)"]
[null,"Audit","RDR_DIAG_INFO_RDR_MODE","Reader Power Mode","FSK, HF disabled",null,null,"0x0D04","0006",null,null,null,null,"IF EXISTS(SELECT TOP 1 * FROM [AuditEvent] WHERE [AuditEventId] = 0x0D04) UPDATE [AuditEvent] SET [Key] = 'Reader Power Mode', [Value] = 'Reader Power Mode', [IsAlert] = 0 WHERE [AuditEventId] = 0x0D04 ELSE INSERT INTO [AuditEvent] ([AuditEventId], [Key], [Value], [IsAlert]) VALUES (0x0D04, 'Reader Power Mode', 'Reader Power Mode', 0)","IF EXISTS(SELECT TOP 1 * FROM [AuditData] WHERE [AuditDataId] = 6 AND [AuditEventId] = 0x0D04) UPDATE [AuditData] SET [Key] = 'FSK, HF disabled', [Value] = 'FSK, HF disabled', [IsAlert] = 0 WHERE [AuditDataId] = 6 AND [AuditEventId] = 0x0D04 ELSE INSERT INTO [AuditData] ([AuditDataId], [AuditEventId], [Key], [Value], [IsAlert]) VALUES (6, 0x0D04, 'FSK, HF disabled', 'FSK, HF disabled', 0)"]
[null,"Audit","RDR_DIAG_INFO_RDR_MODE","Reader Power Mode","FSK, HF, TSI disabled",null,null,"0x0D04","0007",null,null,null,null,"IF EXISTS(SELECT TOP 1 * FROM [AuditEvent] WHERE [AuditEventId] = 0x0D04) UPDATE [AuditEvent] SET [Key] = 'Reader Power Mode', [Value] = 'Reader Power Mode', [IsAlert] = 0 WHERE [AuditEventId] = 0x0D04 ELSE INSERT INTO [AuditEvent] ([AuditEventId], [Key], [Value], [IsAlert]) VALUES (0x0D04, 'Reader Power Mode', 'Reader Power Mode', 0)","IF EXISTS(SELECT TOP 1 * FROM [AuditData] WHERE [AuditDataId] = 7 AND [AuditEventId] = 0x0D04) UPDATE [AuditData] SET [Key] = 'FSK, HF, TSI disabled', [Value] = 'FSK, HF, TSI disabled', [IsAlert] = 0 WHERE [AuditDataId] = 7 AND [AuditEventId] = 0x0D04 ELSE INSERT INTO [AuditData] ([AuditDataId], [AuditEventId], [Key], [Value], [IsAlert]) VALUES (7, 0x0D04, 'FSK, HF, TSI disabled', 'FSK, HF, TSI disabled', 0)"]
[null,"Audit","RDR_DIAG_INFO_RDR_MODE","Reader Power Mode","ASK disabled",null,null,"0x0D04","0008",null,null,null,null,"IF EXISTS(SELECT TOP 1 * FROM [AuditEvent] WHERE [AuditEventId] = 0x0D04) UPDATE [AuditEvent] SET [Key] = 'Reader Power Mode', [Value] = 'Reader Power Mode', [IsAlert] = 0 WHERE [AuditEventId] = 0x0D04 ELSE INSERT INTO [AuditEvent] ([AuditEventId], [Key], [Value], [IsAlert]) VALUES (0x0D04, 'Reader Power Mode', 'Reader Power Mode', 0)","IF EXISTS(SELECT TOP 1 * FROM [AuditData] WHERE [AuditDataId] = 8 AND [AuditEventId] = 0x0D04) UPDATE [AuditData] SET [Key] = 'ASK disabled', [Value] = 'ASK disabled', [IsAlert] = 0 WHERE [AuditDataId] = 8 AND [AuditEventId] = 0x0D04 ELSE INSERT INTO [AuditData] ([AuditDataId], [AuditEventId], [Key], [Value], [IsAlert]) VALUES (8, 0x0D04, 'ASK disabled', 'ASK disabled', 0)"]
[null,"Audit","RDR_DIAG_INFO_RDR_MODE","Reader Power Mode","ASK, TSI disabled",null,null,"0x0D04","0009",null,null,null,null,"IF EXISTS(SELECT TOP 1 * FROM [AuditEvent] WHERE [AuditEventId] = 0x0D04) UPDATE [AuditEvent] SET [Key] = 'Reader Power Mode', [Value] = 'Reader Power Mode', [IsAlert] = 0 WHERE [AuditEventId] = 0x0D04 ELSE INSERT INTO [AuditEvent] ([AuditEventId], [Key], [Value], [IsAlert]) VALUES (0x0D04, 'Reader Power Mode', 'Reader Power Mode', 0)","IF EXISTS(SELECT TOP 1 * FROM [AuditData] WHERE [AuditDataId] = 9 AND [AuditEventId] = 0x0D04) UPDATE [AuditData] SET [Key] = 'ASK, TSI disabled', [Value] = 'ASK, TSI disabled', [IsAlert] = 0 WHERE [AuditDataId] = 9 AND [AuditEventId] = 0x0D04 ELSE INSERT INTO [AuditData] ([AuditDataId], [AuditEventId], [Key], [Value], [IsAlert]) VALUES (9, 0x0D04, 'ASK, TSI disabled', 'ASK, TSI disabled', 0)"]
[null,"Audit","RDR_DIAG_INFO_RDR_MODE","Reader Power Mode","ASK, HF disabled",null,null,"0x0D04","000A",null,null,null,null,"IF EXISTS(SELECT TOP 1 * FROM [AuditEvent] WHERE [AuditEventId] = 0x0D04) UPDATE [AuditEvent] SET [Key] = 'Reader Power Mode', [Value] = 'Reader Power Mode', [IsAlert] = 0 WHERE [AuditEventId] = 0x0D04 ELSE INSERT INTO [AuditEvent] ([AuditEventId], [Key], [Value], [IsAlert]) VALUES (0x0D04, 'Reader Power Mode', 'Reader Power Mode', 0)","IF EXISTS(SELECT TOP 1 * FROM [AuditData] WHERE [AuditDataId] = 10 AND [AuditEventId] = 0x0D04) UPDATE [AuditData] SET [Key] = 'ASK, HF disabled', [Value] = 'ASK, HF disabled', [IsAlert] = 0 WHERE [AuditDataId] = 10 AND [AuditEventId] = 0x0D04 ELSE INSERT INTO [AuditData] ([AuditDataId], [AuditEventId], [Key], [Value], [IsAlert]) VALUES (10, 0x0D04, 'ASK, HF disabled', 'ASK, HF disabled', 0)"]
[null,"Audit","RDR_DIAG_INFO_RDR_MODE","Reader Power Mode","ASK, HF, TSI disabled",null,null,"0x0D04","000B",null,null,null,null,"IF EXISTS(SELECT TOP 1 * FROM [AuditEvent] WHERE [AuditEventId] = 0x0D04) UPDATE [AuditEvent] SET [Key] = 'Reader Power Mode', [Value] = 'Reader Power Mode', [IsAlert] = 0 WHERE [AuditEventId] = 0x0D04 ELSE INSERT INTO [AuditEvent] ([AuditEventId], [Key], [Value], [IsAlert]) VALUES (0x0D04, 'Reader Power Mode', 'Reader Power Mode', 0)","IF EXISTS(SELECT TOP 1 * FROM [AuditData] WHERE [AuditDataId] = 11 AND [AuditEventId] = 0x0D04) UPDATE [AuditData] SET [Key] = 'ASK, HF, TSI disabled', [Value] = 'ASK, HF, TSI disabled', [IsAlert] = 0 WHERE [AuditDataId] = 11 AND [AuditEventId] = 0x0D04 ELSE INSERT INTO [AuditData] ([AuditDataId], [AuditEventId], [Key], [Value], [IsAlert]) VALUES (11, 0x0D04, 'ASK, HF, TSI disabled', 'ASK, HF, TSI disabled', 0)"]
[null,"Audit","RDR_DIAG_INFO_RDR_MODE","Reader Power Mode"," ASK, FSK disabled",null,null,"0x0D04","000C",null,null,null,null,"IF EXISTS(SELECT TOP 1 * FROM [AuditEvent] WHERE [AuditEventId] = 0x0D04) UPDATE [AuditEvent] SET [Key] = 'Reader Power Mode', [Value] = 'Reader Power Mode', [IsAlert] = 0 WHERE [AuditEventId] = 0x0D04 ELSE INSERT INTO [AuditEvent] ([AuditEventId], [Key], [Value], [IsAlert]) VALUES (0x0D04, 'Reader Power Mode', 'Reader Power Mode', 0)","IF EXISTS(SELECT TOP 1 * FROM [AuditData] WHERE [AuditDataId] = 12 AND [AuditEventId] = 0x0D04) UPDATE [AuditData] SET [Key] = ' ASK, FSK disabled', [Value] = ' ASK, FSK disabled', [IsAlert] = 0 WHERE [AuditDataId] = 12 AND [AuditEventId] = 0x0D04 ELSE INSERT INTO [AuditData] ([AuditDataId], [AuditEventId], [Key], [Value], [IsAlert]) VALUES (12, 0x0D04, ' ASK, FSK disabled', ' ASK, FSK disabled', 0)"]
[null,"Audit","RDR_DIAG_INFO_RDR_MODE","Reader Power Mode","ASK, FSK, TSI disabled",null,null,"0x0D04","000D",null,null,null,null,"IF EXISTS(SELECT TOP 1 * FROM [AuditEvent] WHERE [AuditEventId] = 0x0D04) UPDATE [AuditEvent] SET [Key] = 'Reader Power Mode', [Value] = 'Reader Power Mode', [IsAlert] = 0 WHERE [AuditEventId] = 0x0D04 ELSE INSERT INTO [AuditEvent] ([AuditEventId], [Key], [Value], [IsAlert]) VALUES (0x0D04, 'Reader Power Mode', 'Reader Power Mode', 0)","IF EXISTS(SELECT TOP 1 * FROM [AuditData] WHERE [AuditDataId] = 13 AND [AuditEventId] = 0x0D04) UPDATE [AuditData] SET [Key] = 'ASK, FSK, TSI disabled', [Value] = 'ASK, FSK, TSI disabled', [IsAlert] = 0 WHERE [AuditDataId] = 13 AND [AuditEventId] = 0x0D04 ELSE INSERT INTO [AuditData] ([AuditDataId], [AuditEventId], [Key], [Value], [IsAlert]) VALUES (13, 0x0D04, 'ASK, FSK, TSI disabled', 'ASK, FSK, TSI disabled', 0)"]
[null,"Audit","RDR_DIAG_INFO_RDR_MODE","Reader Power Mode","ASK, FSK, HF disabled",null,null,"0x0D04","000E",null,null,null,null,"IF EXISTS(SELECT TOP 1 * FROM [AuditEvent] WHERE [AuditEventId] = 0x0D04) UPDATE [AuditEvent] SET [Key] = 'Reader Power Mode', [Value] = 'Reader Power Mode', [IsAlert] = 0 WHERE [AuditEventId] = 0x0D04 ELSE INSERT INTO [AuditEvent] ([AuditEventId], [Key], [Value], [IsAlert]) VALUES (0x0D04, 'Reader Power Mode', 'Reader Power Mode', 0)","IF EXISTS(SELECT TOP 1 * FROM [AuditData] WHERE [AuditDataId] = 14 AND [AuditEventId] = 0x0D04) UPDATE [AuditData] SET [Key] = 'ASK, FSK, HF disabled', [Value] = 'ASK, FSK, HF disabled', [IsAlert] = 0 WHERE [AuditDataId] = 14 AND [AuditEventId] = 0x0D04 ELSE INSERT INTO [AuditData] ([AuditDataId], [AuditEventId], [Key], [Value], [IsAlert]) VALUES (14, 0x0D04, 'ASK, FSK, HF disabled', 'ASK, FSK, HF disabled', 0)"]
[null,"Audit","RDR_DIAG_INFO_RDR_MODE","Reader Power Mode","Standby Mode",null,null,"0x0D04","000F",null,null,null,null,"IF EXISTS(SELECT TOP 1 * FROM [AuditEvent] WHERE [AuditEventId] = 0x0D04) UPDATE [AuditEvent] SET [Key] = 'Reader Power Mode', [Value] = 'Reader Power Mode', [IsAlert] = 0 WHERE [AuditEventId] = 0x0D04 ELSE INSERT INTO [AuditEvent] ([AuditEventId], [Key], [Value], [IsAlert]) VALUES (0x0D04, 'Reader Power Mode', 'Reader Power Mode', 0)","IF EXISTS(SELECT TOP 1 * FROM [AuditData] WHERE [AuditDataId] = 15 AND [AuditEventId] = 0x0D04) UPDATE [AuditData] SET [Key] = 'Standby Mode', [Value] = 'Standby Mode', [IsAlert] = 0 WHERE [AuditDataId] = 15 AND [AuditEventId] = 0x0D04 ELSE INSERT INTO [AuditData] ([AuditDataId], [AuditEventId], [Key], [Value], [IsAlert]) VALUES (15, 0x0D04, 'Standby Mode', 'Standby Mode', 0)"]
[null,null,null,null,null,null,null,null,null,null,null,null,null,"-- no value","-- no value"]
[null,"Audit","RDR_DIAG_INFO_READING_STATE","Reader State","Idle",null,null,"0x0D05","0000",null,null,null,null,"IF EXISTS(SELECT TOP 1 * FROM [AuditEvent] WHERE [AuditEventId] = 0x0D05) UPDATE [AuditEvent] SET [Key] = 'Reader State', [Value] = 'Reader State', [IsAlert] = 0 WHERE [AuditEventId] = 0x0D05 ELSE INSERT INTO [AuditEvent] ([AuditEventId], [Key], [Value], [IsAlert]) VALUES (0x0D05, 'Reader State', 'Reader State', 0)","IF EXISTS(SELECT TOP 1 * FROM [AuditData] WHERE [AuditDataId] = 0 AND [AuditEventId] = 0x0D05) UPDATE [AuditData] SET [Key] = 'Idle', [Value] = 'Idle', [IsAlert] = 0 WHERE [AuditDataId] = 0 AND [AuditEventId] = 0x0D05 ELSE INSERT INTO [AuditData] ([AuditDataId], [AuditEventId], [Key], [Value], [IsAlert]) VALUES (0, 0x0D05, 'Idle', 'Idle', 0)"]
[null,"Audit","RDR_DIAG_INFO_READING_STATE","Reader State","Trying to Read",null,null,"0x0D05","0001",null,null,null,null,"IF EXISTS(SELECT TOP 1 * FROM [AuditEvent] WHERE [AuditEventId] = 0x0D05) UPDATE [AuditEvent] SET [Key] = 'Reader State', [Value] = 'Reader State', [IsAlert] = 0 WHERE [AuditEventId] = 0x0D05 ELSE INSERT INTO [AuditEvent] ([AuditEventId], [Key], [Value], [IsAlert]) VALUES (0x0D05, 'Reader State', 'Reader State', 0)","IF EXISTS(SELECT TOP 1 * FROM [AuditData] WHERE [AuditDataId] = 1 AND [AuditEventId] = 0x0D05) UPDATE [AuditData] SET [Key] = 'Trying to Read', [Value] = 'Trying to Read', [IsAlert] = 0 WHERE [AuditDataId] = 1 AND [AuditEventId] = 0x0D05 ELSE INSERT INTO [AuditData] ([AuditDataId], [AuditEventId], [Key], [Value], [IsAlert]) VALUES (1, 0x0D05, 'Trying to Read', 'Trying to Read', 0)"]
[null,"Audit","RDR_DIAG_INFO_READING_STATE","Reader State","Waiting for Withdrawal",null,null,"0x0D05","0002",null,null,null,null,"IF EXISTS(SELECT TOP 1 * FROM [AuditEvent] WHERE [AuditEventId] = 0x0D05) UPDATE [AuditEvent] SET [Key] = 'Reader State', [Value] = 'Reader State', [IsAlert] = 0 WHERE [AuditEventId] = 0x0D05 ELSE INSERT INTO [AuditEvent] ([AuditEventId], [Key], [Value], [IsAlert]) VALUES (0x0D05, 'Reader State', 'Reader State', 0)","IF EXISTS(SELECT TOP 1 * FROM [AuditData] WHERE [AuditDataId] = 2 AND [AuditEventId] = 0x0D05) UPDATE [AuditData] SET [Key] = 'Waiting for Withdrawal', [Value] = 'Waiting for Withdrawal', [IsAlert] = 0 WHERE [AuditDataId] = 2 AND [AuditEventId] = 0x0D05 ELSE INSERT INTO [AuditData] ([AuditDataId], [AuditEventId], [Key], [Value], [IsAlert]) VALUES (2, 0x0D05, 'Waiting for Withdrawal', 'Waiting for Withdrawal', 0)"]
[null,"Audit","RDR_DIAG_INFO_READING_STATE","Reader State","Waiting for Stable Baseline",null,null,"0x0D05","0003",null,null,null,null,"IF EXISTS(SELECT TOP 1 * FROM [AuditEvent] WHERE [AuditEventId] = 0x0D05) UPDATE [AuditEvent] SET [Key] = 'Reader State', [Value] = 'Reader State', [IsAlert] = 0 WHERE [AuditEventId] = 0x0D05 ELSE INSERT INTO [AuditEvent] ([AuditEventId], [Key], [Value], [IsAlert]) VALUES (0x0D05, 'Reader State', 'Reader State', 0)","IF EXISTS(SELECT TOP 1 * FROM [AuditData] WHERE [AuditDataId] = 3 AND [AuditEventId] = 0x0D05) UPDATE [AuditData] SET [Key] = 'Waiting for Stable Baseline', [Value] = 'Waiting for Stable Baseline', [IsAlert] = 0 WHERE [AuditDataId] = 3 AND [AuditEventId] = 0x0D05 ELSE INSERT INTO [AuditData] ([AuditDataId], [AuditEventId], [Key], [Value], [IsAlert]) VALUES (3, 0x0D05, 'Waiting for Stable Baseline', 'Waiting for Stable Baseline', 0)"]
[null,null,null,null,null,null,null,null,null,null,null,null,null,"-- no value","-- no value"]
[null,"Audit","RDR_DIAG_INFO_NUM_SAMPLES","N- Samples","xxxx",null,null,"0x0D06","xxxx","6 to 32",null,null,null,"IF EXISTS(SELECT TOP 1 * FROM [AuditEvent] WHERE [AuditEventId] = 0x0D06) UPDATE [AuditEvent] SET [Key] = 'N- Samples', [Value] = 'N- Samples', [IsAlert] = 0 WHERE [AuditEventId] = 0x0D06 ELSE INSERT INTO [AuditEvent] ([AuditEventId], [Key], [Value], [IsAlert]) VALUES (0x0D06, 'N- Samples', 'N- Samples', 0)","-- no value"]
[null,"Audit","RDR_DIAG_INFO_CAP_SENSE_DELTA","Delta","xxxx",null,null,"0x0D07","xxxx","0 to 65535","Number of occurrences",null,null,"IF EXISTS(SELECT TOP 1 * FROM [AuditEvent] WHERE [AuditEventId] = 0x0D07) UPDATE [AuditEvent] SET [Key] = 'Delta', [Value] = 'Delta', [IsAlert] = 0 WHERE [AuditEventId] = 0x0D07 ELSE INSERT INTO [AuditEvent] ([AuditEventId], [Key], [Value], [IsAlert]) VALUES (0x0D07, 'Delta', 'Delta', 0)","-- no value"]
[null,"Audit","RDR_DIAG_INFO_OLD_FALSE_DETECT_NUM","Old False Detect","xxxx",null,null,"0x0D08","xxxx","0 to 65535","Number of occurrences",null,null,"IF EXISTS(SELECT TOP 1 * FROM [AuditEvent] WHERE [AuditEventId] = 0x0D08) UPDATE [AuditEvent] SET [Key] = 'Old False Detect', [Value] = 'Old False Detect', [IsAlert] = 0 WHERE [AuditEventId] = 0x0D08 ELSE INSERT INTO [AuditEvent] ([AuditEventId], [Key], [Value], [IsAlert]) VALUES (0x0D08, 'Old False Detect', 'Old False Detect', 0)","-- no value"]
[null,"Audit","RDR_DIAG_INFO_NEW_FALSE_DETECT_NUM","New False Detect","xxxx",null,null,"0x0D09","xxxx","0 to 65535","Number of occurrences",null,null,"IF EXISTS(SELECT TOP 1 * FROM [AuditEvent] WHERE [AuditEventId] = 0x0D09) UPDATE [AuditEvent] SET [Key] = 'New False Detect', [Value] = 'New False Detect', [IsAlert] = 0 WHERE [AuditEventId] = 0x0D09 ELSE INSERT INTO [AuditEvent] ([AuditEventId], [Key], [Value], [IsAlert]) VALUES (0x0D09, 'New False Detect', 'New False Detect', 0)","-- no value"]
[null,"Audit","RDR_DIAG_INFO_BASELINE_MSB","Baseline - Upper","xxxx",null,null,"0x0D0A","xxxx","0 to 65535","Number of occurrences",null,null,"IF EXISTS(SELECT TOP 1 * FROM [AuditEvent] WHERE [AuditEventId] = 0x0D0A) UPDATE [AuditEvent] SET [Key] = 'Baseline - Upper', [Value] = 'Baseline - Upper', [IsAlert] = 0 WHERE [AuditEventId] = 0x0D0A ELSE INSERT INTO [AuditEvent] ([AuditEventId], [Key], [Value], [IsAlert]) VALUES (0x0D0A, 'Baseline - Upper', 'Baseline - Upper', 0)","-- no value"]
[null,"Audit","RDR_DIAG_INFO_BASELINE_LSB","Baseline - Lower","xxxx",null,null,"0x0D0B","xxxx","0 to 65535","Number of occurrences",null,null,"IF EXISTS(SELECT TOP 1 * FROM [AuditEvent] WHERE [AuditEventId] = 0x0D0B) UPDATE [AuditEvent] SET [Key] = 'Baseline - Lower', [Value] = 'Baseline - Lower', [IsAlert] = 0 WHERE [AuditEventId] = 0x0D0B ELSE INSERT INTO [AuditEvent] ([AuditEventId], [Key], [Value], [IsAlert]) VALUES (0x0D0B, 'Baseline - Lower', 'Baseline - Lower', 0)","-- no value"]
[null,null,null,null,null,null,null,null,null,null,null,null,null,"-- no value","-- no value"]
[null,"Audit","NWAKE_PROTOCOL_ERROR","Inter Board Error","nWake assert ",null,null,"0x0D0C","0001",null,null,null,null,"IF EXISTS(SELECT TOP 1 * FROM [AuditEvent] WHERE [AuditEventId] = 0x0D0C) UPDATE [AuditEvent] SET [Key] = 'Inter Board Error', [Value] = 'Inter Board Error', [IsAlert] = 0 WHERE [AuditEventId] = 0x0D0C ELSE INSERT INTO [AuditEvent] ([AuditEventId], [Key], [Value], [IsAlert]) VALUES (0x0D0C, 'Inter Board Error', 'Inter Board Error', 0)","IF EXISTS(SELECT TOP 1 * FROM [AuditData] WHERE [AuditDataId] = 1 AND [AuditEventId] = 0x0D0C) UPDATE [AuditData] SET [Key] = 'nWake assert ', [Value] = 'nWake assert ', [IsAlert] = 0 WHERE [AuditDataId] = 1 AND [AuditEventId] = 0x0D0C ELSE INSERT INTO [AuditData] ([AuditDataId], [AuditEventId], [Key], [Value], [IsAlert]) VALUES (1, 0x0D0C, 'nWake assert ', 'nWake assert ', 0)"]
[null,"Audit","NWAKE_PROTOCOL_ERROR","Inter Board Error","nWake deassert ",null,null,"0x0D0C","0002",null,null,null,null,"IF EXISTS(SELECT TOP 1 * FROM [AuditEvent] WHERE [AuditEventId] = 0x0D0C) UPDATE [AuditEvent] SET [Key] = 'Inter Board Error', [Value] = 'Inter Board Error', [IsAlert] = 0 WHERE [AuditEventId] = 0x0D0C ELSE INSERT INTO [AuditEvent] ([AuditEventId], [Key], [Value], [IsAlert]) VALUES (0x0D0C, 'Inter Board Error', 'Inter Board Error', 0)","IF EXISTS(SELECT TOP 1 * FROM [AuditData] WHERE [AuditDataId] = 2 AND [AuditEventId] = 0x0D0C) UPDATE [AuditData] SET [Key] = 'nWake deassert ', [Value] = 'nWake deassert ', [IsAlert] = 0 WHERE [AuditDataId] = 2 AND [AuditEventId] = 0x0D0C ELSE INSERT INTO [AuditData] ([AuditDataId], [AuditEventId], [Key], [Value], [IsAlert]) VALUES (2, 0x0D0C, 'nWake deassert ', 'nWake deassert ', 0)"]
[null,"Audit","NWAKE_PROTOCOL_ERROR","Inter Board Error","I2C write aborted",null,null,"0x0D0C","0003",null,null,null,null,"IF EXISTS(SELECT TOP 1 * FROM [AuditEvent] WHERE [AuditEventId] = 0x0D0C) UPDATE [AuditEvent] SET [Key] = 'Inter Board Error', [Value] = 'Inter Board Error', [IsAlert] = 0 WHERE [AuditEventId] = 0x0D0C ELSE INSERT INTO [AuditEvent] ([AuditEventId], [Key], [Value], [IsAlert]) VALUES (0x0D0C, 'Inter Board Error', 'Inter Board Error', 0)","IF EXISTS(SELECT TOP 1 * FROM [AuditData] WHERE [AuditDataId] = 3 AND [AuditEventId] = 0x0D0C) UPDATE [AuditData] SET [Key] = 'I2C write aborted', [Value] = 'I2C write aborted', [IsAlert] = 0 WHERE [AuditDataId] = 3 AND [AuditEventId] = 0x0D0C ELSE INSERT INTO [AuditData] ([AuditDataId], [AuditEventId], [Key], [Value], [IsAlert]) VALUES (3, 0x0D0C, 'I2C write aborted', 'I2C write aborted', 0)"]
[null,"Audit","NWAKE_PROTOCOL_ERROR","Inter Board Error"," I2C read aborted",null,null,"0x0D0C","0004",null,null,null,null,"IF EXISTS(SELECT TOP 1 * FROM [AuditEvent] WHERE [AuditEventId] = 0x0D0C) UPDATE [AuditEvent] SET [Key] = 'Inter Board Error', [Value] = 'Inter Board Error', [IsAlert] = 0 WHERE [AuditEventId] = 0x0D0C ELSE INSERT INTO [AuditEvent] ([AuditEventId], [Key], [Value], [IsAlert]) VALUES (0x0D0C, 'Inter Board Error', 'Inter Board Error', 0)","IF EXISTS(SELECT TOP 1 * FROM [AuditData] WHERE [AuditDataId] = 4 AND [AuditEventId] = 0x0D0C) UPDATE [AuditData] SET [Key] = ' I2C read aborted', [Value] = ' I2C read aborted', [IsAlert] = 0 WHERE [AuditDataId] = 4 AND [AuditEventId] = 0x0D0C ELSE INSERT INTO [AuditData] ([AuditDataId], [AuditEventId], [Key], [Value], [IsAlert]) VALUES (4, 0x0D0C, ' I2C read aborted', ' I2C read aborted', 0)"]
[null,"Audit","READER_RESET","Reader Reset","Reader Reset",null,null,"0x0D0D","xxxx",null,null,null,null,"IF EXISTS(SELECT TOP 1 * FROM [AuditEvent] WHERE [AuditEventId] = 0x0D0D) UPDATE [AuditEvent] SET [Key] = 'Reader Reset', [Value] = 'Reader Reset', [IsAlert] = 0 WHERE [AuditEventId] = 0x0D0D ELSE INSERT INTO [AuditEvent] ([AuditEventId], [Key], [Value], [IsAlert]) VALUES (0x0D0D, 'Reader Reset', 'Reader Reset', 0)","-- no value"]
[null,"Audit","IPC_AUTH_LOCKOUT","Device Lockout",null,null,null,"0x0D0E",0,null,null,null,null,"IF EXISTS(SELECT TOP 1 * FROM [AuditEvent] WHERE [AuditEventId] = 0x0D0E) UPDATE [AuditEvent] SET [Key] = 'Device Lockout', [Value] = 'Device Lockout', [IsAlert] = 0 WHERE [AuditEventId] = 0x0D0E ELSE INSERT INTO [AuditEvent] ([AuditEventId], [Key], [Value], [IsAlert]) VALUES (0x0D0E, 'Device Lockout', 'Device Lockout', 0)","IF EXISTS(SELECT TOP 1 * FROM [AuditData] WHERE [AuditDataId] = 0 AND [AuditEventId] = 0x0D0E) UPDATE [AuditData] SET [Key] = '', [Value] = '', [IsAlert] = 0 WHERE [AuditDataId] = 0 AND [AuditEventId] = 0x0D0E ELSE INSERT INTO [AuditData] ([AuditDataId], [AuditEventId], [Key], [Value], [IsAlert]) VALUES (0, 0x0D0E, '', '', 0)"]
[null,"Audit","IPC_AUTH_ATTEMPTS_DC","Main Auth Attempts","xxxx",null,null,"0x0D0F","0xXXXX","0 to 4000",null,null,null,"IF EXISTS(SELECT TOP 1 * FROM [AuditEvent] WHERE [AuditEventId] = 0x0D0F) UPDATE [AuditEvent] SET [Key] = 'Main Auth Attempts', [Value] = 'Main Auth Attempts', [IsAlert] = 0 WHERE [AuditEventId] = 0x0D0F ELSE INSERT INTO [AuditEvent] ([AuditEventId], [Key], [Value], [IsAlert]) VALUES (0x0D0F, 'Main Auth Attempts', 'Main Auth Attempts', 0)","-- no value"]
[null,"Audit","IPC_AUTH_ATTEMPTS_AC","Reader Auth Attempts","xxxx",null,null,"0x0D10","0xXXXX","0 to 4000",null,null,null,"IF EXISTS(SELECT TOP 1 * FROM [AuditEvent] WHERE [AuditEventId] = 0x0D10) UPDATE [AuditEvent] SET [Key] = 'Reader Auth Attempts', [Value] = 'Reader Auth Attempts', [IsAlert] = 0 WHERE [AuditEventId] = 0x0D10 ELSE INSERT INTO [AuditEvent] ([AuditEventId], [Key], [Value], [IsAlert]) VALUES (0x0D10, 'Reader Auth Attempts', 'Reader Auth Attempts', 0)","-- no value"]
[null,"Audit","IPC_SEC_REV_FAILURE","Incompatible Reader",null,null,null,"0x0D11",0,null,null,null,null,"IF EXISTS(SELECT TOP 1 * FROM [AuditEvent] WHERE [AuditEventId] = 0x0D11) UPDATE [AuditEvent] SET [Key] = 'Incompatible Reader', [Value] = 'Incompatible Reader', [IsAlert] = 0 WHERE [AuditEventId] = 0x0D11 ELSE INSERT INTO [AuditEvent] ([AuditEventId], [Key], [Value], [IsAlert]) VALUES (0x0D11, 'Incompatible Reader', 'Incompatible Reader', 0)","IF EXISTS(SELECT TOP 1 * FROM [AuditData] WHERE [AuditDataId] = 0 AND [AuditEventId] = 0x0D11) UPDATE [AuditData] SET [Key] = '', [Value] = '', [IsAlert] = 0 WHERE [AuditDataId] = 0 AND [AuditEventId] = 0x0D11 ELSE INSERT INTO [AuditData] ([AuditDataId], [AuditEventId], [Key], [Value], [IsAlert]) VALUES (0, 0x0D11, '', '', 0)"]
[null,"Audit","IPC_FAILED_AUTH","Reader Comm Failure",null,null,null,"0x0D12",0,null,null,null,null,"IF EXISTS(SELECT TOP 1 * FROM [AuditEvent] WHERE [AuditEventId] = 0x0D12) UPDATE [AuditEvent] SET [Key] = 'Reader Comm Failure', [Value] = 'Reader Comm Failure', [IsAlert] = 0 WHERE [AuditEventId] = 0x0D12 ELSE INSERT INTO [AuditEvent] ([AuditEventId], [Key], [Value], [IsAlert]) VALUES (0x0D12, 'Reader Comm Failure', 'Reader Comm Failure', 0)","IF EXISTS(SELECT TOP 1 * FROM [AuditData] WHERE [AuditDataId] = 0 AND [AuditEventId] = 0x0D12) UPDATE [AuditData] SET [Key] = '', [Value] = '', [IsAlert] = 0 WHERE [AuditDataId] = 0 AND [AuditEventId] = 0x0D12 ELSE INSERT INTO [AuditData] ([AuditDataId], [AuditEventId], [Key], [Value], [IsAlert]) VALUES (0, 0x0D12, '', '', 0)"]
[null,"Audit","MOTOR_RUN_RETRY_COUNT","Motor Run Retry Count",null,null,null,"0x0D13","0xXXXX","1 to 255",null,null,null,"IF EXISTS(SELECT TOP 1 * FROM [AuditEvent] WHERE [AuditEventId] = 0x0D13) UPDATE [AuditEvent] SET [Key] = 'Motor Run Retry Count', [Value] = 'Motor Run Retry Count', [IsAlert] = 0 WHERE [AuditEventId] = 0x0D13 ELSE INSERT INTO [AuditEvent] ([AuditEventId], [Key], [Value], [IsAlert]) VALUES (0x0D13, 'Motor Run Retry Count', 'Motor Run Retry Count', 0)","-- no value"]
["System Power Up Audits",null,null,null,null,null,null,null,null,null,null,null,null,"-- no value","-- no value"]
["Base Value",null,null,null,null,null,null,null,null,null,null,null,null,"-- no value","-- no value"]
["0E00","Audit","RESET_DIAG","Reset Diagnostics","xxxx",{"$f":"LEN(D604)","v":17},{"$f":"LEN(E604)","v":4},"0x0E01","XXXX","0 to 65535",null,null,null,"IF EXISTS(SELECT TOP 1 * FROM [AuditEvent] WHERE [AuditEventId] = 0x0E01) UPDATE [AuditEvent] SET [Key] = 'Reset Diagnostics', [Value] = 'Reset Diagnostics', [IsAlert] = 0 WHERE [AuditEventId] = 0x0E01 ELSE INSERT INTO [AuditEvent] ([AuditEventId], [Key], [Value], [IsAlert]) VALUES (0x0E01, 'Reset Diagnostics', 'Reset Diagnostics', 0)","-- no value"]
["0E00","Audit","JUMP_START","Jump Start Detected",null,{"$f":"LEN(D605)","v":19},{"$f":"LEN(E605)","v":0},"0x0E40",0,null,null,null,null,"IF EXISTS(SELECT TOP 1 * FROM [AuditEvent] WHERE [AuditEventId] = 0x0E40) UPDATE [AuditEvent] SET [Key] = 'Jump Start Detected', [Value] = 'Jump Start Detected', [IsAlert] = 0 WHERE [AuditEventId] = 0x0E40 ELSE INSERT INTO [AuditEvent] ([AuditEventId], [Key], [Value], [IsAlert]) VALUES (0x0E40, 'Jump Start Detected', 'Jump Start Detected', 0)","IF EXISTS(SELECT TOP 1 * FROM [AuditData] WHERE [AuditDataId] = 0 AND [AuditEventId] = 0x0E40) UPDATE [AuditData] SET [Key] = '', [Value] = '', [IsAlert] = 0 WHERE [AuditDataId] = 0 AND [AuditEventId] = 0x0E40 ELSE INSERT INTO [AuditData] ([AuditDataId], [AuditEventId], [Key], [Value], [IsAlert]) VALUES (0, 0x0E40, '', '', 0)"]
[null,null,null,null,null,null,null,null,null,null,null,null,null,"-- no value","-- no value"]
["Lock State Override",null,null,null,null,null,null,null,null,null,null,null,null,"-- no value","-- no value"]
["Base Value",null,null,null,null,null,null,null,null,null,null,null,null,"-- no value","-- no value"]
["0F00","Audit","LOCKSTATE_OVERRIDE_PASSAGE","LockState Override Passage",null,null,null,"0x0F00",0,null,null,null,null,"IF EXISTS(SELECT TOP 1 * FROM [AuditEvent] WHERE [AuditEventId] = 0x0F00) UPDATE [AuditEvent] SET [Key] = 'LockState Override Passage', [Value] = 'LockState Override Passage', [IsAlert] = 0 WHERE [AuditEventId] = 0x0F00 ELSE INSERT INTO [AuditEvent] ([AuditEventId], [Key], [Value], [IsAlert]) VALUES (0x0F00, 'LockState Override Passage', 'LockState Override Passage', 0)","IF EXISTS(SELECT TOP 1 * FROM [AuditData] WHERE [AuditDataId] = 0 AND [AuditEventId] = 0x0F00) UPDATE [AuditData] SET [Key] = '', [Value] = '', [IsAlert] = 0 WHERE [AuditDataId] = 0 AND [AuditEventId] = 0x0F00 ELSE INSERT INTO [AuditData] ([AuditDataId], [AuditEventId], [Key], [Value], [IsAlert]) VALUES (0, 0x0F00, '', '', 0)"]
[null,"Audit","LOCKSTATE_OVERRIDE_SECURED","LockState Override Secured",null,null,null,"0x0F01",0,null,null,null,null,"IF EXISTS(SELECT TOP 1 * FROM [AuditEvent] WHERE [AuditEventId] = 0x0F01) UPDATE [AuditEvent] SET [Key] = 'LockState Override Secured', [Value] = 'LockState Override Secured', [IsAlert] = 0 WHERE [AuditEventId] = 0x0F01 ELSE INSERT INTO [AuditEvent] ([AuditEventId], [Key], [Value], [IsAlert]) VALUES (0x0F01, 'LockState Override Secured', 'LockState Override Secured', 0)","IF EXISTS(SELECT TOP 1 * FROM [AuditData] WHERE [AuditDataId] = 0 AND [AuditEventId] = 0x0F01) UPDATE [AuditData] SET [Key] = '', [Value] = '', [IsAlert] = 0 WHERE [AuditDataId] = 0 AND [AuditEventId] = 0x0F01 ELSE INSERT INTO [AuditData] ([AuditDataId], [AuditEventId], [Key], [Value], [IsAlert]) VALUES (0, 0x0F01, '', '', 0)"]
[null,"Audit","LOCKSTATE_OVERRIDE_MOMENTARY_UNLOCK","LockState Override Momentary Unlock",null,null,null,"0x0F02",0,null,null,null,null,"IF EXISTS(SELECT TOP 1 * FROM [AuditEvent] WHERE [AuditEventId] = 0x0F02) UPDATE [AuditEvent] SET [Key] = 'LockState Override Momentary Unlock', [Value] = 'LockState Override Momentary Unlock', [IsAlert] = 0 WHERE [AuditEventId] = 0x0F02 ELSE INSERT INTO [AuditEvent] ([AuditEventId], [Key], [Value], [IsAlert]) VALUES (0x0F02, 'LockState Override Momentary Unlock', 'LockState Override Momentary Unlock', 0)","IF EXISTS(SELECT TOP 1 * FROM [AuditData] WHERE [AuditDataId] = 0 AND [AuditEventId] = 0x0F02) UPDATE [AuditData] SET [Key] = '', [Value] = '', [IsAlert] = 0 WHERE [AuditDataId] = 0 AND [AuditEventId] = 0x0F02 ELSE INSERT INTO [AuditData] ([AuditDataId], [AuditEventId], [Key], [Value], [IsAlert]) VALUES (0, 0x0F02, '', '', 0)"]
[null,"Audit","LOCKSTATE_OVERRIDE_HOLIDAY_RESTRICTED","LockState Override Holiday Restricted",null,null,null,"0x0F03",0,null,null,null,null,"IF EXISTS(SELECT TOP 1 * FROM [AuditEvent] WHERE [AuditEventId] = 0x0F03) UPDATE [AuditEvent] SET [Key] = 'LockState Override Holiday Restricted', [Value] = 'LockState Override Holiday Restricted', [IsAlert] = 0 WHERE [AuditEventId] = 0x0F03 ELSE INSERT INTO [AuditEvent] ([AuditEventId], [Key], [Value], [IsAlert]) VALUES (0x0F03, 'LockState Override Holiday Restricted', 'LockState Override Holiday Restricted', 0)","IF EXISTS(SELECT TOP 1 * FROM [AuditData] WHERE [AuditDataId] = 0 AND [AuditEventId] = 0x0F03) UPDATE [AuditData] SET [Key] = '', [Value] = '', [IsAlert] = 0 WHERE [AuditDataId] = 0 AND [AuditEventId] = 0x0F03 ELSE INSERT INTO [AuditData] ([AuditDataId], [AuditEventId], [Key], [Value], [IsAlert]) VALUES (0, 0x0F03, '', '', 0)"]
[null,"Audit","LOCKSTATE_OVERRIDE_FREEZE_SECURE","LockState Override Freeze Secure",null,null,null,"0x0F04",0,null,null,null,null,"IF EXISTS(SELECT TOP 1 * FROM [AuditEvent] WHERE [AuditEventId] = 0x0F04) UPDATE [AuditEvent] SET [Key] = 'LockState Override Freeze Secure', [Value] = 'LockState Override Freeze Secure', [IsAlert] = 0 WHERE [AuditEventId] = 0x0F04 ELSE INSERT INTO [AuditEvent] ([AuditEventId], [Key], [Value], [IsAlert]) VALUES (0x0F04, 'LockState Override Freeze Secure', 'LockState Override Freeze Secure', 0)","IF EXISTS(SELECT TOP 1 * FROM [AuditData] WHERE [AuditDataId] = 0 AND [AuditEventId] = 0x0F04) UPDATE [AuditData] SET [Key] = '', [Value] = '', [IsAlert] = 0 WHERE [AuditDataId] = 0 AND [AuditEventId] = 0x0F04 ELSE INSERT INTO [AuditData] ([AuditDataId], [AuditEventId], [Key], [Value], [IsAlert]) VALUES (0, 0x0F04, '', '', 0)"]
[null,"Audit","LOCKSTATE_OVERRIDE_FREEZE_PASSAGE","LockState Override Freeze Passage",null,null,null,"0x0F05",0,null,null,null,null,"IF EXISTS(SELECT TOP 1 * FROM [AuditEvent] WHERE [AuditEventId] = 0x0F05) UPDATE [AuditEvent] SET [Key] = 'LockState Override Freeze Passage', [Value] = 'LockState Override Freeze Passage', [IsAlert] = 0 WHERE [AuditEventId] = 0x0F05 ELSE INSERT INTO [AuditEvent] ([AuditEventId], [Key], [Value], [IsAlert]) VALUES (0x0F05, 'LockState Override Freeze Passage', 'LockState Override Freeze Passage', 0)","IF EXISTS(SELECT TOP 1 * FROM [AuditData] WHERE [AuditDataId] = 0 AND [AuditEventId] = 0x0F05) UPDATE [AuditData] SET [Key] = '', [Value] = '', [IsAlert] = 0 WHERE [AuditDataId] = 0 AND [AuditEventId] = 0x0F05 ELSE INSERT INTO [AuditData] ([AuditDataId], [AuditEventId], [Key], [Value], [IsAlert]) VALUES (0, 0x0F05, '', '', 0)"]
[null,"Audit","LOCKSTATE_OVERRIDE_TIMED_UNLOCK","LockState Override Timed Unlock",null,null,null,"0x0F06",0,null,null,null,null,"IF EXISTS(SELECT TOP 1 * FROM [AuditEvent] WHERE [AuditEventId] = 0x0F06) UPDATE [AuditEvent] SET [Key] = 'LockState Override Timed Unlock', [Value] = 'LockState Override Timed Unlock', [IsAlert] = 0 WHERE [AuditEventId] = 0x0F06 ELSE INSERT INTO [AuditEvent] ([AuditEventId], [Key], [Value], [IsAlert]) VALUES (0x0F06, 'LockState Override Timed Unlock', 'LockState Override Timed Unlock', 0)","IF EXISTS(SELECT TOP 1 * FROM [AuditData] WHERE [AuditDataId] = 0 AND [AuditEventId] = 0x0F06) UPDATE [AuditData] SET [Key] = '', [Value] = '', [IsAlert] = 0 WHERE [AuditDataId] = 0 AND [AuditEventId] = 0x0F06 ELSE INSERT INTO [AuditData] ([AuditDataId], [AuditEventId], [Key], [Value], [IsAlert]) VALUES (0, 0x0F06, '', '', 0)"]
[null,"Audit","LOCKSTATE_OVERRIDE_AUX_ENABLED","LockState Override Aux Relay Enable",null,null,null,"0x0F07",0,null,null,null,null,"IF EXISTS(SELECT TOP 1 * FROM [AuditEvent] WHERE [AuditEventId] = 0x0F07) UPDATE [AuditEvent] SET [Key] = 'LockState Override Aux Relay Enable', [Value] = 'LockState Override Aux Relay Enable', [IsAlert] = 0 WHERE [AuditEventId] = 0x0F07 ELSE INSERT INTO [AuditEvent] ([AuditEventId], [Key], [Value], [IsAlert]) VALUES (0x0F07, 'LockState Override Aux Relay Enable', 'LockState Override Aux Relay Enable', 0)",{"$f":"IF(AND(LEFT(H616,2)=\"0x\",ISNUMBER(HEX2DEC(TRIM(I616))*1)),CONCATENATE(\"IF EXISTS(SELECT TOP 1 * FROM [AuditData] WHERE [AuditDataId] = \",HEX2DEC(I616),\" AND [AuditEventId] = \",H616,\") UPDATE [AuditData] SET [Key] = '\",E616,\"', [Value] = '\",E616,\"', [IsAlert] = 0 WHERE [AuditDataId] = \",HEX2DEC(I616),\" AND [AuditEventId] = \",H616,\" ELSE INSERT INTO [AuditData] ([AuditDataId], [AuditEventId], [Key], [Value], [IsAlert]) VALUES (\",HEX2DEC(I616),\", \",H616,\", '\",E616,\"', '\",E616,\"', 0)\"),\"-- no value\")","v":"IF EXISTS(SELECT TOP 1 * FROM [AuditData] WHERE [AuditDataId] = 0 AND [AuditEventId] = 0x0F07) UPDATE [AuditData] SET [Key] = '', [Value] = '', [IsAlert] = 0 WHERE [AuditDataId] = 0 AND [AuditEventId] = 0x0F07 ELSE INSERT INTO [AuditData] ([AuditDataId], [AuditEventId], [Key], [Value], [IsAlert]) VALUES (0, 0x0F07, '', '', 0)"}]
[null,"Audit","LOCKSTATE_OVERRIDE_AUX_DISABLED","LockState Override Aux Relay Disabled",null,null,null,"0x0F08",0,null,null,null,null,"IF EXISTS(SELECT TOP 1 * FROM [AuditEvent] WHERE [AuditEventId] = 0x0F08) UPDATE [AuditEvent] SET [Key] = 'LockState Override Aux Relay Disabled', [Value] = 'LockState Override Aux Relay Disabled', [IsAlert] = 0 WHERE [AuditEventId] = 0x0F08 ELSE INSERT INTO [AuditEvent] ([AuditEventId], [Key], [Value], [IsAlert]) VALUES (0x0F08, 'LockState Override Aux Relay Disabled', 'LockState Override Aux Relay Disabled', 0)","IF EXISTS(SELECT TOP 1 * FROM [AuditData] WHERE [AuditDataId] = 0 AND [AuditEventId] = 0x0F08) UPDATE [AuditData] SET [Key] = '', [Value] = '', [IsAlert] = 0 WHERE [AuditDataId] = 0 AND [AuditEventId] = 0x0F08 ELSE INSERT INTO [AuditData] ([AuditDataId], [AuditEventId], [Key], [Value], [IsAlert]) VALUES (0, 0x0F08, '', '', 0)"]
[null,"Audit","LOCKSTATE_OVERRIDE_TTL1_ACTIVE","LockState Override TTL1 Active",null,null,null,"0x0F09",0,null,null,null,null,"IF EXISTS(SELECT TOP 1 * FROM [AuditEvent] WHERE [AuditEventId] = 0x0F09) UPDATE [AuditEvent] SET [Key] = 'LockState Override TTL1 Active', [Value] = 'LockState Override TTL1 Active', [IsAlert] = 0 WHERE [AuditEventId] = 0x0F09 ELSE INSERT INTO [AuditEvent] ([AuditEventId], [Key], [Value], [IsAlert]) VALUES (0x0F09, 'LockState Override TTL1 Active', 'LockState Override TTL1 Active', 0)","IF EXISTS(SELECT TOP 1 * FROM [AuditData] WHERE [AuditDataId] = 0 AND [AuditEventId] = 0x0F09) UPDATE [AuditData] SET [Key] = '', [Value] = '', [IsAlert] = 0 WHERE [AuditDataId] = 0 AND [AuditEventId] = 0x0F09 ELSE INSERT INTO [AuditData] ([AuditDataId], [AuditEventId], [Key], [Value], [IsAlert]) VALUES (0, 0x0F09, '', '', 0)"]
[null,"Audit","LOCKSTATE_OVERRIDE_TTL1_INACTIVE","LockState Override TTL1 Inactive",null,null,null,"0x0F0A",0,null,null,null,null,"IF EXISTS(SELECT TOP 1 * FROM [AuditEvent] WHERE [AuditEventId] = 0x0F0A) UPDATE [AuditEvent] SET [Key] = 'LockState Override TTL1 Inactive', [Value] = 'LockState Override TTL1 Inactive', [IsAlert] = 0 WHERE [AuditEventId] = 0x0F0A ELSE INSERT INTO [AuditEvent] ([AuditEventId], [Key], [Value], [IsAlert]) VALUES (0x0F0A, 'LockState Override TTL1 Inactive', 'LockState Override TTL1 Inactive', 0)","IF EXISTS(SELECT TOP 1 * FROM [AuditData] WHERE [AuditDataId] = 0 AND [AuditEventId] = 0x0F0A) UPDATE [AuditData] SET [Key] = '', [Value] = '', [IsAlert] = 0 WHERE [AuditDataId] = 0 AND [AuditEventId] = 0x0F0A ELSE INSERT INTO [AuditData] ([AuditDataId], [AuditEventId], [Key], [Value], [IsAlert]) VALUES (0, 0x0F0A, '', '', 0)"]
[null,"Audit","LOCKSTATE_OVERRIDE_TTL2_ACTIVE","LockState Override TTL2 Active",null,null,null,"0x0F0B",0,null,null,null,null,"IF EXISTS(SELECT TOP 1 * FROM [AuditEvent] WHERE [AuditEventId] = 0x0F0B) UPDATE [AuditEvent] SET [Key] = 'LockState Override TTL2 Active', [Value] = 'LockState Override TTL2 Active', [IsAlert] = 0 WHERE [AuditEventId] = 0x0F0B ELSE INSERT INTO [AuditEvent] ([AuditEventId], [Key], [Value], [IsAlert]) VALUES (0x0F0B, 'LockState Override TTL2 Active', 'LockState Override TTL2 Active', 0)","IF EXISTS(SELECT TOP 1 * FROM [AuditData] WHERE [AuditDataId] = 0 AND [AuditEventId] = 0x0F0B) UPDATE [AuditData] SET [Key] = '', [Value] = '', [IsAlert] = 0 WHERE [AuditDataId] = 0 AND [AuditEventId] = 0x0F0B ELSE INSERT INTO [AuditData] ([AuditDataId], [AuditEventId], [Key], [Value], [IsAlert]) VALUES (0, 0x0F0B, '', '', 0)"]
[null,"Audit","LOCKSTATE_OVERRIDE_TTL2_INACTIVE","LockState Override TTL2 Inactive",null,null,null,"0x0F0C",0,null,null,null,null,{"$f":"IF(LEFT(H621,2)=\"0x\",CONCATENATE(\"IF EXISTS(SELECT TOP 1 * FROM [AuditEvent] WHERE [AuditEventId] = \",H621,\") UPDATE [AuditEvent] SET [Key] = '\",TRIM(D621),\"', [Value] = '\",TRIM(D621),\"', [IsAlert] = \",IF(B621=\"Audit\",0,1),\" WHERE [AuditEventId] = \",H621,\" ELSE INSERT INTO [AuditEvent] ([AuditEventId], [Key], [Value], [IsAlert]) VALUES (\",H621,\", '\",TRIM(D621),\"', '\",TRIM(D621),\"', \",IF(B621=\"Audit\",0,1), \")\"),\"-- no value\")","v":"IF EXISTS(SELECT TOP 1 * FROM [AuditEvent] WHERE [AuditEventId] = 0x0F0C) UPDATE [AuditEvent] SET [Key] = 'LockState Override TTL2 Inactive', [Value] = 'LockState Override TTL2 Inactive', [IsAlert] = 0 WHERE [AuditEventId] = 0x0F0C ELSE INSERT INTO [AuditEvent] ([AuditEventId], [Key], [Value], [IsAlert]) VALUES (0x0F0C, 'LockState Override TTL2 Inactive', 'LockState Override TTL2 Inactive', 0)"},"IF EXISTS(SELECT TOP 1 * FROM [AuditData] WHERE [AuditDataId] = 0 AND [AuditEventId] = 0x0F0C) UPDATE [AuditData] SET [Key] = '', [Value] = '', [IsAlert] = 0 WHERE [AuditDataId] = 0 AND [AuditEventId] = 0x0F0C ELSE INSERT INTO [AuditData] ([AuditDataId], [AuditEventId], [Key], [Value], [IsAlert]) VALUES (0, 0x0F0C, '', '', 0)"]
[null,"Audit","LOCKSTATE_OVERRIDE_CLEAR","LockState Clear Override",null,null,null,"0x0F0D",0,null,null,null,null,{"$f":"IF(LEFT(H622,2)=\"0x\",CONCATENATE(\"IF EXISTS(SELECT TOP 1 * FROM [AuditEvent] WHERE [AuditEventId] = \",H622,\") UPDATE [AuditEvent] SET [Key] = '\",TRIM(D622),\"', [Value] = '\",TRIM(D622),\"', [IsAlert] = \",IF(B622=\"Audit\",0,1),\" WHERE [AuditEventId] = \",H622,\" ELSE INSERT INTO [AuditEvent] ([AuditEventId], [Key], [Value], [IsAlert]) VALUES (\",H622,\", '\",TRIM(D622),\"', '\",TRIM(D622),\"', \",IF(B622=\"Audit\",0,1), \")\"),\"-- no value\")","v":"IF EXISTS(SELECT TOP 1 * FROM [AuditEvent] WHERE [AuditEventId] = 0x0F0D) UPDATE [AuditEvent] SET [Key] = 'LockState Clear Override', [Value] = 'LockState Clear Override', [IsAlert] = 0 WHERE [AuditEventId] = 0x0F0D ELSE INSERT INTO [AuditEvent] ([AuditEventId], [Key], [Value], [IsAlert]) VALUES (0x0F0D, 'LockState Clear Override', 'LockState Clear Override', 0)"},{"$f":"IF(AND(LEFT(H622,2)=\"0x\",ISNUMBER(HEX2DEC(TRIM(I622))*1)),CONCATENATE(\"IF EXISTS(SELECT TOP 1 * FROM [AuditData] WHERE [AuditDataId] = \",HEX2DEC(I622),\" AND [AuditEventId] = \",H622,\") UPDATE [AuditData] SET [Key] = '\",E622,\"', [Value] = '\",E622,\"', [IsAlert] = 0 WHERE [AuditDataId] = \",HEX2DEC(I622),\" AND [AuditEventId] = \",H622,\" ELSE INSERT INTO [AuditData] ([AuditDataId], [AuditEventId], [Key], [Value], [IsAlert]) VALUES (\",HEX2DEC(I622),\", \",H622,\", '\",E622,\"', '\",E622,\"', 0)\"),\"-- no value\")","v":"IF EXISTS(SELECT TOP 1 * FROM [AuditData] WHERE [AuditDataId] = 0 AND [AuditEventId] = 0x0F0D) UPDATE [AuditData] SET [Key] = '', [Value] = '', [IsAlert] = 0 WHERE [AuditDataId] = 0 AND [AuditEventId] = 0x0F0D ELSE INSERT INTO [AuditData] ([AuditDataId], [AuditEventId], [Key], [Value], [IsAlert]) VALUES (0, 0x0F0D, '', '', 0)"}]
[null,null,null,null,null,null,null,null,null,null,null,null,null,"-- no value","-- no value"]
["GateWay Audits",null,null,null,null,null,null,null,null,null,null,null,null,"-- no value","-- no value"]
["Base Value",null,null,null,null,null,null,null,null,null,null,null,null,"-- no value","-- no value"]
["1000","Audit","GATEWAY_LINKED","Gateway Linked",null,null,null,"0x1000",0,null,null,null,null,"IF EXISTS(SELECT TOP 1 * FROM [AuditEvent] WHERE [AuditEventId] = 0x1000) UPDATE [AuditEvent] SET [Key] = 'Gateway Linked', [Value] = 'Gateway Linked', [IsAlert] = 0 WHERE [AuditEventId] = 0x1000 ELSE INSERT INTO [AuditEvent] ([AuditEventId], [Key], [Value], [IsAlert]) VALUES (0x1000, 'Gateway Linked', 'Gateway Linked', 0)","IF EXISTS(SELECT TOP 1 * FROM [AuditData] WHERE [AuditDataId] = 0 AND [AuditEventId] = 0x1000) UPDATE [AuditData] SET [Key] = '', [Value] = '', [IsAlert] = 0 WHERE [AuditDataId] = 0 AND [AuditEventId] = 0x1000 ELSE INSERT INTO [AuditData] ([AuditDataId], [AuditEventId], [Key], [Value], [IsAlert]) VALUES (0, 0x1000, '', '', 0)"]
[null,"Audit","GATEWAY_LINKED_FAILED","Gateway Link Failure","Commission Error",null,null,"0x1001",1,null,null,null,null,"IF EXISTS(SELECT TOP 1 * FROM [AuditEvent] WHERE [AuditEventId] = 0x1001) UPDATE [AuditEvent] SET [Key] = 'Gateway Link Failure', [Value] = 'Gateway Link Failure', [IsAlert] = 0 WHERE [AuditEventId] = 0x1001 ELSE INSERT INTO [AuditEvent] ([AuditEventId], [Key], [Value], [IsAlert]) VALUES (0x1001, 'Gateway Link Failure', 'Gateway Link Failure', 0)","IF EXISTS(SELECT TOP 1 * FROM [AuditData] WHERE [AuditDataId] = 1 AND [AuditEventId] = 0x1001) UPDATE [AuditData] SET [Key] = 'Commission Error', [Value] = 'Commission Error', [IsAlert] = 0 WHERE [AuditDataId] = 1 AND [AuditEventId] = 0x1001 ELSE INSERT INTO [AuditData] ([AuditDataId], [AuditEventId], [Key], [Value], [IsAlert]) VALUES (1, 0x1001, 'Commission Error', 'Commission Error', 0)"]
[null,"Audit","GATEWAY_LINKED_FAILED","Gateway Link Failure","Communication Error",null,null,"0x1001",2,null,null,null,null,"IF EXISTS(SELECT TOP 1 * FROM [AuditEvent] WHERE [AuditEventId] = 0x1001) UPDATE [AuditEvent] SET [Key] = 'Gateway Link Failure', [Value] = 'Gateway Link Failure', [IsAlert] = 0 WHERE [AuditEventId] = 0x1001 ELSE INSERT INTO [AuditEvent] ([AuditEventId], [Key], [Value], [IsAlert]) VALUES (0x1001, 'Gateway Link Failure', 'Gateway Link Failure', 0)","IF EXISTS(SELECT TOP 1 * FROM [AuditData] WHERE [AuditDataId] = 2 AND [AuditEventId] = 0x1001) UPDATE [AuditData] SET [Key] = 'Communication Error', [Value] = 'Communication Error', [IsAlert] = 0 WHERE [AuditDataId] = 2 AND [AuditEventId] = 0x1001 ELSE INSERT INTO [AuditData] ([AuditDataId], [AuditEventId], [Key], [Value], [IsAlert]) VALUES (2, 0x1001, 'Communication Error', 'Communication Error', 0)"]
[null,"Audit","GATEWAY_COMM_ESTIBLISHED","Gateway Communication Established",null,null,null,"0x1002",0,null,null,null,null,"IF EXISTS(SELECT TOP 1 * FROM [AuditEvent] WHERE [AuditEventId] = 0x1002) UPDATE [AuditEvent] SET [Key] = 'Gateway Communication Established', [Value] = 'Gateway Communication Established', [IsAlert] = 0 WHERE [AuditEventId] = 0x1002 ELSE INSERT INTO [AuditEvent] ([AuditEventId], [Key], [Value], [IsAlert]) VALUES (0x1002, 'Gateway Communication Established', 'Gateway Communication Established', 0)","IF EXISTS(SELECT TOP 1 * FROM [AuditData] WHERE [AuditDataId] = 0 AND [AuditEventId] = 0x1002) UPDATE [AuditData] SET [Key] = '', [Value] = '', [IsAlert] = 0 WHERE [AuditDataId] = 0 AND [AuditEventId] = 0x1002 ELSE INSERT INTO [AuditData] ([AuditDataId], [AuditEventId], [Key], [Value], [IsAlert]) VALUES (0, 0x1002, '', '', 0)"]
[null,"Audit","GATEWAY_COMM_ERROR","Gateway Communication Error",null,null,null,"0x1003",0,null,null,null,null,"IF EXISTS(SELECT TOP 1 * FROM [AuditEvent] WHERE [AuditEventId] = 0x1003) UPDATE [AuditEvent] SET [Key] = 'Gateway Communication Error', [Value] = 'Gateway Communication Error', [IsAlert] = 0 WHERE [AuditEventId] = 0x1003 ELSE INSERT INTO [AuditEvent] ([AuditEventId], [Key], [Value], [IsAlert]) VALUES (0x1003, 'Gateway Communication Error', 'Gateway Communication Error', 0)","IF EXISTS(SELECT TOP 1 * FROM [AuditData] WHERE [AuditDataId] = 0 AND [AuditEventId] = 0x1003) UPDATE [AuditData] SET [Key] = '', [Value] = '', [IsAlert] = 0 WHERE [AuditDataId] = 0 AND [AuditEventId] = 0x1003 ELSE INSERT INTO [AuditData] ([AuditDataId], [AuditEventId], [Key], [Value], [IsAlert]) VALUES (0, 0x1003, '', '', 0)"]
[null,null,null,null,null,null,null,null,null,null,null,null,null,"-- no value","-- no value"]
["Integrity/Authenticity Audits",null,null,null,null,null,null,null,null,null,null,null,null,"-- no value","-- no value"]
["Base Value",null,null,null,null,null,null,null,null,null,null,null,null,"-- no value","-- no value"]
[1100,"Audit","HMAC_VALIDATION_PASSED","HMAC Validation Passed",null,null,null,"0x1100",0,null,null,null,null,"IF EXISTS(SELECT TOP 1 * FROM [AuditEvent] WHERE [AuditEventId] = 0x1100) UPDATE [AuditEvent] SET [Key] = 'HMAC Validation Passed', [Value] = 'HMAC Validation Passed', [IsAlert] = 0 WHERE [AuditEventId] = 0x1100 ELSE INSERT INTO [AuditEvent] ([AuditEventId], [Key], [Value], [IsAlert]) VALUES (0x1100, 'HMAC Validation Passed', 'HMAC Validation Passed', 0)","IF EXISTS(SELECT TOP 1 * FROM [AuditData] WHERE [AuditDataId] = 0 AND [AuditEventId] = 0x1100) UPDATE [AuditData] SET [Key] = '', [Value] = '', [IsAlert] = 0 WHERE [AuditDataId] = 0 AND [AuditEventId] = 0x1100 ELSE INSERT INTO [AuditData] ([AuditDataId], [AuditEventId], [Key], [Value], [IsAlert]) VALUES (0, 0x1100, '', '', 0)"]
[null,"Audit","HMAC_VALIDATION_FAILED","HMAC Validation Failed","SHA1 Digest or Timestamp Failure",null,null,"0x1101",101,null,null,null,null,"IF EXISTS(SELECT TOP 1 * FROM [AuditEvent] WHERE [AuditEventId] = 0x1101) UPDATE [AuditEvent] SET [Key] = 'HMAC Validation Failed', [Value] = 'HMAC Validation Failed', [IsAlert] = 0 WHERE [AuditEventId] = 0x1101 ELSE INSERT INTO [AuditEvent] ([AuditEventId], [Key], [Value], [IsAlert]) VALUES (0x1101, 'HMAC Validation Failed', 'HMAC Validation Failed', 0)","IF EXISTS(SELECT TOP 1 * FROM [AuditData] WHERE [AuditDataId] = 257 AND [AuditEventId] = 0x1101) UPDATE [AuditData] SET [Key] = 'SHA1 Digest or Timestamp Failure', [Value] = 'SHA1 Digest or Timestamp Failure', [IsAlert] = 0 WHERE [AuditDataId] = 257 AND [AuditEventId] = 0x1101 ELSE INSERT INTO [AuditData] ([AuditDataId], [AuditEventId], [Key], [Value], [IsAlert]) VALUES (257, 0x1101, 'SHA1 Digest or Timestamp Failure', 'SHA1 Digest or Timestamp Failure', 0)"]
[null,"Audit","HMAC_VALIDATION_FAILED","HMAC Validation Failed","SHA1 Serial Number Failure",null,null,"0x1101",102,null,null,null,null,"IF EXISTS(SELECT TOP 1 * FROM [AuditEvent] WHERE [AuditEventId] = 0x1101) UPDATE [AuditEvent] SET [Key] = 'HMAC Validation Failed', [Value] = 'HMAC Validation Failed', [IsAlert] = 0 WHERE [AuditEventId] = 0x1101 ELSE INSERT INTO [AuditEvent] ([AuditEventId], [Key], [Value], [IsAlert]) VALUES (0x1101, 'HMAC Validation Failed', 'HMAC Validation Failed', 0)","IF EXISTS(SELECT TOP 1 * FROM [AuditData] WHERE [AuditDataId] = 258 AND [AuditEventId] = 0x1101) UPDATE [AuditData] SET [Key] = 'SHA1 Serial Number Failure', [Value] = 'SHA1 Serial Number Failure', [IsAlert] = 0 WHERE [AuditDataId] = 258 AND [AuditEventId] = 0x1101 ELSE INSERT INTO [AuditData] ([AuditDataId], [AuditEventId], [Key], [Value], [IsAlert]) VALUES (258, 0x1101, 'SHA1 Serial Number Failure', 'SHA1 Serial Number Failure', 0)"]
[null,"Audit","HMAC_VALIDATION_FAILED","HMAC Validation Failed","SHA1 HMAC Tag Invalid Failure",null,null,"0x1101",104,null,null,null,null,"IF EXISTS(SELECT TOP 1 * FROM [AuditEvent] WHERE [AuditEventId] = 0x1101) UPDATE [AuditEvent] SET [Key] = 'HMAC Validation Failed', [Value] = 'HMAC Validation Failed', [IsAlert] = 0 WHERE [AuditEventId] = 0x1101 ELSE INSERT INTO [AuditEvent] ([AuditEventId], [Key], [Value], [IsAlert]) VALUES (0x1101, 'HMAC Validation Failed', 'HMAC Validation Failed', 0)","IF EXISTS(SELECT TOP 1 * FROM [AuditData] WHERE [AuditDataId] = 260 AND [AuditEventId] = 0x1101) UPDATE [AuditData] SET [Key] = 'SHA1 HMAC Tag Invalid Failure', [Value] = 'SHA1 HMAC Tag Invalid Failure', [IsAlert] = 0 WHERE [AuditDataId] = 260 AND [AuditEventId] = 0x1101 ELSE INSERT INTO [AuditData] ([AuditDataId], [AuditEventId], [Key], [Value], [IsAlert]) VALUES (260, 0x1101, 'SHA1 HMAC Tag Invalid Failure', 'SHA1 HMAC Tag Invalid Failure', 0)"]
[null,"Audit","HMAC_VALIDATION_FAILED","HMAC Validation Failed","SHA1 Type Failure",null,null,"0x1101",108,null,null,null,null,"IF EXISTS(SELECT TOP 1 * FROM [AuditEvent] WHERE [AuditEventId] = 0x1101) UPDATE [AuditEvent] SET [Key] = 'HMAC Validation Failed', [Value] = 'HMAC Validation Failed', [IsAlert] = 0 WHERE [AuditEventId] = 0x1101 ELSE INSERT INTO [AuditEvent] ([AuditEventId], [Key], [Value], [IsAlert]) VALUES (0x1101, 'HMAC Validation Failed', 'HMAC Validation Failed', 0)","IF EXISTS(SELECT TOP 1 * FROM [AuditData] WHERE [AuditDataId] = 264 AND [AuditEventId] = 0x1101) UPDATE [AuditData] SET [Key] = 'SHA1 Type Failure', [Value] = 'SHA1 Type Failure', [IsAlert] = 0 WHERE [AuditDataId] = 264 AND [AuditEventId] = 0x1101 ELSE INSERT INTO [AuditData] ([AuditDataId], [AuditEventId], [Key], [Value], [IsAlert]) VALUES (264, 0x1101, 'SHA1 Type Failure', 'SHA1 Type Failure', 0)"]
[null,"Audit","HMAC_VALIDATION_FAILED","HMAC Validation Failed","hmacData Object Content Fault",null,null,"0x1101",1010,null,null,null,null,"IF EXISTS(SELECT TOP 1 * FROM [AuditEvent] WHERE [AuditEventId] = 0x1101) UPDATE [AuditEvent] SET [Key] = 'HMAC Validation Failed', [Value] = 'HMAC Validation Failed', [IsAlert] = 0 WHERE [AuditEventId] = 0x1101 ELSE INSERT INTO [AuditEvent] ([AuditEventId], [Key], [Value], [IsAlert]) VALUES (0x1101, 'HMAC Validation Failed', 'HMAC Validation Failed', 0)","IF EXISTS(SELECT TOP 1 * FROM [AuditData] WHERE [AuditDataId] = 4112 AND [AuditEventId] = 0x1101) UPDATE [AuditData] SET [Key] = 'hmacData Object Content Fault', [Value] = 'hmacData Object Content Fault', [IsAlert] = 0 WHERE [AuditDataId] = 4112 AND [AuditEventId] = 0x1101 ELSE INSERT INTO [AuditData] ([AuditDataId], [AuditEventId], [Key], [Value], [IsAlert]) VALUES (4112, 0x1101, 'hmacData Object Content Fault', 'hmacData Object Content Fault', 0)"]
[null,"Audit","HMAC_VALIDATION_FAILED","HMAC Validation Failed","genPrmtrs Object Content Fault",null,null,"0x1101",1020,null,null,null,null,"IF EXISTS(SELECT TOP 1 * FROM [AuditEvent] WHERE [AuditEventId] = 0x1101) UPDATE [AuditEvent] SET [Key] = 'HMAC Validation Failed', [Value] = 'HMAC Validation Failed', [IsAlert] = 0 WHERE [AuditEventId] = 0x1101 ELSE INSERT INTO [AuditEvent] ([AuditEventId], [Key], [Value], [IsAlert]) VALUES (0x1101, 'HMAC Validation Failed', 'HMAC Validation Failed', 0)","IF EXISTS(SELECT TOP 1 * FROM [AuditData] WHERE [AuditDataId] = 4128 AND [AuditEventId] = 0x1101) UPDATE [AuditData] SET [Key] = 'genPrmtrs Object Content Fault', [Value] = 'genPrmtrs Object Content Fault', [IsAlert] = 0 WHERE [AuditDataId] = 4128 AND [AuditEventId] = 0x1101 ELSE INSERT INTO [AuditData] ([AuditDataId], [AuditEventId], [Key], [Value], [IsAlert]) VALUES (4128, 0x1101, 'genPrmtrs Object Content Fault', 'genPrmtrs Object Content Fault', 0)"]
[null,"Audit","HMAC_VALIDATION_ON","HMAC Validation ON","SHA1 Digest or Timestamp Failure",null,null,"0x1102",101,null,null,null,null,"IF EXISTS(SELECT TOP 1 * FROM [AuditEvent] WHERE [AuditEventId] = 0x1102) UPDATE [AuditEvent] SET [Key] = 'HMAC Validation ON', [Value] = 'HMAC Validation ON', [IsAlert] = 0 WHERE [AuditEventId] = 0x1102 ELSE INSERT INTO [AuditEvent] ([AuditEventId], [Key], [Value], [IsAlert]) VALUES (0x1102, 'HMAC Validation ON', 'HMAC Validation ON', 0)","IF EXISTS(SELECT TOP 1 * FROM [AuditData] WHERE [AuditDataId] = 257 AND [AuditEventId] = 0x1102) UPDATE [AuditData] SET [Key] = 'SHA1 Digest or Timestamp Failure', [Value] = 'SHA1 Digest or Timestamp Failure', [IsAlert] = 0 WHERE [AuditDataId] = 257 AND [AuditEventId] = 0x1102 ELSE INSERT INTO [AuditData] ([AuditDataId], [AuditEventId], [Key], [Value], [IsAlert]) VALUES (257, 0x1102, 'SHA1 Digest or Timestamp Failure', 'SHA1 Digest or Timestamp Failure', 0)"]
[null,"Audit","HMAC_VALIDATION_OFF","HMAC Validation OFF","HMAC Off",null,null,"0x1103",0,null,null,null,null,"IF EXISTS(SELECT TOP 1 * FROM [AuditEvent] WHERE [AuditEventId] = 0x1103) UPDATE [AuditEvent] SET [Key] = 'HMAC Validation OFF', [Value] = 'HMAC Validation OFF', [IsAlert] = 0 WHERE [AuditEventId] = 0x1103 ELSE INSERT INTO [AuditEvent] ([AuditEventId], [Key], [Value], [IsAlert]) VALUES (0x1103, 'HMAC Validation OFF', 'HMAC Validation OFF', 0)","IF EXISTS(SELECT TOP 1 * FROM [AuditData] WHERE [AuditDataId] = 0 AND [AuditEventId] = 0x1103) UPDATE [AuditData] SET [Key] = 'HMAC Off', [Value] = 'HMAC Off', [IsAlert] = 0 WHERE [AuditDataId] = 0 AND [AuditEventId] = 0x1103 ELSE INSERT INTO [AuditData] ([AuditDataId], [AuditEventId], [Key], [Value], [IsAlert]) VALUES (0, 0x1103, 'HMAC Off', 'HMAC Off', 0)"]
[null,null,null,null,null,null,null,null,null,null,null,null,null,"-- no value","-- no value"]
["Ethernet Audits",null,null,null,null,null,null,null,null,null,null,null,null,{"$f":"IF(LEFT(H644,2)=\"0x\",CONCATENATE(\"IF EXISTS(SELECT TOP 1 * FROM [AuditEvent] WHERE [AuditEventId] = \",H644,\") UPDATE [AuditEvent] SET [Key] = '\",TRIM(D644),\"', [Value] = '\",TRIM(D644),\"', [IsAlert] = \",IF(B644=\"Audit\",0,1),\" WHERE [AuditEventId] = \",H644,\" ELSE INSERT INTO [AuditEvent] ([AuditEventId], [Key], [Value], [IsAlert]) VALUES (\",H644,\", '\",TRIM(D644),\"', '\",TRIM(D644),\"', \",IF(B644=\"Audit\",0,1), \")\"),\"-- no value\")","v":"-- no value"},"-- no value"]
["Base Value",null,null,null,null,null,null,null,null,null,null,null,null,"-- no value","-- no value"]
[1200,"Audit","ETHERNET_CABLE_CONNECT_DISCONNECT  ","Ethernet Cable Status","Disconnected",null,null,"0x1200",0,null,null,null,null,"IF EXISTS(SELECT TOP 1 * FROM [AuditEvent] WHERE [AuditEventId] = 0x1200) UPDATE [AuditEvent] SET [Key] = 'Ethernet Cable Status', [Value] = 'Ethernet Cable Status', [IsAlert] = 0 WHERE [AuditEventId] = 0x1200 ELSE INSERT INTO [AuditEvent] ([AuditEventId], [Key], [Value], [IsAlert]) VALUES (0x1200, 'Ethernet Cable Status', 'Ethernet Cable Status', 0)","IF EXISTS(SELECT TOP 1 * FROM [AuditData] WHERE [AuditDataId] = 0 AND [AuditEventId] = 0x1200) UPDATE [AuditData] SET [Key] = 'Disconnected', [Value] = 'Disconnected', [IsAlert] = 0 WHERE [AuditDataId] = 0 AND [AuditEventId] = 0x1200 ELSE INSERT INTO [AuditData] ([AuditDataId], [AuditEventId], [Key], [Value], [IsAlert]) VALUES (0, 0x1200, 'Disconnected', 'Disconnected', 0)"]
[null,"Audit","ETHERNET_CABLE_CONNECT_DISCONNECT  ","Ethernet Cable Status","Connected",null,null,"0x1200",1,null,null,null,null,"IF EXISTS(SELECT TOP 1 * FROM [AuditEvent] WHERE [AuditEventId] = 0x1200) UPDATE [AuditEvent] SET [Key] = 'Ethernet Cable Status', [Value] = 'Ethernet Cable Status', [IsAlert] = 0 WHERE [AuditEventId] = 0x1200 ELSE INSERT INTO [AuditEvent] ([AuditEventId], [Key], [Value], [IsAlert]) VALUES (0x1200, 'Ethernet Cable Status', 'Ethernet Cable Status', 0)","IF EXISTS(SELECT TOP 1 * FROM [AuditData] WHERE [AuditDataId] = 1 AND [AuditEventId] = 0x1200) UPDATE [AuditData] SET [Key] = 'Connected', [Value] = 'Connected', [IsAlert] = 0 WHERE [AuditDataId] = 1 AND [AuditEventId] = 0x1200 ELSE INSERT INTO [AuditData] ([AuditDataId], [AuditEventId], [Key], [Value], [IsAlert]) VALUES (1, 0x1200, 'Connected', 'Connected', 0)"]
[null,"Audit","ETHERNET_CONFIG_UPDATE  ","Ethernet Config Updated  ",null,null,null,"0x1201",0,null,null,null,null,"IF EXISTS(SELECT TOP 1 * FROM [AuditEvent] WHERE [AuditEventId] = 0x1201) UPDATE [AuditEvent] SET [Key] = 'Ethernet Config Updated', [Value] = 'Ethernet Config Updated', [IsAlert] = 0 WHERE [AuditEventId] = 0x1201 ELSE INSERT INTO [AuditEvent] ([AuditEventId], [Key], [Value], [IsAlert]) VALUES (0x1201, 'Ethernet Config Updated', 'Ethernet Config Updated', 0)","IF EXISTS(SELECT TOP 1 * FROM [AuditData] WHERE [AuditDataId] = 0 AND [AuditEventId] = 0x1201) UPDATE [AuditData] SET [Key] = '', [Value] = '', [IsAlert] = 0 WHERE [AuditDataId] = 0 AND [AuditEventId] = 0x1201 ELSE INSERT INTO [AuditData] ([AuditDataId], [AuditEventId], [Key], [Value], [IsAlert]) VALUES (0, 0x1201, '', '', 0)"]
[null,"Audit","ETHERNET_DLD_SUCCESS  ","Ethernet Download Success","CERT Download",null,null,"0x1202",0,null,null,null,null,"IF EXISTS(SELECT TOP 1 * FROM [AuditEvent] WHERE [AuditEventId] = 0x1202) UPDATE [AuditEvent] SET [Key] = 'Ethernet Download Success', [Value] = 'Ethernet Download Success', [IsAlert] = 0 WHERE [AuditEventId] = 0x1202 ELSE INSERT INTO [AuditEvent] ([AuditEventId], [Key], [Value], [IsAlert]) VALUES (0x1202, 'Ethernet Download Success', 'Ethernet Download Success', 0)","IF EXISTS(SELECT TOP 1 * FROM [AuditData] WHERE [AuditDataId] = 0 AND [AuditEventId] = 0x1202) UPDATE [AuditData] SET [Key] = 'CERT Download', [Value] = 'CERT Download', [IsAlert] = 0 WHERE [AuditDataId] = 0 AND [AuditEventId] = 0x1202 ELSE INSERT INTO [AuditData] ([AuditDataId], [AuditEventId], [Key], [Value], [IsAlert]) VALUES (0, 0x1202, 'CERT Download', 'CERT Download', 0)"]
[null,"Audit","ETHERNET_DLD_SUCCESS  ","Ethernet Download Success","FW Download",null,null,"0x1202",1,null,null,null,null,{"$f":"IF(LEFT(H650,2)=\"0x\",CONCATENATE(\"IF EXISTS(SELECT TOP 1 * FROM [AuditEvent] WHERE [AuditEventId] = \",H650,\") UPDATE [AuditEvent] SET [Key] = '\",TRIM(D650),\"', [Value] = '\",TRIM(D650),\"', [IsAlert] = \",IF(B650=\"Audit\",0,1),\" WHERE [AuditEventId] = \",H650,\" ELSE INSERT INTO [AuditEvent] ([AuditEventId], [Key], [Value], [IsAlert]) VALUES (\",H650,\", '\",TRIM(D650),\"', '\",TRIM(D650),\"', \",IF(B650=\"Audit\",0,1), \")\"),\"-- no value\")","v":"IF EXISTS(SELECT TOP 1 * FROM [AuditEvent] WHERE [AuditEventId] = 0x1202) UPDATE [AuditEvent] SET [Key] = 'Ethernet Download Success', [Value] = 'Ethernet Download Success', [IsAlert] = 0 WHERE [AuditEventId] = 0x1202 ELSE INSERT INTO [AuditEvent] ([AuditEventId], [Key], [Value], [IsAlert]) VALUES (0x1202, 'Ethernet Download Success', 'Ethernet Download Success', 0)"},"IF EXISTS(SELECT TOP 1 * FROM [AuditData] WHERE [AuditDataId] = 1 AND [AuditEventId] = 0x1202) UPDATE [AuditData] SET [Key] = 'FW Download', [Value] = 'FW Download', [IsAlert] = 0 WHERE [AuditDataId] = 1 AND [AuditEventId] = 0x1202 ELSE INSERT INTO [AuditData] ([AuditDataId], [AuditEventId], [Key], [Value], [IsAlert]) VALUES (1, 0x1202, 'FW Download', 'FW Download', 0)"]
[null,"Audit","ETHERNET_DLD_FAIL                 ","Ethernet Download Fail","CERT Download",null,null,"0x1203",0,null,null,null,null,{"$f":"IF(LEFT(H651,2)=\"0x\",CONCATENATE(\"IF EXISTS(SELECT TOP 1 * FROM [AuditEvent] WHERE [AuditEventId] = \",H651,\") UPDATE [AuditEvent] SET [Key] = '\",TRIM(D651),\"', [Value] = '\",TRIM(D651),\"', [IsAlert] = \",IF(B651=\"Audit\",0,1),\" WHERE [AuditEventId] = \",H651,\" ELSE INSERT INTO [AuditEvent] ([AuditEventId], [Key], [Value], [IsAlert]) VALUES (\",H651,\", '\",TRIM(D651),\"', '\",TRIM(D651),\"', \",IF(B651=\"Audit\",0,1), \")\"),\"-- no value\")","v":"IF EXISTS(SELECT TOP 1 * FROM [AuditEvent] WHERE [AuditEventId] = 0x1203) UPDATE [AuditEvent] SET [Key] = 'Ethernet Download Fail', [Value] = 'Ethernet Download Fail', [IsAlert] = 0 WHERE [AuditEventId] = 0x1203 ELSE INSERT INTO [AuditEvent] ([AuditEventId], [Key], [Value], [IsAlert]) VALUES (0x1203, 'Ethernet Download Fail', 'Ethernet Download Fail', 0)"},"IF EXISTS(SELECT TOP 1 * FROM [AuditData] WHERE [AuditDataId] = 0 AND [AuditEventId] = 0x1203) UPDATE [AuditData] SET [Key] = 'CERT Download', [Value] = 'CERT Download', [IsAlert] = 0 WHERE [AuditDataId] = 0 AND [AuditEventId] = 0x1203 ELSE INSERT INTO [AuditData] ([AuditDataId], [AuditEventId], [Key], [Value], [IsAlert]) VALUES (0, 0x1203, 'CERT Download', 'CERT Download', 0)"]
[null,"Audit","ETHERNET_DLD_FAIL                 ","Ethernet Download Fail","FW Download",1,null,"0x1203",1,null,null,null,null,{"$f":"IF(LEFT(H652,2)=\"0x\",CONCATENATE(\"IF EXISTS(SELECT TOP 1 * FROM [AuditEvent] WHERE [AuditEventId] = \",H652,\") UPDATE [AuditEvent] SET [Key] = '\",TRIM(D652),\"', [Value] = '\",TRIM(D652),\"', [IsAlert] = \",IF(B652=\"Audit\",0,1),\" WHERE [AuditEventId] = \",H652,\" ELSE INSERT INTO [AuditEvent] ([AuditEventId], [Key], [Value], [IsAlert]) VALUES (\",H652,\", '\",TRIM(D652),\"', '\",TRIM(D652),\"', \",IF(B652=\"Audit\",0,1), \")\"),\"-- no value\")","v":"IF EXISTS(SELECT TOP 1 * FROM [AuditEvent] WHERE [AuditEventId] = 0x1203) UPDATE [AuditEvent] SET [Key] = 'Ethernet Download Fail', [Value] = 'Ethernet Download Fail', [IsAlert] = 0 WHERE [AuditEventId] = 0x1203 ELSE INSERT INTO [AuditEvent] ([AuditEventId], [Key], [Value], [IsAlert]) VALUES (0x1203, 'Ethernet Download Fail', 'Ethernet Download Fail', 0)"},"IF EXISTS(SELECT TOP 1 * FROM [AuditData] WHERE [AuditDataId] = 1 AND [AuditEventId] = 0x1203) UPDATE [AuditData] SET [Key] = 'FW Download', [Value] = 'FW Download', [IsAlert] = 0 WHERE [AuditDataId] = 1 AND [AuditEventId] = 0x1203 ELSE INSERT INTO [AuditData] ([AuditDataId], [AuditEventId], [Key], [Value], [IsAlert]) VALUES (1, 0x1203, 'FW Download', 'FW Download', 0)"]
[null,"Audit","ETHERNET_WS_STATUS_EVENT","Ethernet WS Update Event","Host Disconnected",1,null,"0x1204",0,null,null,null,null,{"$f":"IF(LEFT(H653,2)=\"0x\",CONCATENATE(\"IF EXISTS(SELECT TOP 1 * FROM [AuditEvent] WHERE [AuditEventId] = \",H653,\") UPDATE [AuditEvent] SET [Key] = '\",TRIM(D653),\"', [Value] = '\",TRIM(D653),\"', [IsAlert] = \",IF(B653=\"Audit\",0,1),\" WHERE [AuditEventId] = \",H653,\" ELSE INSERT INTO [AuditEvent] ([AuditEventId], [Key], [Value], [IsAlert]) VALUES (\",H653,\", '\",TRIM(D653),\"', '\",TRIM(D653),\"', \",IF(B653=\"Audit\",0,1), \")\"),\"-- no value\")","v":"IF EXISTS(SELECT TOP 1 * FROM [AuditEvent] WHERE [AuditEventId] = 0x1204) UPDATE [AuditEvent] SET [Key] = 'Ethernet WS Update Event', [Value] = 'Ethernet WS Update Event', [IsAlert] = 0 WHERE [AuditEventId] = 0x1204 ELSE INSERT INTO [AuditEvent] ([AuditEventId], [Key], [Value], [IsAlert]) VALUES (0x1204, 'Ethernet WS Update Event', 'Ethernet WS Update Event', 0)"},"IF EXISTS(SELECT TOP 1 * FROM [AuditData] WHERE [AuditDataId] = 0 AND [AuditEventId] = 0x1204) UPDATE [AuditData] SET [Key] = 'Host Disconnected', [Value] = 'Host Disconnected', [IsAlert] = 0 WHERE [AuditDataId] = 0 AND [AuditEventId] = 0x1204 ELSE INSERT INTO [AuditData] ([AuditDataId], [AuditEventId], [Key], [Value], [IsAlert]) VALUES (0, 0x1204, 'Host Disconnected', 'Host Disconnected', 0)"]
[null,"Audit","ETHERNET_WS_STATUS_EVENT","Ethernet WS Update Event","Host Connected",1,null,"0x1204",1,null,null,null,null,{"$f":"IF(LEFT(H654,2)=\"0x\",CONCATENATE(\"IF EXISTS(SELECT TOP 1 * FROM [AuditEvent] WHERE [AuditEventId] = \",H654,\") UPDATE [AuditEvent] SET [Key] = '\",TRIM(D654),\"', [Value] = '\",TRIM(D654),\"', [IsAlert] = \",IF(B654=\"Audit\",0,1),\" WHERE [AuditEventId] = \",H654,\" ELSE INSERT INTO [AuditEvent] ([AuditEventId], [Key], [Value], [IsAlert]) VALUES (\",H654,\", '\",TRIM(D654),\"', '\",TRIM(D654),\"', \",IF(B654=\"Audit\",0,1), \")\"),\"-- no value\")","v":"IF EXISTS(SELECT TOP 1 * FROM [AuditEvent] WHERE [AuditEventId] = 0x1204) UPDATE [AuditEvent] SET [Key] = 'Ethernet WS Update Event', [Value] = 'Ethernet WS Update Event', [IsAlert] = 0 WHERE [AuditEventId] = 0x1204 ELSE INSERT INTO [AuditEvent] ([AuditEventId], [Key], [Value], [IsAlert]) VALUES (0x1204, 'Ethernet WS Update Event', 'Ethernet WS Update Event', 0)"},"IF EXISTS(SELECT TOP 1 * FROM [AuditData] WHERE [AuditDataId] = 1 AND [AuditEventId] = 0x1204) UPDATE [AuditData] SET [Key] = 'Host Connected', [Value] = 'Host Connected', [IsAlert] = 0 WHERE [AuditDataId] = 1 AND [AuditEventId] = 0x1204 ELSE INSERT INTO [AuditData] ([AuditDataId], [AuditEventId], [Key], [Value], [IsAlert]) VALUES (1, 0x1204, 'Host Connected', 'Host Connected', 0)"]
[null,"Audit","ETHERNET_WS_STATUS_EVENT","Ethernet WS Update Event","Basic Auth Req Fail",1,null,"0x1204",2,null,null,null,null,"IF EXISTS(SELECT TOP 1 * FROM [AuditEvent] WHERE [AuditEventId] = 0x1204) UPDATE [AuditEvent] SET [Key] = 'Ethernet WS Update Event', [Value] = 'Ethernet WS Update Event', [IsAlert] = 0 WHERE [AuditEventId] = 0x1204 ELSE INSERT INTO [AuditEvent] ([AuditEventId], [Key], [Value], [IsAlert]) VALUES (0x1204, 'Ethernet WS Update Event', 'Ethernet WS Update Event', 0)","IF EXISTS(SELECT TOP 1 * FROM [AuditData] WHERE [AuditDataId] = 2 AND [AuditEventId] = 0x1204) UPDATE [AuditData] SET [Key] = 'Basic Auth Req Fail', [Value] = 'Basic Auth Req Fail', [IsAlert] = 0 WHERE [AuditDataId] = 2 AND [AuditEventId] = 0x1204 ELSE INSERT INTO [AuditData] ([AuditDataId], [AuditEventId], [Key], [Value], [IsAlert]) VALUES (2, 0x1204, 'Basic Auth Req Fail', 'Basic Auth Req Fail', 0)"]
[null,"Audit","ETHERNET_WS_STATUS_EVENT","Ethernet WS Update Event","Protocol Upgrade Fail",1,null,"0x1204",3,null,null,null,null,"IF EXISTS(SELECT TOP 1 * FROM [AuditEvent] WHERE [AuditEventId] = 0x1204) UPDATE [AuditEvent] SET [Key] = 'Ethernet WS Update Event', [Value] = 'Ethernet WS Update Event', [IsAlert] = 0 WHERE [AuditEventId] = 0x1204 ELSE INSERT INTO [AuditEvent] ([AuditEventId], [Key], [Value], [IsAlert]) VALUES (0x1204, 'Ethernet WS Update Event', 'Ethernet WS Update Event', 0)","IF EXISTS(SELECT TOP 1 * FROM [AuditData] WHERE [AuditDataId] = 3 AND [AuditEventId] = 0x1204) UPDATE [AuditData] SET [Key] = 'Protocol Upgrade Fail', [Value] = 'Protocol Upgrade Fail', [IsAlert] = 0 WHERE [AuditDataId] = 3 AND [AuditEventId] = 0x1204 ELSE INSERT INTO [AuditData] ([AuditDataId], [AuditEventId], [Key], [Value], [IsAlert]) VALUES (3, 0x1204, 'Protocol Upgrade Fail', 'Protocol Upgrade Fail', 0)"]
[null,"Audit","ETHERNET_WS_CLOSE_EVENT","Ethernet WS Close","Protocol Error",1,null,"0x1205",0,null,null,null,null,"IF EXISTS(SELECT TOP 1 * FROM [AuditEvent] WHERE [AuditEventId] = 0x1205) UPDATE [AuditEvent] SET [Key] = 'Ethernet WS Close', [Value] = 'Ethernet WS Close', [IsAlert] = 0 WHERE [AuditEventId] = 0x1205 ELSE INSERT INTO [AuditEvent] ([AuditEventId], [Key], [Value], [IsAlert]) VALUES (0x1205, 'Ethernet WS Close', 'Ethernet WS Close', 0)","IF EXISTS(SELECT TOP 1 * FROM [AuditData] WHERE [AuditDataId] = 0 AND [AuditEventId] = 0x1205) UPDATE [AuditData] SET [Key] = 'Protocol Error', [Value] = 'Protocol Error', [IsAlert] = 0 WHERE [AuditDataId] = 0 AND [AuditEventId] = 0x1205 ELSE INSERT INTO [AuditData] ([AuditDataId], [AuditEventId], [Key], [Value], [IsAlert]) VALUES (0, 0x1205, 'Protocol Error', 'Protocol Error', 0)"]
[null,"Audit","ETHERNET_WS_CLOSE_EVENT","Ethernet WS Close","Unresponsive Host",1,null,"0x1205",1,null,null,null,null,"IF EXISTS(SELECT TOP 1 * FROM [AuditEvent] WHERE [AuditEventId] = 0x1205) UPDATE [AuditEvent] SET [Key] = 'Ethernet WS Close', [Value] = 'Ethernet WS Close', [IsAlert] = 0 WHERE [AuditEventId] = 0x1205 ELSE INSERT INTO [AuditEvent] ([AuditEventId], [Key], [Value], [IsAlert]) VALUES (0x1205, 'Ethernet WS Close', 'Ethernet WS Close', 0)","IF EXISTS(SELECT TOP 1 * FROM [AuditData] WHERE [AuditDataId] = 1 AND [AuditEventId] = 0x1205) UPDATE [AuditData] SET [Key] = 'Unresponsive Host', [Value] = 'Unresponsive Host', [IsAlert] = 0 WHERE [AuditDataId] = 1 AND [AuditEventId] = 0x1205 ELSE INSERT INTO [AuditData] ([AuditDataId], [AuditEventId], [Key], [Value], [IsAlert]) VALUES (1, 0x1205, 'Unresponsive Host', 'Unresponsive Host', 0)"]
[null,"Audit","ETHERNET_WS_CLOSE_EVENT","Ethernet WS Close","Host Requested",1,null,"0x1205",2,null,null,null,null,"IF EXISTS(SELECT TOP 1 * FROM [AuditEvent] WHERE [AuditEventId] = 0x1205) UPDATE [AuditEvent] SET [Key] = 'Ethernet WS Close', [Value] = 'Ethernet WS Close', [IsAlert] = 0 WHERE [AuditEventId] = 0x1205 ELSE INSERT INTO [AuditEvent] ([AuditEventId], [Key], [Value], [IsAlert]) VALUES (0x1205, 'Ethernet WS Close', 'Ethernet WS Close', 0)","IF EXISTS(SELECT TOP 1 * FROM [AuditData] WHERE [AuditDataId] = 2 AND [AuditEventId] = 0x1205) UPDATE [AuditData] SET [Key] = 'Host Requested', [Value] = 'Host Requested', [IsAlert] = 0 WHERE [AuditDataId] = 2 AND [AuditEventId] = 0x1205 ELSE INSERT INTO [AuditData] ([AuditDataId], [AuditEventId], [Key], [Value], [IsAlert]) VALUES (2, 0x1205, 'Host Requested', 'Host Requested', 0)"]
[null,"Audit","ETHERNET_WS_CA_AUTH_FAILURE_RTC_EVENT","Ethernet WS CA Authentication Failure","CA Certificate Authentication Failure due to bad RTC",null,null,"0x1206",0,null,null,null,null,"IF EXISTS(SELECT TOP 1 * FROM [AuditEvent] WHERE [AuditEventId] = 0x1206) UPDATE [AuditEvent] SET [Key] = 'Ethernet WS CA Authentication Failure', [Value] = 'Ethernet WS CA Authentication Failure', [IsAlert] = 0 WHERE [AuditEventId] = 0x1206 ELSE INSERT INTO [AuditEvent] ([AuditEventId], [Key], [Value], [IsAlert]) VALUES (0x1206, 'Ethernet WS CA Authentication Failure', 'Ethernet WS CA Authentication Failure', 0)","IF EXISTS(SELECT TOP 1 * FROM [AuditData] WHERE [AuditDataId] = 0 AND [AuditEventId] = 0x1206) UPDATE [AuditData] SET [Key] = 'CA Certificate Authentication Failure due to bad RTC', [Value] = 'CA Certificate Authentication Failure due to bad RTC', [IsAlert] = 0 WHERE [AuditDataId] = 0 AND [AuditEventId] = 0x1206 ELSE INSERT INTO [AuditData] ([AuditDataId], [AuditEventId], [Key], [Value], [IsAlert]) VALUES (0, 0x1206, 'CA Certificate Authentication Failure due to bad RTC', 'CA Certificate Authentication Failure due to bad RTC', 0)"]
[null,"Audit","ETHERNET_WS_CA_AUTH_FAILURE_RTC_EVENT","Ethernet WS CA Authentication Failure","Update RTC time via NTP attempt is failed",null,null,"0x1206",1,null,null,null,null,"IF EXISTS(SELECT TOP 1 * FROM [AuditEvent] WHERE [AuditEventId] = 0x1206) UPDATE [AuditEvent] SET [Key] = 'Ethernet WS CA Authentication Failure', [Value] = 'Ethernet WS CA Authentication Failure', [IsAlert] = 0 WHERE [AuditEventId] = 0x1206 ELSE INSERT INTO [AuditEvent] ([AuditEventId], [Key], [Value], [IsAlert]) VALUES (0x1206, 'Ethernet WS CA Authentication Failure', 'Ethernet WS CA Authentication Failure', 0)","IF EXISTS(SELECT TOP 1 * FROM [AuditData] WHERE [AuditDataId] = 1 AND [AuditEventId] = 0x1206) UPDATE [AuditData] SET [Key] = 'Update RTC time via NTP attempt is failed', [Value] = 'Update RTC time via NTP attempt is failed', [IsAlert] = 0 WHERE [AuditDataId] = 1 AND [AuditEventId] = 0x1206 ELSE INSERT INTO [AuditData] ([AuditDataId], [AuditEventId], [Key], [Value], [IsAlert]) VALUES (1, 0x1206, 'Update RTC time via NTP attempt is failed', 'Update RTC time via NTP attempt is failed', 0)"]
[null,"Audit","ETHERNET_WS_CA_AUTH_FAILURE_RTC_EVENT","Ethernet WS CA Authentication Failure","Update RTC time via backup NTP attempt is failed",null,null,"0x1206",2,null,null,null,null,"IF EXISTS(SELECT TOP 1 * FROM [AuditEvent] WHERE [AuditEventId] = 0x1206) UPDATE [AuditEvent] SET [Key] = 'Ethernet WS CA Authentication Failure', [Value] = 'Ethernet WS CA Authentication Failure', [IsAlert] = 0 WHERE [AuditEventId] = 0x1206 ELSE INSERT INTO [AuditEvent] ([AuditEventId], [Key], [Value], [IsAlert]) VALUES (0x1206, 'Ethernet WS CA Authentication Failure', 'Ethernet WS CA Authentication Failure', 0)","IF EXISTS(SELECT TOP 1 * FROM [AuditData] WHERE [AuditDataId] = 2 AND [AuditEventId] = 0x1206) UPDATE [AuditData] SET [Key] = 'Update RTC time via backup NTP attempt is failed', [Value] = 'Update RTC time via backup NTP attempt is failed', [IsAlert] = 0 WHERE [AuditDataId] = 2 AND [AuditEventId] = 0x1206 ELSE INSERT INTO [AuditData] ([AuditDataId], [AuditEventId], [Key], [Value], [IsAlert]) VALUES (2, 0x1206, 'Update RTC time via backup NTP attempt is failed', 'Update RTC time via backup NTP attempt is failed', 0)"]
[null,"Audit","ETHERNET_WS_CA_AUTH_FAILURE_RTC_EVENT","Ethernet WS CA Authentication Failure","Update RTC time via Latest Audit timestamp is failed",null,null,"0x1206",3,null,null,null,null,"IF EXISTS(SELECT TOP 1 * FROM [AuditEvent] WHERE [AuditEventId] = 0x1206) UPDATE [AuditEvent] SET [Key] = 'Ethernet WS CA Authentication Failure', [Value] = 'Ethernet WS CA Authentication Failure', [IsAlert] = 0 WHERE [AuditEventId] = 0x1206 ELSE INSERT INTO [AuditEvent] ([AuditEventId], [Key], [Value], [IsAlert]) VALUES (0x1206, 'Ethernet WS CA Authentication Failure', 'Ethernet WS CA Authentication Failure', 0)","IF EXISTS(SELECT TOP 1 * FROM [AuditData] WHERE [AuditDataId] = 3 AND [AuditEventId] = 0x1206) UPDATE [AuditData] SET [Key] = 'Update RTC time via Latest Audit timestamp is failed', [Value] = 'Update RTC time via Latest Audit timestamp is failed', [IsAlert] = 0 WHERE [AuditDataId] = 3 AND [AuditEventId] = 0x1206 ELSE INSERT INTO [AuditData] ([AuditDataId], [AuditEventId], [Key], [Value], [IsAlert]) VALUES (3, 0x1206, 'Update RTC time via Latest Audit timestamp is failed', 'Update RTC time via Latest Audit timestamp is failed', 0)"]
[null,"Audit","ETHERNET_WS_CA_AUTH_FAILURE_RTC_EVENT","Ethernet WS CA Authentication Failure","Update RTC time via CA cert valid from time attempt is failed",null,null,"0x1206",4,null,null,null,null,"IF EXISTS(SELECT TOP 1 * FROM [AuditEvent] WHERE [AuditEventId] = 0x1206) UPDATE [AuditEvent] SET [Key] = 'Ethernet WS CA Authentication Failure', [Value] = 'Ethernet WS CA Authentication Failure', [IsAlert] = 0 WHERE [AuditEventId] = 0x1206 ELSE INSERT INTO [AuditEvent] ([AuditEventId], [Key], [Value], [IsAlert]) VALUES (0x1206, 'Ethernet WS CA Authentication Failure', 'Ethernet WS CA Authentication Failure', 0)","IF EXISTS(SELECT TOP 1 * FROM [AuditData] WHERE [AuditDataId] = 4 AND [AuditEventId] = 0x1206) UPDATE [AuditData] SET [Key] = 'Update RTC time via CA cert valid from time attempt is failed', [Value] = 'Update RTC time via CA cert valid from time attempt is failed', [IsAlert] = 0 WHERE [AuditDataId] = 4 AND [AuditEventId] = 0x1206 ELSE INSERT INTO [AuditData] ([AuditDataId], [AuditEventId], [Key], [Value], [IsAlert]) VALUES (4, 0x1206, 'Update RTC time via CA cert valid from time attempt is failed', 'Update RTC time via CA cert valid from time attempt is failed', 0)"]
[null,null,null,null,null,null,null,null,null,null,null,null,null,"-- no value","-- no value"]
["Credential Not In DB Audits",null,null,null,null,null,null,null,null,null,null,null,null,"-- no value","-- no value"]
["Base Value",null,null,null,null,null,null,null,null,null,null,null,null,"-- no value","-- no value"]
[1300,"Audit","CRED_NOT_IN_DB_BIT_LENGTH","Credential Not In DB","Credential Length",null,null,"0x1300","XXXX","0 to 65535","Bit length of credential","26 bit credential",null,{"$f":"IF(LEFT(H668,2)=\"0x\",CONCATENATE(\"IF EXISTS(SELECT TOP 1 * FROM [AuditEvent] WHERE [AuditEventId] = \",H668,\") UPDATE [AuditEvent] SET [Key] = '\",TRIM(D668),\"', [Value] = '\",TRIM(D668),\"', [IsAlert] = \",IF(B668=\"Audit\",0,1),\" WHERE [AuditEventId] = \",H668,\" ELSE INSERT INTO [AuditEvent] ([AuditEventId], [Key], [Value], [IsAlert]) VALUES (\",H668,\", '\",TRIM(D668),\"', '\",TRIM(D668),\"', \",IF(B668=\"Audit\",0,1), \")\"),\"-- no value\")","v":"IF EXISTS(SELECT TOP 1 * FROM [AuditEvent] WHERE [AuditEventId] = 0x1300) UPDATE [AuditEvent] SET [Key] = 'Credential Not In DB', [Value] = 'Credential Not In DB', [IsAlert] = 0 WHERE [AuditEventId] = 0x1300 ELSE INSERT INTO [AuditEvent] ([AuditEventId], [Key], [Value], [IsAlert]) VALUES (0x1300, 'Credential Not In DB', 'Credential Not In DB', 0)"},{"$f":"IF(AND(LEFT(H668,2)=\"0x\",ISNUMBER(HEX2DEC(TRIM(I668))*1)),CONCATENATE(\"IF EXISTS(SELECT TOP 1 * FROM [AuditData] WHERE [AuditDataId] = \",HEX2DEC(I668),\" AND [AuditEventId] = \",H668,\") UPDATE [AuditData] SET [Key] = '\",E668,\"', [Value] = '\",E668,\"', [IsAlert] = 0 WHERE [AuditDataId] = \",HEX2DEC(I668),\" AND [AuditEventId] = \",H668,\" ELSE INSERT INTO [AuditData] ([AuditDataId], [AuditEventId], [Key], [Value], [IsAlert]) VALUES (\",HEX2DEC(I668),\", \",H668,\", '\",E668,\"', '\",E668,\"', 0)\"),\"-- no value\")","v":"-- no value"}]
[null,"Audit","CRED_NOT_IN_DB_BITS_15_TO_0","Credential Not In DB","Bits 15 to 0 of credential",null,null,"0x1301","XXXX","0 to 65535","Credential Data","Credential Data",null,{"$f":"IF(LEFT(H669,2)=\"0x\",CONCATENATE(\"IF EXISTS(SELECT TOP 1 * FROM [AuditEvent] WHERE [AuditEventId] = \",H669,\") UPDATE [AuditEvent] SET [Key] = '\",TRIM(D669),\"', [Value] = '\",TRIM(D669),\"', [IsAlert] = \",IF(B669=\"Audit\",0,1),\" WHERE [AuditEventId] = \",H669,\" ELSE INSERT INTO [AuditEvent] ([AuditEventId], [Key], [Value], [IsAlert]) VALUES (\",H669,\", '\",TRIM(D669),\"', '\",TRIM(D669),\"', \",IF(B669=\"Audit\",0,1), \")\"),\"-- no value\")","v":"IF EXISTS(SELECT TOP 1 * FROM [AuditEvent] WHERE [AuditEventId] = 0x1301) UPDATE [AuditEvent] SET [Key] = 'Credential Not In DB', [Value] = 'Credential Not In DB', [IsAlert] = 0 WHERE [AuditEventId] = 0x1301 ELSE INSERT INTO [AuditEvent] ([AuditEventId], [Key], [Value], [IsAlert]) VALUES (0x1301, 'Credential Not In DB', 'Credential Not In DB', 0)"},{"$f":"IF(AND(LEFT(H669,2)=\"0x\",ISNUMBER(HEX2DEC(TRIM(I669))*1)),CONCATENATE(\"IF EXISTS(SELECT TOP 1 * FROM [AuditData] WHERE [AuditDataId] = \",HEX2DEC(I669),\" AND [AuditEventId] = \",H669,\") UPDATE [AuditData] SET [Key] = '\",E669,\"', [Value] = '\",E669,\"', [IsAlert] = 0 WHERE [AuditDataId] = \",HEX2DEC(I669),\" AND [AuditEventId] = \",H669,\" ELSE INSERT INTO [AuditData] ([AuditDataId], [AuditEventId], [Key], [Value], [IsAlert]) VALUES (\",HEX2DEC(I669),\", \",H669,\", '\",E669,\"', '\",E669,\"', 0)\"),\"-- no value\")","v":"-- no value"}]
[null,"Audit","CRED_NOT_IN_DB_BITS_31_TO_16","Credential Not In DB","Bits 31 to 16 of credential",null,null,"0x1302","XXXX","0 to 65535","Credential Data","Credential Data",null,"IF EXISTS(SELECT TOP 1 * FROM [AuditEvent] WHERE [AuditEventId] = 0x1302) UPDATE [AuditEvent] SET [Key] = 'Credential Not In DB', [Value] = 'Credential Not In DB', [IsAlert] = 0 WHERE [AuditEventId] = 0x1302 ELSE INSERT INTO [AuditEvent] ([AuditEventId], [Key], [Value], [IsAlert]) VALUES (0x1302, 'Credential Not In DB', 'Credential Not In DB', 0)","-- no value"]
[null,"Audit","CRED_NOT_IN_DB_BITS_47_TO_32","Credential Not In DB","Bits 47 to 32 of credential",null,null,"0x1303","XXXX","0 to 65535","Credential Data","Credential Data",null,"IF EXISTS(SELECT TOP 1 * FROM [AuditEvent] WHERE [AuditEventId] = 0x1303) UPDATE [AuditEvent] SET [Key] = 'Credential Not In DB', [Value] = 'Credential Not In DB', [IsAlert] = 0 WHERE [AuditEventId] = 0x1303 ELSE INSERT INTO [AuditEvent] ([AuditEventId], [Key], [Value], [IsAlert]) VALUES (0x1303, 'Credential Not In DB', 'Credential Not In DB', 0)","-- no value"]
[null,"Audit","CRED_NOT_IN_DB_BITS_63_TO_48","Credential Not In DB","Bits 63 to 48 of credential",null,null,"0x1304","XXXX","0 to 65535","Credential Data","Credential Data",null,"IF EXISTS(SELECT TOP 1 * FROM [AuditEvent] WHERE [AuditEventId] = 0x1304) UPDATE [AuditEvent] SET [Key] = 'Credential Not In DB', [Value] = 'Credential Not In DB', [IsAlert] = 0 WHERE [AuditEventId] = 0x1304 ELSE INSERT INTO [AuditEvent] ([AuditEventId], [Key], [Value], [IsAlert]) VALUES (0x1304, 'Credential Not In DB', 'Credential Not In DB', 0)","-- no value"]
["No Tour Enrollment Audits",null,null,null,null,null,null,null,null,null,null,null,null,"-- no value","-- no value"]
["Base Value"]
[1400,"Audit","NO_TOUR_WRITE_SUCCESS","No Tour Enrollment Success","No Tour Data Write",null,null,"0x1400",0,null,null,null,null,{"$f":"IF(LEFT(H675,2)=\"0x\",CONCATENATE(\"IF EXISTS(SELECT TOP 1 * FROM [AuditEvent] WHERE [AuditEventId] = \",H675,\") UPDATE [AuditEvent] SET [Key] = '\",TRIM(D675),\"', [Value] = '\",TRIM(D675),\"', [IsAlert] = \",IF(B675=\"Audit\",0,1),\" WHERE [AuditEventId] = \",H675,\" ELSE INSERT INTO [AuditEvent] ([AuditEventId], [Key], [Value], [IsAlert]) VALUES (\",H675,\", '\",TRIM(D675),\"', '\",TRIM(D675),\"', \",IF(B675=\"Audit\",0,1), \")\"),\"-- no value\")","v":"IF EXISTS(SELECT TOP 1 * FROM [AuditEvent] WHERE [AuditEventId] = 0x1400) UPDATE [AuditEvent] SET [Key] = 'No Tour Enrollment Success', [Value] = 'No Tour Enrollment Success', [IsAlert] = 0 WHERE [AuditEventId] = 0x1400 ELSE INSERT INTO [AuditEvent] ([AuditEventId], [Key], [Value], [IsAlert]) VALUES (0x1400, 'No Tour Enrollment Success', 'No Tour Enrollment Success', 0)"},{"$f":"IF(AND(LEFT(H675,2)=\"0x\",ISNUMBER(HEX2DEC(TRIM(I675))*1)),CONCATENATE(\"IF EXISTS(SELECT TOP 1 * FROM [AuditData] WHERE [AuditDataId] = \",HEX2DEC(I675),\" AND [AuditEventId] = \",H675,\") UPDATE [AuditData] SET [Key] = '\",E675,\"', [Value] = '\",E675,\"', [IsAlert] = 0 WHERE [AuditDataId] = \",HEX2DEC(I675),\" AND [AuditEventId] = \",H675,\" ELSE INSERT INTO [AuditData] ([AuditDataId], [AuditEventId], [Key], [Value], [IsAlert]) VALUES (\",HEX2DEC(I675),\", \",H675,\", '\",E675,\"', '\",E675,\"', 0)\"),\"-- no value\")","v":"IF EXISTS(SELECT TOP 1 * FROM [AuditData] WHERE [AuditDataId] = 0 AND [AuditEventId] = 0x1400) UPDATE [AuditData] SET [Key] = 'No Tour Data Write', [Value] = 'No Tour Data Write', [IsAlert] = 0 WHERE [AuditDataId] = 0 AND [AuditEventId] = 0x1400 ELSE INSERT INTO [AuditData] ([AuditDataId], [AuditEventId], [Key], [Value], [IsAlert]) VALUES (0, 0x1400, 'No Tour Data Write', 'No Tour Data Write', 0)"}]
[null,"Audit","NO_TOUR_WRITE_SUCCESS","No Tour Enrollment Success","Data Changes Not Needed",null,null,"0x1400",1,null,null,null,null,{"$f":"IF(LEFT(H676,2)=\"0x\",CONCATENATE(\"IF EXISTS(SELECT TOP 1 * FROM [AuditEvent] WHERE [AuditEventId] = \",H676,\") UPDATE [AuditEvent] SET [Key] = '\",TRIM(D676),\"', [Value] = '\",TRIM(D676),\"', [IsAlert] = \",IF(B676=\"Audit\",0,1),\" WHERE [AuditEventId] = \",H676,\" ELSE INSERT INTO [AuditEvent] ([AuditEventId], [Key], [Value], [IsAlert]) VALUES (\",H676,\", '\",TRIM(D676),\"', '\",TRIM(D676),\"', \",IF(B676=\"Audit\",0,1), \")\"),\"-- no value\")","v":"IF EXISTS(SELECT TOP 1 * FROM [AuditEvent] WHERE [AuditEventId] = 0x1400) UPDATE [AuditEvent] SET [Key] = 'No Tour Enrollment Success', [Value] = 'No Tour Enrollment Success', [IsAlert] = 0 WHERE [AuditEventId] = 0x1400 ELSE INSERT INTO [AuditEvent] ([AuditEventId], [Key], [Value], [IsAlert]) VALUES (0x1400, 'No Tour Enrollment Success', 'No Tour Enrollment Success', 0)"},{"$f":"IF(AND(LEFT(H676,2)=\"0x\",ISNUMBER(HEX2DEC(TRIM(I676))*1)),CONCATENATE(\"IF EXISTS(SELECT TOP 1 * FROM [AuditData] WHERE [AuditDataId] = \",HEX2DEC(I676),\" AND [AuditEventId] = \",H676,\") UPDATE [AuditData] SET [Key] = '\",E676,\"', [Value] = '\",E676,\"', [IsAlert] = 0 WHERE [AuditDataId] = \",HEX2DEC(I676),\" AND [AuditEventId] = \",H676,\" ELSE INSERT INTO [AuditData] ([AuditDataId], [AuditEventId], [Key], [Value], [IsAlert]) VALUES (\",HEX2DEC(I676),\", \",H676,\", '\",E676,\"', '\",E676,\"', 0)\"),\"-- no value\")","v":"IF EXISTS(SELECT TOP 1 * FROM [AuditData] WHERE [AuditDataId] = 1 AND [AuditEventId] = 0x1400) UPDATE [AuditData] SET [Key] = 'Data Changes Not Needed', [Value] = 'Data Changes Not Needed', [IsAlert] = 0 WHERE [AuditDataId] = 1 AND [AuditEventId] = 0x1400 ELSE INSERT INTO [AuditData] ([AuditDataId], [AuditEventId], [Key], [Value], [IsAlert]) VALUES (1, 0x1400, 'Data Changes Not Needed', 'Data Changes Not Needed', 0)"}]
[null,"Audit","NO_TOUR_WRITE_FAILURE","No Tour Enrollment Fail","Authentication Error (wrong credential key)",null,null,"0x1401",0,null,null,null,null,"IF EXISTS(SELECT TOP 1 * FROM [AuditEvent] WHERE [AuditEventId] = 0x1401) UPDATE [AuditEvent] SET [Key] = 'No Tour Enrollment Fail', [Value] = 'No Tour Enrollment Fail', [IsAlert] = 0 WHERE [AuditEventId] = 0x1401 ELSE INSERT INTO [AuditEvent] ([AuditEventId], [Key], [Value], [IsAlert]) VALUES (0x1401, 'No Tour Enrollment Fail', 'No Tour Enrollment Fail', 0)","IF EXISTS(SELECT TOP 1 * FROM [AuditData] WHERE [AuditDataId] = 0 AND [AuditEventId] = 0x1401) UPDATE [AuditData] SET [Key] = 'Authentication Error (wrong credential key)', [Value] = 'Authentication Error (wrong credential key)', [IsAlert] = 0 WHERE [AuditDataId] = 0 AND [AuditEventId] = 0x1401 ELSE INSERT INTO [AuditData] ([AuditDataId], [AuditEventId], [Key], [Value], [IsAlert]) VALUES (0, 0x1401, 'Authentication Error (wrong credential key)', 'Authentication Error (wrong credential key)', 0)"]
[null,"Audit","NO_TOUR_WRITE_FAILURE","No Tour Enrollment Fail","Card Format Not Supported (Prox)",null,null,"0x1401",1,null,null,null,null,{"$f":"IF(LEFT(H678,2)=\"0x\",CONCATENATE(\"IF EXISTS(SELECT TOP 1 * FROM [AuditEvent] WHERE [AuditEventId] = \",H678,\") UPDATE [AuditEvent] SET [Key] = '\",TRIM(D678),\"', [Value] = '\",TRIM(D678),\"', [IsAlert] = \",IF(B678=\"Audit\",0,1),\" WHERE [AuditEventId] = \",H678,\" ELSE INSERT INTO [AuditEvent] ([AuditEventId], [Key], [Value], [IsAlert]) VALUES (\",H678,\", '\",TRIM(D678),\"', '\",TRIM(D678),\"', \",IF(B678=\"Audit\",0,1), \")\"),\"-- no value\")","v":"IF EXISTS(SELECT TOP 1 * FROM [AuditEvent] WHERE [AuditEventId] = 0x1401) UPDATE [AuditEvent] SET [Key] = 'No Tour Enrollment Fail', [Value] = 'No Tour Enrollment Fail', [IsAlert] = 0 WHERE [AuditEventId] = 0x1401 ELSE INSERT INTO [AuditEvent] ([AuditEventId], [Key], [Value], [IsAlert]) VALUES (0x1401, 'No Tour Enrollment Fail', 'No Tour Enrollment Fail', 0)"},{"$f":"IF(AND(LEFT(H678,2)=\"0x\",ISNUMBER(HEX2DEC(TRIM(I678))*1)),CONCATENATE(\"IF EXISTS(SELECT TOP 1 * FROM [AuditData] WHERE [AuditDataId] = \",HEX2DEC(I678),\" AND [AuditEventId] = \",H678,\") UPDATE [AuditData] SET [Key] = '\",E678,\"', [Value] = '\",E678,\"', [IsAlert] = 0 WHERE [AuditDataId] = \",HEX2DEC(I678),\" AND [AuditEventId] = \",H678,\" ELSE INSERT INTO [AuditData] ([AuditDataId], [AuditEventId], [Key], [Value], [IsAlert]) VALUES (\",HEX2DEC(I678),\", \",H678,\", '\",E678,\"', '\",E678,\"', 0)\"),\"-- no value\")","v":"IF EXISTS(SELECT TOP 1 * FROM [AuditData] WHERE [AuditDataId] = 1 AND [AuditEventId] = 0x1401) UPDATE [AuditData] SET [Key] = 'Card Format Not Supported (Prox)', [Value] = 'Card Format Not Supported (Prox)', [IsAlert] = 0 WHERE [AuditDataId] = 1 AND [AuditEventId] = 0x1401 ELSE INSERT INTO [AuditData] ([AuditDataId], [AuditEventId], [Key], [Value], [IsAlert]) VALUES (1, 0x1401, 'Card Format Not Supported (Prox)', 'Card Format Not Supported (Prox)', 0)"}]
[null,"Audit","NO_TOUR_WRITE_FAILURE","No Tour Enrollment Fail","Write Error (corrupted sectors)",null,null,"0x1401",2,null,null,null,null,"IF EXISTS(SELECT TOP 1 * FROM [AuditEvent] WHERE [AuditEventId] = 0x1401) UPDATE [AuditEvent] SET [Key] = 'No Tour Enrollment Fail', [Value] = 'No Tour Enrollment Fail', [IsAlert] = 0 WHERE [AuditEventId] = 0x1401 ELSE INSERT INTO [AuditEvent] ([AuditEventId], [Key], [Value], [IsAlert]) VALUES (0x1401, 'No Tour Enrollment Fail', 'No Tour Enrollment Fail', 0)","IF EXISTS(SELECT TOP 1 * FROM [AuditData] WHERE [AuditDataId] = 2 AND [AuditEventId] = 0x1401) UPDATE [AuditData] SET [Key] = 'Write Error (corrupted sectors)', [Value] = 'Write Error (corrupted sectors)', [IsAlert] = 0 WHERE [AuditDataId] = 2 AND [AuditEventId] = 0x1401 ELSE INSERT INTO [AuditData] ([AuditDataId], [AuditEventId], [Key], [Value], [IsAlert]) VALUES (2, 0x1401, 'Write Error (corrupted sectors)', 'Write Error (corrupted sectors)', 0)"]
[null,"Audit","NO_TOUR_WRITE_FAILURE","No Tour Enrollment Fail","Card Removed Error",null,null,"0x1401",3,null,null,null,null,{"$f":"IF(LEFT(H680,2)=\"0x\",CONCATENATE(\"IF EXISTS(SELECT TOP 1 * FROM [AuditEvent] WHERE [AuditEventId] = \",H680,\") UPDATE [AuditEvent] SET [Key] = '\",TRIM(D680),\"', [Value] = '\",TRIM(D680),\"', [IsAlert] = \",IF(B680=\"Audit\",0,1),\" WHERE [AuditEventId] = \",H680,\" ELSE INSERT INTO [AuditEvent] ([AuditEventId], [Key], [Value], [IsAlert]) VALUES (\",H680,\", '\",TRIM(D680),\"', '\",TRIM(D680),\"', \",IF(B680=\"Audit\",0,1), \")\"),\"-- no value\")","v":"IF EXISTS(SELECT TOP 1 * FROM [AuditEvent] WHERE [AuditEventId] = 0x1401) UPDATE [AuditEvent] SET [Key] = 'No Tour Enrollment Fail', [Value] = 'No Tour Enrollment Fail', [IsAlert] = 0 WHERE [AuditEventId] = 0x1401 ELSE INSERT INTO [AuditEvent] ([AuditEventId], [Key], [Value], [IsAlert]) VALUES (0x1401, 'No Tour Enrollment Fail', 'No Tour Enrollment Fail', 0)"},{"$f":"IF(AND(LEFT(H680,2)=\"0x\",ISNUMBER(HEX2DEC(TRIM(I680))*1)),CONCATENATE(\"IF EXISTS(SELECT TOP 1 * FROM [AuditData] WHERE [AuditDataId] = \",HEX2DEC(I680),\" AND [AuditEventId] = \",H680,\") UPDATE [AuditData] SET [Key] = '\",E680,\"', [Value] = '\",E680,\"', [IsAlert] = 0 WHERE [AuditDataId] = \",HEX2DEC(I680),\" AND [AuditEventId] = \",H680,\" ELSE INSERT INTO [AuditData] ([AuditDataId], [AuditEventId], [Key], [Value], [IsAlert]) VALUES (\",HEX2DEC(I680),\", \",H680,\", '\",E680,\"', '\",E680,\"', 0)\"),\"-- no value\")","v":"IF EXISTS(SELECT TOP 1 * FROM [AuditData] WHERE [AuditDataId] = 3 AND [AuditEventId] = 0x1401) UPDATE [AuditData] SET [Key] = 'Card Removed Error', [Value] = 'Card Removed Error', [IsAlert] = 0 WHERE [AuditDataId] = 3 AND [AuditEventId] = 0x1401 ELSE INSERT INTO [AuditData] ([AuditDataId], [AuditEventId], [Key], [Value], [IsAlert]) VALUES (3, 0x1401, 'Card Removed Error', 'Card Removed Error', 0)"}]
[null,"Audit","NO_TOUR_WRITE_FAILURE","No Tour Enrollment Fail","Unhandled Error",null,null,"0x1401",4,null,null,null,null,"IF EXISTS(SELECT TOP 1 * FROM [AuditEvent] WHERE [AuditEventId] = 0x1401) UPDATE [AuditEvent] SET [Key] = 'No Tour Enrollment Fail', [Value] = 'No Tour Enrollment Fail', [IsAlert] = 0 WHERE [AuditEventId] = 0x1401 ELSE INSERT INTO [AuditEvent] ([AuditEventId], [Key], [Value], [IsAlert]) VALUES (0x1401, 'No Tour Enrollment Fail', 'No Tour Enrollment Fail', 0)","IF EXISTS(SELECT TOP 1 * FROM [AuditData] WHERE [AuditDataId] = 4 AND [AuditEventId] = 0x1401) UPDATE [AuditData] SET [Key] = 'Unhandled Error', [Value] = 'Unhandled Error', [IsAlert] = 0 WHERE [AuditDataId] = 4 AND [AuditEventId] = 0x1401 ELSE INSERT INTO [AuditData] ([AuditDataId], [AuditEventId], [Key], [Value], [IsAlert]) VALUES (4, 0x1401, 'Unhandled Error', 'Unhandled Error', 0)"]
[null,"Audit","NO_TOUR_WRITE_FAILURE","No Tour Enrollment Fail","Wrong Card Presented",null,null,"0x1401",5,null,null,null,null,{"$f":"IF(LEFT(H682,2)=\"0x\",CONCATENATE(\"IF EXISTS(SELECT TOP 1 * FROM [AuditEvent] WHERE [AuditEventId] = \",H682,\") UPDATE [AuditEvent] SET [Key] = '\",TRIM(D682),\"', [Value] = '\",TRIM(D682),\"', [IsAlert] = \",IF(B682=\"Audit\",0,1),\" WHERE [AuditEventId] = \",H682,\" ELSE INSERT INTO [AuditEvent] ([AuditEventId], [Key], [Value], [IsAlert]) VALUES (\",H682,\", '\",TRIM(D682),\"', '\",TRIM(D682),\"', \",IF(B682=\"Audit\",0,1), \")\"),\"-- no value\")","v":"IF EXISTS(SELECT TOP 1 * FROM [AuditEvent] WHERE [AuditEventId] = 0x1401) UPDATE [AuditEvent] SET [Key] = 'No Tour Enrollment Fail', [Value] = 'No Tour Enrollment Fail', [IsAlert] = 0 WHERE [AuditEventId] = 0x1401 ELSE INSERT INTO [AuditEvent] ([AuditEventId], [Key], [Value], [IsAlert]) VALUES (0x1401, 'No Tour Enrollment Fail', 'No Tour Enrollment Fail', 0)"},{"$f":"IF(AND(LEFT(H682,2)=\"0x\",ISNUMBER(HEX2DEC(TRIM(I682))*1)),CONCATENATE(\"IF EXISTS(SELECT TOP 1 * FROM [AuditData] WHERE [AuditDataId] = \",HEX2DEC(I682),\" AND [AuditEventId] = \",H682,\") UPDATE [AuditData] SET [Key] = '\",E682,\"', [Value] = '\",E682,\"', [IsAlert] = 0 WHERE [AuditDataId] = \",HEX2DEC(I682),\" AND [AuditEventId] = \",H682,\" ELSE INSERT INTO [AuditData] ([AuditDataId], [AuditEventId], [Key], [Value], [IsAlert]) VALUES (\",HEX2DEC(I682),\", \",H682,\", '\",E682,\"', '\",E682,\"', 0)\"),\"-- no value\")","v":"IF EXISTS(SELECT TOP 1 * FROM [AuditData] WHERE [AuditDataId] = 5 AND [AuditEventId] = 0x1401) UPDATE [AuditData] SET [Key] = 'Wrong Card Presented', [Value] = 'Wrong Card Presented', [IsAlert] = 0 WHERE [AuditDataId] = 5 AND [AuditEventId] = 0x1401 ELSE INSERT INTO [AuditData] ([AuditDataId], [AuditEventId], [Key], [Value], [IsAlert]) VALUES (5, 0x1401, 'Wrong Card Presented', 'Wrong Card Presented', 0)"}]
[null,"Audit","NO_TOUR_NOT_PRESENTED_TIMEOUT","No Tour Timeout","Card not presented in time",null,null,"0x1402",0,null,null,null,null,{"$f":"IF(LEFT(H683,2)=\"0x\",CONCATENATE(\"IF EXISTS(SELECT TOP 1 * FROM [AuditEvent] WHERE [AuditEventId] = \",H683,\") UPDATE [AuditEvent] SET [Key] = '\",TRIM(D683),\"', [Value] = '\",TRIM(D683),\"', [IsAlert] = \",IF(B683=\"Audit\",0,1),\" WHERE [AuditEventId] = \",H683,\" ELSE INSERT INTO [AuditEvent] ([AuditEventId], [Key], [Value], [IsAlert]) VALUES (\",H683,\", '\",TRIM(D683),\"', '\",TRIM(D683),\"', \",IF(B683=\"Audit\",0,1), \")\"),\"-- no value\")","v":"IF EXISTS(SELECT TOP 1 * FROM [AuditEvent] WHERE [AuditEventId] = 0x1402) UPDATE [AuditEvent] SET [Key] = 'No Tour Timeout', [Value] = 'No Tour Timeout', [IsAlert] = 0 WHERE [AuditEventId] = 0x1402 ELSE INSERT INTO [AuditEvent] ([AuditEventId], [Key], [Value], [IsAlert]) VALUES (0x1402, 'No Tour Timeout', 'No Tour Timeout', 0)"},{"$f":"IF(AND(LEFT(H683,2)=\"0x\",ISNUMBER(HEX2DEC(TRIM(I683))*1)),CONCATENATE(\"IF EXISTS(SELECT TOP 1 * FROM [AuditData] WHERE [AuditDataId] = \",HEX2DEC(I683),\" AND [AuditEventId] = \",H683,\") UPDATE [AuditData] SET [Key] = '\",E683,\"', [Value] = '\",E683,\"', [IsAlert] = 0 WHERE [AuditDataId] = \",HEX2DEC(I683),\" AND [AuditEventId] = \",H683,\" ELSE INSERT INTO [AuditData] ([AuditDataId], [AuditEventId], [Key], [Value], [IsAlert]) VALUES (\",HEX2DEC(I683),\", \",H683,\", '\",E683,\"', '\",E683,\"', 0)\"),\"-- no value\")","v":"IF EXISTS(SELECT TOP 1 * FROM [AuditData] WHERE [AuditDataId] = 0 AND [AuditEventId] = 0x1402) UPDATE [AuditData] SET [Key] = 'Card not presented in time', [Value] = 'Card not presented in time', [IsAlert] = 0 WHERE [AuditDataId] = 0 AND [AuditEventId] = 0x1402 ELSE INSERT INTO [AuditData] ([AuditDataId], [AuditEventId], [Key], [Value], [IsAlert]) VALUES (0, 0x1402, 'Card not presented in time', 'Card not presented in time', 0)"}]
["Unknown Audit","Audit","Unknown Audit","Unknown Audit","EEEE DDDD",{"$f":"LEN(D684)","v":13},{"$f":"LEN(E684)","v":9},"0xEEEE","DDDD","Where EEEE = Event value and DDDD = event data.",null,null,null,"IF EXISTS(SELECT TOP 1 * FROM [AuditEvent] WHERE [AuditEventId] = 0xEEEE) UPDATE [AuditEvent] SET [Key] = 'Unknown Audit', [Value] = 'Unknown Audit', [IsAlert] = 0 WHERE [AuditEventId] = 0xEEEE ELSE INSERT INTO [AuditEvent] ([AuditEventId], [Key], [Value], [IsAlert]) VALUES (0xEEEE, 'Unknown Audit', 'Unknown Audit', 0)","IF EXISTS(SELECT TOP 1 * FROM [AuditData] WHERE [AuditDataId] = 56797 AND [AuditEventId] = 0xEEEE) UPDATE [AuditData] SET [Key] = 'EEEE DDDD', [Value] = 'EEEE DDDD', [IsAlert] = 0 WHERE [AuditDataId] = 56797 AND [AuditEventId] = 0xEEEE ELSE INSERT INTO [AuditData] ([AuditDataId], [AuditEventId], [Key], [Value], [IsAlert]) VALUES (56797, 0xEEEE, 'EEEE DDDD', 'EEEE DDDD', 0)"]
["Any Unknown Value"]

{"sheet":"Audit Update Process","index":4,"n_rows":3,"n_cols":2,"rows_kept":3,"cut":false,"hidden":false,"merged":[]}
[1,"Edit entries on DbmAuditEvents for review with CCB"]
[2,"Edit entries on DbmAuditData List to match DbmAuditEvents getting buy in from Product management for exact SW Heading and SW Text values for the changes."]
[null,"This sheet and the SQL entry columns are used by the Engage SW team to import Audit/Alert text and data."]